{"text_format":"1","workbook":"xlsx","n_sheets":13,"sheets":["Legend","DT","Data","Transformation","Rating Bundle - SOJ","Driver","Rating Bundle - SOO","Rating Bundle - State","Rating Bundle - SOJ - NWQ","Rating Bundle - NWQ - State","Traditional Aggregate (TA)","Diarys and Future Claims","TA-Regional Office"],"not_rendered":{"charts":0,"images":1,"macros":0,"external_links":1,"defined_names":65,"comments":1,"pivot_tables":0},"unopened":[],"bounds":{"document_bytes":16777216,"sheet_cells":100000,"rows_first":2000,"rows_last":500,"rows_between":2000,"halvings":0,"cell_chars":16384,"cell_head_chars":4096},"cells_cut":0,"cells_raw":0,"read":"whole","date_system":"1900"}

{"sheet":"Legend","index":0,"n_rows":36,"n_cols":5,"rows_kept":36,"cut":false,"hidden":true,"merged":[[7,5,7,6],[31,1,32,1],[31,2,32,2],[33,1,34,1],[33,2,34,2],[35,1,36,1],[35,2,36,2],[1,4,12,4],[27,1,28,1],[27,2,28,2],[29,1,30,1],[29,2,30,2],[15,4,22,4]]}
[null,"METRIC","DEFINITION","Line","COMMENT"]
[null,"010 Series","Initial entitlement for service-connected disability (=>8 issues)","Comp","Rating Bundle: Claims for disability compensation, dependency and indemnity compensation, and Veterans’ pension benefits, including both original and supplemental claims. Rating Bundle claims normally require a rating decision during processing.  The Rating Bundle Group is made up of 8 series and 1 group of End Products, plus 5 Agent Orange End Products, which are used to define VA Priority goals for Accuracy and reduction of claims over 125 days old"]
[null,"110 Series","Initial entitlement for service-connected disability (<=7 issues)","Comp"]
[null,"020 Series","Increased evaluation and/or additional claimed conditions","Comp"]
[null,"140 Series","Initial claims from surviving spouses, children or parents","Comp"]
[null,"180 Series","Initial entitlement for Pension - Veteran ","Pension"]
[null,"120 Series","Increased entitlement and/or reconsideration for Pension","Pension"]
[null,"310 Group","Future examination for disabilities (excludes EP 314)","Comp"]
[null,"320 Series","Increased entitlement due to hospitalization or surgery","Comp"]
[null,"EP 405","Reopened or new Agent Orange claims between 9/01/10 and 10/24/2011","Comp"]
[null,"EP 409","Agent Orange claims where an interim decision was provided; No longer used as of 10/24/2011","Comp"]
[null,"EP 681","Used to control claims under the Nehmer Agent Orange stipulation","Comp"]
[null,"EP 687","Previously used for Nehmer Agent Orange presumptive issues","Comp"]
[null,"040 Series","Decision Review Request - AMA Supplemental Claims","Comp"]
[null,"EP 688","NDAA Agent Orange Nehmer Reviews (3 new authorized disabilities)","Comp"]
[null,"EP 335","Blue Water Navy Agent Orange (effective 1/1/2010)","Comp","Not-Rating: Claims for disability compensation, dependency and indemnity compensation, and Veterans’ pension benefits, which can but normally do not require a rating decision (i.e. claim to add dependent to award)."]
[]
[]
[null,"ADP","Average Days Pending, or total number of days pending divided by total number of claims pending"]
[null,"ADC","Average Days to Complete or total number of days to complete divided by total number of claims completed"]
[]
[null,"MTD","Month to Date. Captures claim activity from the first day of the reporting month through the report date"]
[null,"FYTD","Fiscal Year to Date. Captures claim activity from the first day of the current fiscal year through the report date"]
[]
[null,"SOJ","Station of Jurisdiction, or the Regional Office assigned to work the claim"]
[null,"SOO","Station of Origin, or the Regional Office with geographic oversight of the claim"]
[]
[null,"Pending Development","Claims that are awaiting development initiation, which may involve gathering supporting evidence, medical exams, and military documentation."]
[]
[null,"Pending Evidence","Claims that are in the process of gathering supporting evidence and possibly medical exams."]
[]
[null,"Pending Decision","Claims that are awaiting an evidence review and decision by a rating specialist"]
[]
[null,"Pending Award","Claims that are awaiting a first-level review of the evidence gathered and the decision."]
[]
[null,"Pending Authorization","Claims that are awaiting a final review of all aspects of the claim, which results in a notification to the claimant on the outcome of their claim."]

{"sheet":"DT","index":1,"n_rows":2,"n_cols":1,"rows_kept":2,"cut":false,"hidden":true,"merged":[]}
["ST_DATE"]
["2023-08-05"]

{"sheet":"Data","index":2,"n_rows":2229,"n_cols":16,"rows_kept":2229,"cut":false,"hidden":true,"merged":[]}
["MT","CAT","LOC","EP","INV","BL","ADP","PROD_MTD","PROD_FYTD","ADCM","ADCF","DEV","EVD","DEC","AWD","AUT"]
["1","2000","-1","-1",26675,5831,91.21]
["1","2000","100","-1",195615,24395,69.72]
["1","2000","301","-1",1116,98,64.349999999999994]
["1","2000","304","-1",653,77,66.16]
["1","2000","306","-1",1835,185,65.44]
["1","2000","307","-1",1607,137,62.99]
["1","2000","308","-1",684,68,62.55]
["1","2000","309","-1",1057,123,69.83]
["1","2000","310","-1",4329,570,67.14]
["1","2000","311","-1",1996,231,62.68]
["1","2000","313","-1",2875,341,67.19]
["1","2000","314","-1",7034,782,67.13]
["1","2000","315","-1",961,138,72.94]
["1","2000","316","-1",7060,806,68.42]
["1","2000","317","-1",10821,1072,65.81]
["1","2000","318","-1",9038,968,67.349999999999994]
["1","2000","319","-1",5203,409,57.32]
["1","2000","320","-1",4449,627,73]
["1","2000","321","-1",2281,220,63.19]
["1","2000","322","-1",3379,359,65.2]
["1","2000","323","-1",1604,179,67.069999999999993]
["1","2000","325","-1",4256,583,70.83]
["1","2000","326","-1",4941,694,65.91]
["1","2000","327","-1",3653,388,66.13]
["1","2000","328","-1",2883,309,67.39]
["1","2000","329","-1",4135,464,67.98]
["1","2000","330","-1",6015,797,68.05]
["1","2000","331","-1",2645,301,67.33]
["1","2000","333","-1",1055,139,69.819999999999993]
["1","2000","334","-1",2051,137,49.38]
["1","2000","335","-1",5477,781,69.489999999999995]
["1","2000","339","-1",3230,282,61.94]
["1","2000","340","-1",1073,95,61.8]
["1","2000","341","-1",4120,370,57.44]
["1","2000","343","-1",3276,309,63.34]
["1","2000","344","-1",3696,329,63.8]
["1","2000","345","-1",2833,310,66.48]
["1","2000","346","-1",4510,469,67.75]
["1","2000","347","-1",808,123,72.38]
["1","2000","348","-1",1482,117,61.18]
["1","2000","349","-1",8994,853,63.61]
["1","2000","350","-1",1792,219,66.400000000000006]
["1","2000","351","-1",3316,394,71.69]
["1","2000","354","-1",1549,147,63.98]
["1","2000","355","-1",958,94,69.48]
["1","2000","358","-1",324,45,79.64]
["1","2000","362","-1",8533,930,67.819999999999993]
["1","2000","372","-1",666,164,109.89]
["1","2000","373","-1",443,48,67.47]
["1","2000","376","-1",14,2,130.36000000000001]
["1","2000","377","-1",6071,677,68.66]
["1","2000","402","-1",709,71,64.61]
["1","2000","405","-1",168,18,62.89]
["1","2000","436","-1",562,56,65.16]
["1","2000","437","-1",453,61,73.47]
["1","2000","438","-1",407,33,61.3]
["1","2000","442","-1",282,31,68.48]
["1","2000","452","-1",1257,126,66.38]
["1","2000","459","-1",1253,106,63.34]
["1","2000","460","-1",392,38,66.38]
["1","2000","463","-1",676,64,66.709999999999994]
["1","3000","-1","-1",3348,1329,106.08]
["1","3000","100","-1",6946,3189,117.53]
["1","3000","310","-1",915,555,140.30000000000001]
["1","3000","330","-1",1262,647,126.55]
["1","3000","335","-1",1421,658,121.83]
["1","2000","35","-1",26675,5831,91.21]
["1","2000","384","-1",35617,3823,65.75]
["1","2000","393","-1",58233,6261,66.430000000000007]
["1","2000","394","-1",43419,5319,67.69]
["1","2000","395","-1",31671,3161,64.900000000000006]
["2","2100","-1","-1",139919,52747]
["2","2100","100","-1",909189,260503]
["2","2100","301","-1",5892,1670]
["2","2100","304","-1",3579,892]
["2","2100","306","-1",10611,3056]
["2","2100","307","-1",7800,2158]
["2","2100","308","-1",3990,1125]
["2","2100","309","-1",6476,1756]
["2","2100","310","-1",17272,5055]
["2","2100","311","-1",12923,4070]
["2","2100","313","-1",14437,3697]
["2","2100","314","-1",31972,8214]
["2","2100","315","-1",5269,1385]
["2","2100","316","-1",38099,9969]
["2","2100","317","-1",62771,15711]
["2","2100","318","-1",35984,9223]
["2","2100","319","-1",19237,5066]
["2","2100","320","-1",19028,4935]
["2","2100","321","-1",14463,4012]
["2","2100","322","-1",17680,4668]
["2","2100","323","-1",10292,2939]
["2","2100","325","-1",20539,5631]
["2","2100","326","-1",13011,3500]
["2","2100","327","-1",10448,3014]
["2","2100","328","-1",17296,4881]
["2","2100","329","-1",14740,3896]
["2","2100","330","-1",12827,3741]
["2","2100","331","-1",13926,3736]
["2","2100","333","-1",5871,1661]
["2","2100","334","-1",5157,1394]
["2","2100","335","-1",12980,3923]
["2","2100","339","-1",14904,3478]
["2","2100","340","-1",5790,1721]
["2","2100","341","-1",5804,1681]
["2","2100","343","-1",21352,6016]
["2","2100","344","-1",21314,5998]
["2","2100","345","-1",18002,5062]
["2","2100","346","-1",19706,5515]
["2","2100","347","-1",4312,1160]
["2","2100","348","-1",7632,2163]
["2","2100","349","-1",45425,11846]
["2","2100","350","-1",8917,2297]
["2","2100","351","-1",13553,3419]
["2","2100","354","-1",10006,2940]
["2","2100","355","-1",6009,1890]
["2","2100","358","-1",958,363]
["2","2100","362","-1",42011,10572]
["2","2100","372","-1",382,95]
["2","2100","373","-1",2247,611]
["2","2100","376","-1",8,8]
["2","2100","377","-1",22747,6163]
["2","2100","402","-1",3369,895]
["2","2100","405","-1",839,263]
["2","2100","436","-1",3462,961]
["2","2100","437","-1",2491,775]
["2","2100","438","-1",2494,751]
["2","2100","442","-1",1875,477]
["2","2100","452","-1",7086,2121]
["2","2100","459","-1",7209,2222]
["2","2100","460","-1",2209,543]
["2","2100","463","-1",2587,772]
["2","2200","-1","-1",27502,6280]
["2","2200","100","-1",351364,109242]
["2","2200","301","-1",1860,536]
["2","2200","304","-1",1114,347]
["2","2200","306","-1",3001,869]
["2","2200","307","-1",2440,553]
["2","2200","308","-1",1216,357]
["2","2200","309","-1",1767,503]
["2","2200","310","-1",9637,4778]
["2","2200","311","-1",3443,1009]
["2","2200","313","-1",4018,1076]
["2","2200","314","-1",9570,2255]
["2","2200","315","-1",1450,386]
["2","2200","316","-1",9425,2074]
["2","2200","317","-1",14762,2930]
["2","2200","318","-1",17101,4234]
["2","2200","319","-1",6836,1280]
["2","2200","320","-1",13768,4634]
["2","2200","321","-1",3183,778]
["2","2200","322","-1",4519,1016]
["2","2200","323","-1",2578,751]
["2","2200","325","-1",6139,1413]
["2","2200","326","-1",6076,1221]
["2","2200","327","-1",4711,892]
["2","2200","328","-1",4145,993]
["2","2200","329","-1",13289,4132]
["2","2200","330","-1",29491,16282]
["2","2200","331","-1",3837,905]
["2","2200","333","-1",1648,472]
["2","2200","334","-1",2801,487]
["2","2200","335","-1",28660,15441]
["2","2200","339","-1",4878,1195]
["2","2200","340","-1",1494,291]
["2","2200","341","-1",5331,949]
["2","2200","343","-1",5147,1309]
["2","2200","344","-1",5162,1222]
["2","2200","345","-1",4216,987]
["2","2200","346","-1",6793,1665]
["2","2200","347","-1",1194,349]
["2","2200","348","-1",2125,390]
["2","2200","349","-1",12537,2663]
["2","2200","350","-1",4892,1598]
["2","2200","351","-1",12973,4711]
["2","2200","354","-1",2300,546]
["2","2200","355","-1",2271,1005]
["2","2200","358","-1",451,91]
["2","2200","362","-1",10987,2262]
["2","2200","372","-1",731,188]
["2","2200","373","-1",717,200]
["2","2200","376","-1",14,2]
["2","2200","377","-1",17344,6165]
["2","2200","402","-1",1232,293]
["2","2200","405","-1",301,96]
["2","2200","436","-1",921,232]
["2","2200","437","-1",755,217]
["2","2200","438","-1",809,254]
["2","2200","442","-1",427,118]
["2","2200","452","-1",1919,493]
["2","2200","459","-1",1917,505]
["2","2200","460","-1",576,146]
["2","2200","463","-1",963,216]
["2","2300","-1","-1",473,27]
["2","2300","100","-1",13378,1800]
["2","2300","301","-1",176,6]
["2","2300","304","-1",71,5]
["2","2300","306","-1",277,20]
["2","2300","307","-1",199,14]
["2","2300","308","-1",110,12]
["2","2300","309","-1",91,9]
["2","2300","310","-1",395,37]
["2","2300","311","-1",181,22]
["2","2300","313","-1",233,43]
["2","2300","314","-1",374,85]
["2","2300","315","-1",115,10]
["2","2300","316","-1",423,119]
["2","2300","317","-1",945,147]
["2","2300","318","-1",502,100]
["2","2300","319","-1",245,48]
["2","2300","320","-1",322,28]
["2","2300","321","-1",168,33]
["2","2300","322","-1",210,59]
["2","2300","323","-1",115,28]
["2","2300","325","-1",355,39]
["2","2300","326","-1",221,14]
["2","2300","327","-1",213,23]
["2","2300","328","-1",407,40]
["2","2300","329","-1",236,30]
["2","2300","330","-1",469,27]
["2","2300","331","-1",333,40]
["2","2300","333","-1",101,5]
["2","2300","334","-1",106,6]
["2","2300","335","-1",608,28]
["2","2300","339","-1",207,23]
["2","2300","340","-1",117,10]
["2","2300","341","-1",89,6]
["2","2300","343","-1",403,49]
["2","2300","344","-1",387,72]
["2","2300","345","-1",297,41]
["2","2300","346","-1",229,26]
["2","2300","347","-1",66,8]
["2","2300","348","-1",129,25]
["2","2300","349","-1",605,107]
["2","2300","350","-1",210,25]
["2","2300","351","-1",270,31]
["2","2300","354","-1",168,26]
["2","2300","355","-1",67,10]
["2","2300","358","-1",9,3]
["2","2300","362","-1",552,95]
["2","2300","372","-1",18]
["2","2300","373","-1",33,4]
["2","2300","377","-1",409,77]
["2","2300","402","-1",55,4]
["2","2300","405","-1",33,2]
["2","2300","436","-1",39,14]
["2","2300","437","-1",39,5]
["2","2300","438","-1",42,4]
["2","2300","442","-1",24,5]
["2","2300","452","-1",105,8]
["2","2300","459","-1",39,11]
["2","2300","460","-1",41,2]
["2","2300","463","-1",22,3]
["2","2400","-1","-1",20628,7657]
["2","2400","100","-1",103216,39970]
["2","2400","301","-1",259,129]
["2","2400","304","-1",155,81]
["2","2400","306","-1",350,168]
["2","2400","307","-1",315,167]
["2","2400","308","-1",381,164]
["2","2400","309","-1",325,128]
["2","2400","310","-1",1082,662]
["2","2400","311","-1",793,312]
["2","2400","313","-1",722,269]
["2","2400","314","-1",1098,690]
["2","2400","315","-1",369,189]
["2","2400","316","-1",1684,816]
["2","2400","317","-1",5072,2265]
["2","2400","318","-1",1561,778]
["2","2400","319","-1",927,453]
["2","2400","320","-1",885,534]
["2","2400","321","-1",724,291]
["2","2400","322","-1",645,376]
["2","2400","323","-1",617,251]
["2","2400","325","-1",1123,668]
["2","2400","326","-1",731,249]
["2","2400","327","-1",538,269]
["2","2400","328","-1",785,372]
["2","2400","329","-1",963,462]
["2","2400","330","-1",937,552]
["2","2400","331","-1",734,375]
["2","2400","333","-1",327,179]
["2","2400","334","-1",359,176]
["2","2400","335","-1",1522,898]
["2","2400","339","-1",538,318]
["2","2400","340","-1",200,138]
["2","2400","341","-1",455,269]
["2","2400","343","-1",932,556]
["2","2400","344","-1",2034,624]
["2","2400","345","-1",871,596]
["2","2400","346","-1",3628,1176]
["2","2400","347","-1",174,115]
["2","2400","348","-1",370,235]
["2","2400","349","-1",2650,1615]
["2","2400","350","-1",409,225]
["2","2400","351","-1",966,401]
["2","2400","354","-1",423,260]
["2","2400","355","-1",424,201]
["2","2400","358","-1",151,71]
["2","2400","362","-1",2294,908]
["2","2400","372","-1",112,18]
["2","2400","373","-1",87,51]
["2","2400","376","-1",36866,9948]
["2","2400","377","-1",1521,796]
["2","2400","402","-1",248,137]
["2","2400","405","-1",32,20]
["2","2400","436","-1",197,105]
["2","2400","437","-1",97,59]
["2","2400","438","-1",125,77]
["2","2400","442","-1",70,42]
["2","2400","452","-1",223,130]
["2","2400","459","-1",303,186]
["2","2400","460","-1",78,51]
["2","2400","463","-1",127,62]
["2","2500","-1","-1",3832,799]
["2","2500","100","-1",12022,3024]
["2","2500","301","-1",70,15]
["2","2500","304","-1",36,5]
["2","2500","306","-1",109,21]
["2","2500","307","-1",90,25]
["2","2500","308","-1",42,12]
["2","2500","309","-1",49,13]
["2","2500","310","-1",823,285]
["2","2500","311","-1",98,14]
["2","2500","313","-1",71,16]
["2","2500","314","-1",234,67]
["2","2500","315","-1",42,7]
["2","2500","316","-1",248,72]
["2","2500","317","-1",432,112]
["2","2500","318","-1",308,73]
["2","2500","319","-1",131,38]
["2","2500","320","-1",222,41]
["2","2500","321","-1",110,25]
["2","2500","322","-1",143,45]
["2","2500","323","-1",58,12]
["2","2500","325","-1",195,53]
["2","2500","326","-1",126,21]
["2","2500","327","-1",94,21]
["2","2500","328","-1",167,40]
["2","2500","329","-1",234,52]
["2","2500","330","-1",612,201]
["2","2500","331","-1",171,37]
["2","2500","333","-1",92,20]
["2","2500","334","-1",80,15]
["2","2500","335","-1",844,258]
["2","2500","339","-1",112,25]
["2","2500","340","-1",48,14]
["2","2500","341","-1",54,13]
["2","2500","343","-1",203,67]
["2","2500","344","-1",119,32]
["2","2500","345","-1",127,43]
["2","2500","346","-1",165,37]
["2","2500","347","-1",49,8]
["2","2500","348","-1",113,23]
["2","2500","349","-1",242,90]
["2","2500","350","-1",97,21]
["2","2500","351","-1",174,37]
["2","2500","354","-1",60,22]
["2","2500","355","-1",58,17]
["2","2500","358","-1",30,11]
["2","2500","362","-1",184,54]
["2","2500","372","-1",1,1]
["2","2500","373","-1",18,3]
["2","2500","377","-1",102,21]
["2","2500","402","-1",50,12]
["2","2500","405","-1",9,1]
["2","2500","436","-1",27,3]
["2","2500","437","-1",25,7]
["2","2500","438","-1",38,6]
["2","2500","442","-1",18,4]
["2","2500","452","-1",69,20]
["2","2500","459","-1",38,10]
["2","2500","460","-1",17,4]
["2","2500","463","-1",12,3]
["2","2600","-1","-1",852,242]
["2","2600","100","-1",1335,611]
["2","2600","301","-1",3,3]
["2","2600","304","-1",3,1]
["2","2600","306","-1",5,3]
["2","2600","308","-1",3,3]
["2","2600","309","-1",3,1]
["2","2600","311","-1",1,1]
["2","2600","313","-1",1,1]
["2","2600","314","-1",4,2]
["2","2600","315","-1",15,12]
["2","2600","316","-1",4,1]
["2","2600","317","-1",26,16]
["2","2600","318","-1",10,7]
["2","2600","319","-1",5,3]
["2","2600","320","-1",6,4]
["2","2600","322","-1",2,1]
["2","2600","323","-1",2,2]
["2","2600","325","-1",9,7]
["2","2600","326","-1",4,2]
["2","2600","327","-1",16,12]
["2","2600","328","-1",2,2]
["2","2600","329","-1",7,2]
["2","2600","331","-1",1]
["2","2600","333","-1",9,9]
["2","2600","334","-1",8,4]
["2","2600","339","-1",3,2]
["2","2600","340","-1",9,7]
["2","2600","341","-1",50,48]
["2","2600","343","-1",2,2]
["2","2600","344","-1",6,4]
["2","2600","345","-1",49,47]
["2","2600","346","-1",24,13]
["2","2600","347","-1",3,1]
["2","2600","348","-1",5,3]
["2","2600","349","-1",78,70]
["2","2600","350","-1",8,4]
["2","2600","351","-1",14,8]
["2","2600","354","-1",6,1]
["2","2600","355","-1",2,2]
["2","2600","358","-1",2,2]
["2","2600","362","-1",7,5]
["2","2600","373","-1",3,2]
["2","2600","376","-1",1,1]
["2","2600","377","-1",7,2]
["2","2600","402","-1",26,25]
["2","2600","405","-1",3,3]
["2","2600","436","-1",5,2]
["2","2600","437","-1",2,2]
["2","2600","438","-1",3,1]
["2","2600","442","-1",5,2]
["2","2600","452","-1",5,5]
["2","2600","460","-1",1,1]
["2","2600","463","-1",5,5]
["2","3100","-1","-1",20832,4150]
["2","3100","100","-1",26003,5278]
["2","3100","310","-1",1738,370]
["2","3100","330","-1",1398,334]
["2","3100","335","-1",2035,424]
["2","3200","-1","-1",3348,1329]
["2","3200","100","-1",7055,3219]
["2","3200","310","-1",941,556]
["2","3200","330","-1",1315,664]
["2","3200","335","-1",1451,670]
["2","3300","-1","-1",236,27]
["2","3300","100","-1",1285,1060]
["2","3300","310","-1",341,333]
["2","3300","330","-1",338,331]
["2","3300","335","-1",370,369]
["2","3400","-1","-1",58]
["2","3400","100","-1",58]
["2","3600","100","-1",2622,1434]
["2","3600","310","-1",1416,806]
["2","3600","330","-1",519,251]
["2","3600","335","-1",687,377]
["2","2100","35","-1",139919,52747]
["2","2100","384","-1",157309,41378]
["2","2100","393","-1",280169,73323]
["2","2100","394","-1",184373,51279]
["2","2100","395","-1",147419,41776]
["2","2200","35","-1",27502,6280]
["2","2200","384","-1",79315,28545]
["2","2200","393","-1",95066,23833]
["2","2200","394","-1",95044,35899]
["2","2200","395","-1",54437,14685]
["2","2300","35","-1",473,27]
["2","2300","384","-1",2698,331]
["2","2300","393","-1",3909,715]
["2","2300","394","-1",3934,370]
["2","2300","395","-1",2364,357]
["2","2400","35","-1",20628,7657]
["2","2400","384","-1",9368,4908]
["2","2400","393","-1",14953,7338]
["2","2400","394","-1",47078,14983]
["2","2400","395","-1",11189,5084]
["2","2500","35","-1",3832,799]
["2","2500","384","-1",1905,539]
["2","2500","393","-1",2177,551]
["2","2500","394","-1",2988,831]
["2","2500","395","-1",1120,304]
["2","2600","35","-1",852,242]
["2","2600","384","-1",139,110]
["2","2600","393","-1",100,66]
["2","2600","394","-1",76,58]
["2","2600","395","-1",168,135]
["3","2100","100","010",78284,31147]
["3","2100","100","020",452548,116973]
["3","2100","100","040",179065,66562]
["3","2100","100","095",9,2]
["3","2100","100","110",123423,37321]
["3","2100","100","140",20631,8413]
["3","2100","100","320",974,29]
["3","2100","100","410",96,44]
["3","2100","100","420",14,12]
["3","2200","100","130G",148455,17066]
["3","2200","100","133",27,19]
["3","2200","100","135",254,39]
["3","2200","100","290G",47160,7329]
["3","2200","100","310G",9300,548]
["3","2200","100","450",6,5]
["3","2200","100","600G",146162,84236]
["3","2300","100","330",13201,1722]
["3","2300","100","680G",2]
["3","2300","100","690",6]
["3","2300","100","690G",169,78]
["3","2400","100","293",4,2]
["3","2400","100","335",8269,7179]
["3","2400","100","400G",19364,1924]
["3","2400","100","409",10]
["3","2400","100","500G",456,9]
["3","2400","100","510",53420,14730]
["3","2400","100","681",133,70]
["3","2400","100","687",1,1]
["3","2400","100","688",777,757]
["3","2400","100","930G",20186,15147]
["3","2400","100","960G",596,151]
["3","2500","100","160G",12022,3024]
["3","2600","100","165",1335,611]
["3","3100","100","120",5172,1107]
["3","3100","100","180",11410,2418]
["3","3100","100","190",9421,1753]
["3","3200","100","135",108,30]
["3","3200","100","137",16,3]
["3","3200","100","150G",6930,3186]
["3","3200","100","607",1]
["3","3300","100","154",236,21]
["3","3300","100","696",1049,1039]
["3","3400","100","407",58]
["3","3600","100","165",2622,1434]
["3.1","2100","100","040",233210,66562]
["12","9000","100","1",48215,384,53.743606761381301]
["12","9000","100","1.1",47246,200,53.235617830080798]
["12","9000","100","1.2",969,184,78.511867905056704]
["12","9000","100","2",46341,23063,151.46274357480399]
["12","9000","100","2.1",45871,22775,151.17150269233201]
["12","9000","100","2.2",470,288,179.88723404255299]
["12","9000","100","3",7804,3529,148.390184520758]
["12","9000","100","3.1",7603,3425,148.04235170327499]
["12","9000","100","3.2",201,104,161.547263681592]
["12","9000","100","4",1112,67,39.987410071942399]
["12","9000","100","4.1",1068,64,39.800561797752799]
["12","9000","100","4.2",44,3,44.522727272727202]
["11","2100","100","010",15548,1680]
["11","2100","100","020",649,67]
["11","2100","100","110",2213,241]
["11","2200","100","130G",135,1]
["11","2200","100","290G",7,1]
["11","2300","100","330",2827,20]
["11","2400","100","400G",54]
["11","2400","100","930G",2]
["11",null,"100",null,1,1]
["4","0","-1","-1",145018,55200,130.16,3765,304253,163.49,153.58000000000001,12923,117524,12944,1215,412]
["4","0","100","-1",944142,272525,101.95,29266,1651604,134.41999999999999,129.33000000000001,158712,682389,93547,6730,2764]
["4","0","301","-1",6101,1730,99.26,185,10660,137.21,120.66,991,4461,602,28,19]
["4","0","304","-1",3724,930,93.22,516,25996,40.590000000000003,45.15,518,2460,569,142,35]
["4","0","306","-1",11041,3143,99.06,334,17841,142.18,128.74,1850,7992,1079,85,35]
["4","0","307","-1",8179,2239,96.38,270,13794,135.25,124.65,1337,5892,879,54,17]
["4","0","308","-1",4178,1167,95.01,150,7305,120.21,125.33,725,3025,372,40,16]
["4","0","309","-1",6778,1818,94.5,204,11029,126.2,129.29,1223,4891,603,39,22]
["4","0","310","-1",18851,5496,102.38,550,32076,148.68,134.34,3906,13171,1557,154,63]
["4","0","311","-1",13446,4219,105.63,406,19302,147.86000000000001,132.37,2346,9540,1385,122,53]
["4","0","313","-1",14786,3771,92.17,475,24717,119.86,124.31,2916,10103,1615,100,52]
["4","0","314","-1",32849,8473,93.52,1051,54965,130.06,127.72,5980,22851,3680,219,119]
["4","0","315","-1",5436,1451,94.98,142,8364,129.69999999999999,134.93,863,4105,411,44,13]
["4","0","316","-1",39076,10223,94.51,1213,63184,135.88,123.17,7417,27163,4095,268,133]
["4","0","317","-1",65101,16492,94.09,2124,107273,135.04,124.28,12418,45333,6701,460,189]
["4","0","318","-1",36925,9448,91.05,1252,62925,126.41,119.12,6927,25454,4173,249,122]
["4","0","319","-1",19826,5228,94.66,609,34816,130.02000000000001,118.86,3715,13965,1953,148,45]
["4","0","320","-1",19599,5097,92.44,630,33265,134.29,123.3,3666,13645,2103,139,46]
["4","0","321","-1",14842,4130,95.67,426,22834,142.82,125.12,2837,10264,1610,93,38]
["4","0","322","-1",18212,4837,92.95,516,28567,138.53,123.35,3828,12245,1954,132,53]
["4","0","323","-1",10580,3021,101.28,303,15999,130.94,127.98,1898,7504,1086,74,18]
["4","0","325","-1",21656,6041,99.62,697,38148,135.69,129.32,3604,15986,1873,119,74]
["4","0","326","-1",13480,3621,93.34,420,21964,131.96,122.65,2473,9559,1341,73,34]
["4","0","327","-1",10790,3091,97.59,328,16596,136.08000000000001,128.06,1943,7611,1145,63,28]
["4","0","328","-1",17954,5052,96.61,505,27427,139.41999999999999,130.1,3299,12695,1773,133,54]
["4","0","329","-1",15456,4118,94.56,480,26582,132.11000000000001,125.14,2760,11128,1415,106,47]
["4","0","330","-1",14105,4142,104.27,440,25250,147.41999999999999,134.97,2943,9834,1154,135,39]
["4","0","331","-1",14555,3911,94.96,441,24628,151.77000000000001,127.99,2598,10386,1434,98,39]
["4","0","333","-1",6181,1771,96.06,183,9868,137.88,128.61000000000001,1169,4375,580,42,15]
["4","0","334","-1",5385,1472,96.17,183,9668,119.86,130.83000000000001,909,3845,577,44,10]
["4","0","335","-1",14799,4549,110.68,521,28198,153.75,144.94999999999999,3063,10337,1202,139,58]
["4","0","339","-1",15211,3520,86.94,470,25480,123.34,120.76,2867,10633,1570,97,44]
["4","0","340","-1",5968,1780,100.28,152,8209,130.02000000000001,130.35,1095,4243,579,35,16]
["4","0","341","-1",6125,1825,104.97,177,11014,122.47,171.12,1033,4406,634,40,12]
["4","0","343","-1",22302,6360,99.93,636,34327,130.69,128.18,3943,16240,1931,133,55]
["4","0","344","-1",21960,6200,98.2,646,33981,127.97,123.33,3860,15814,2096,123,67]
["4","0","345","-1",18782,5396,98.96,532,26646,127.62,130.72999999999999,3264,13751,1612,104,51]
["4","0","346","-1",20417,5766,102.26,1066,56067,89.79,89.18,3117,14312,2722,175,91]
["4","0","347","-1",4485,1226,98.99,158,7414,139.87,126.72,569,3603,277,26,10]
["4","0","348","-1",8058,2335,100.79,211,13442,129.15,130.19,1177,6317,502,47,15]
["4","0","349","-1",47183,12756,100.32,1483,75682,138.32,129.56,8793,33054,4935,295,106]
["4","0","350","-1",9211,2384,91.98,271,14154,140.37,125.58,1757,6512,859,54,29]
["4","0","351","-1",13917,3533,90.44,435,23246,120.84,122.09,2823,9439,1517,94,44]
["4","0","354","-1",10321,3048,101.51,315,15711,136.53,135.25,1780,7333,1114,66,28]
["4","0","355","-1",6248,1948,103.9,239,9992,137.93,110.99,1180,4144,876,31,17]
["4","0","358","-1",994,385,122.42,34,1544,134.62,127.78,119,794,71,8,2]
["4","0","362","-1",42987,10876,93.27,1282,70307,131.06,123.74,8125,30185,4308,239,130]
["4","0","372","-1",406,95,83.29,9,778,79.11,126.14,70,279,52,3,2]
["4","0","373","-1",2345,633,97.3,85,3772,136.38999999999999,132.28,398,1697,234,13,3]
["4","0","376","-1",9,9,680.78,null,51,null,594.25,null,9]
["4","0","377","-1",23483,6390,97.49,757,39490,120.44,123.16,3997,16472,2776,176,62]
["4","0","402","-1",3544,977,102.61,94,5549,138.84,149.34,623,2603,281,29,8]
["4","0","405","-1",880,278,100.63,24,1379,159,129.76,130,653,90,4,3]
["4","0","436","-1",3594,1012,99.47,75,5350,128.38999999999999,130.19999999999999,534,2830,212,12,6]
["4","0","437","-1",2591,803,101.52,73,3989,128,135.91,436,1901,234,15,5]
["4","0","438","-1",2600,801,105.4,91,4870,122.41,138.35,371,2005,200,19,5]
["4","0","442","-1",1927,497,101.87,62,2965,132.31,138.54,318,1440,155,9,5]
["4","0","452","-1",7378,2201,98.08,216,10960,127.11,128.49,1226,5368,717,45,22]
["4","0","459","-1",7381,2265,103.76,220,10270,142.87,127.88,1209,5398,700,54,20]
["4","0","460","-1",2275,559,90.63,72,3498,123.76,124.16,454,1593,212,12,4]
["4","0","463","-1",2651,786,102.26,62,3973,134.26,135.01,399,2017,216,15,4]
["4","11","-1","-1",135956,52815,132.41,3338,285004,172.55,156.69,9804,112376,12394,1030,352]
["4","11","301","-1",5839,1633,99.15,172,10129,134.51,122.04,904,4299,590,28,18]
["4","11","304","-1",3597,898,93.06,509,25709,40.24,44.6,473,2387,563,141,33]
["4","11","306","-1",10594,2999,99.17,322,16901,143.63999999999999,129.86000000000001,1661,7765,1061,77,30]
["4","11","307","-1",7805,2120,96.03,256,12947,138.54,126.68,1191,5691,861,46,16]
["4","11","308","-1",4000,1117,94.89,129,6841,121.57,126.79,654,2931,363,36,16]
["4","11","309","-1",6408,1708,94.15,193,10424,128.81,130.61000000000001,1060,4700,595,31,22]
["4","11","310","-1",17691,5248,103.62,509,29884,151.88,134.47,3151,12824,1536,124,56]
["4","11","311","-1",12480,3940,106.74,344,16648,161.56,138.88999999999999,2129,8925,1289,94,43]
["4","11","313","-1",14249,3647,92.56,431,23160,125.5,126.57,2751,9794,1571,83,50]
["4","11","314","-1",31566,8157,93.95,956,51126,136.74,131.82,5680,22028,3556,194,108]
["4","11","315","-1",5234,1394,94.26,131,7917,137.47999999999999,137.75,802,3979,405,37,11]
["4","11","316","-1",37630,9859,94.75,1143,59651,139.15,125.12,6914,26342,4012,242,120]
["4","11","317","-1",62723,15841,94.15,1991,101606,138.44,125.87,11404,44147,6579,411,182]
["4","11","318","-1",35464,9082,91.28,1136,58369,131.83000000000001,122.79,6467,24639,4044,203,111]
["4","11","319","-1",18983,4979,94.45,562,32690,132.05000000000001,120.53,3437,13475,1901,130,40]
["4","11","320","-1",18775,4864,92.61,588,31139,138.33000000000001,125.86,3383,13191,2044,116,41]
["4","11","321","-1",14300,3964,95.7,410,21563,145.12,126.45,2630,9969,1578,85,38]
["4","11","322","-1",17473,4581,92.55,483,26790,140.41,124.63,3536,11842,1931,118,46]
["4","11","323","-1",10190,2902,101.44,291,15204,133.21,129.16999999999999,1750,7284,1071,67,18]
["4","11","325","-1",20685,5714,99.55,653,36025,138.55000000000001,130.94999999999999,3216,15457,1838,102,72]
["4","11","326","-1",12942,3437,92.95,401,20872,132.99,123.68,2257,9272,1321,60,32]
["4","11","327","-1",10368,2976,97.73,296,15370,144.38,131.13,1792,7368,1128,54,26]
["4","11","328","-1",17245,4838,96.71,477,25846,140.54,131.78,3006,12337,1727,126,49]
["4","11","329","-1",14771,3881,93.97,451,24911,131.04,126.55,2501,10747,1394,85,44]
["4","11","330","-1",12156,3434,101.86,358,21279,148.6,134.66999999999999,2185,8742,1112,88,29]
["4","11","331","-1",13841,3712,94.98,412,22953,156.28,130.44,2319,10009,1398,84,31]
["4","11","333","-1",5864,1683,96.54,174,9242,142.12,129.63,1022,4224,573,31,14]
["4","11","334","-1",5160,1409,96.57,163,9076,121.16,134.03,841,3713,562,36,8]
["4","11","335","-1",11975,3544,108.81,433,23074,148.68,147.87,2007,8717,1120,91,40]
["4","11","339","-1",14635,3393,87.27,406,23633,134.56,124.81,2700,10303,1514,81,37]
["4","11","340","-1",5758,1720,100.35,134,7639,136.46,132.85,1009,4133,569,31,16]
["4","11","341","-1",5877,1769,106,162,10423,128.22999999999999,175.7,934,4279,619,34,11]
["4","11","343","-1",21346,6072,99.9,592,32100,132.21,130.18,3567,15734,1880,112,53]
["4","11","344","-1",21153,5984,98.4,591,31900,130.13,124.92,3566,15381,2045,103,58]
["4","11","345","-1",18044,5172,99.1,496,24984,129.69,132.97,2980,13354,1575,91,44]
["4","11","346","-1",19645,5573,102.93,1013,53974,90.98,89.58,2894,13854,2670,144,83]
["4","11","347","-1",4302,1170,99.33,141,6884,147.94,130.82,506,3503,262,23,8]
["4","11","348","-1",7734,2231,101.13,202,12591,130.84,132.56,1044,6151,489,39,11]
["4","11","349","-1",45689,12317,100.4,1374,71487,142.11000000000001,131.91,8255,32233,4838,265,98]
["4","11","350","-1",8842,2259,91.57,250,13217,146.04,127.83,1615,6309,841,50,27]
["4","11","351","-1",13366,3400,90.73,393,21543,128.41,125.74,2623,9132,1488,85,38]
["4","11","354","-1",9946,2945,102.01,294,14618,142.41999999999999,139.11000000000001,1645,7119,1096,61,25]
["4","11","355","-1",5910,1837,103.67,231,9372,136.37,109.02,1026,3982,867,21,14]
["4","11","358","-1",927,358,122.82,32,1433,130.66,126.53,99,752,67,7,2]
["4","11","362","-1",41674,10499,93.25,1225,67130,133.79,125.23,7626,29472,4237,215,124]
["4","11","372","-1",402,93,82.71,7,748,70.709999999999994,126.71,70,276,52,2,2]
["4","11","373","-1",2245,603,96.68,82,3539,136.91,134.13999999999999,364,1639,226,13,3]
["4","11","376","-1",8,8,663,null,48,null,605.5,null,8]
["4","11","377","-1",22238,6113,98.53,644,35604,131.32,129.13999999999999,3782,15627,2627,146,56]
["4","11","402","-1",3409,938,102.38,90,5233,141.58000000000001,153.04,580,2520,277,24,8]
["4","11","405","-1",853,266,100.34,23,1293,158.26,132.08000000000001,122,635,89,4,3]
["4","11","436","-1",3476,977,99.4,69,5049,137.55000000000001,132.82,491,2764,207,10,4]
["4","11","437","-1",2503,775,102.01,70,3751,132.06,139.11000000000001,404,1853,229,12,5]
["4","11","438","-1",2510,772,105.85,86,4634,126.27,141.25,339,1956,195,17,3]
["4","11","442","-1",1868,474,101.79,57,2804,140.41999999999999,140.85,299,1407,151,7,4]
["4","11","452","-1",7005,2101,98.48,198,10109,133.66,132.26,1099,5160,690,38,18]
["4","11","459","-1",7087,2200,104.8,206,9447,144.33000000000001,132.63999999999999,1148,5211,663,49,16]
["4","11","460","-1",2189,544,91.28,69,3296,127.28,126.55,418,1548,207,12,4]
["4","11","463","-1",2566,762,102.55,57,3705,142.26,139.87,375,1964,210,14,3]
["4","11","100","-1",899171,259701,102.24,26906,1544538,138.35,131.53,142507,657433,90997,5760,2474]
["4","12","-1","-1",29834,9303,102.42,1091,60702,122.8,112.45,13620,14795,714,556,149]
["4","12","310","-1",1068,231,84.37,27,1764,145.41,149.81,755,276,4,26,7]
["4","12","330","-1",1909,697,120.23,77,3862,149.72999999999999,138.13999999999999,758,1059,38,44,10]
["4","12","335","-1",2796,998,118.47,87,5037,180.75,132.56,1056,1599,76,48,17]
["4","12","100","-1",35607,11229,104.1,1282,71365,128.83000000000001,116.19,16189,17729,832,674,183]
["4","13","-1","-1",1878,262,57.82,193,6322,45.08,58.73,2,1422,375,56,23]
["4","13","301","-1",35,6,66.09,1,82,3,58.04,null,28,6,null,1]
["4","13","304","-1",23,2,57.96,1,66,48,62.68,2,17,3,1]
["4","13","306","-1",47,11,74,4,174,62,92.39,null,38,7,null,2]
["4","13","307","-1",39,6,57.21,1,142,13,68.94,null,30,9]
["4","13","308","-1",31,6,69.81,10,144,47.2,78.73,null,24,5,2]
["4","13","309","-1",39,5,70.31,3,99,22.33,73,null,38,1]
["4","13","310","-1",92,17,74.489999999999995,14,428,38.57,61.44,null,71,17,4]
["4","13","311","-1",493,126,81.06,39,1821,61.59,80.900000000000006,null,382,85,19,7]
["4","13","313","-1",215,30,59.41,27,865,30.96,71.900000000000006,null,167,37,11]
["4","13","314","-1",596,81,57.22,72,2420,41.39,53.09,2,464,107,15,8]
["4","13","315","-1",55,8,56.95,3,88,2,56.34,1,47,4,3]
["4","13","316","-1",391,63,65.09,39,1487,46.1,63.55,1,317,60,8,5]
["4","13","317","-1",380,54,61.32,52,1467,47.1,63.03,null,292,76,10,2]
["4","13","318","-1",482,69,62.23,74,2394,39.950000000000003,51,null,341,111,27,3]
["4","13","319","-1",188,29,65.59,20,742,59.6,60.77,1,149,36,2]
["4","13","320","-1",176,27,60.88,23,727,54.09,48.69,null,121,43,9,3]
["4","13","321","-1",112,31,89.87,8,362,71.75,64.790000000000006,null,90,20,2]
["4","13","322","-1",92,19,71.459999999999994,10,371,49.7,68.78,null,78,10,3,1]
["4","13","323","-1",73,17,79.48,3,175,52.67,82.49,null,62,10,1]
["4","13","325","-1",103,13,57.36,12,371,44.33,65.81,null,85,16,2]
["4","13","326","-1",44,10,81.36,3,100,78.33,97.82,null,35,7,2]
["4","13","327","-1",97,13,68.09,13,357,42.15,53.61,null,81,12,3,1]
["4","13","328","-1",108,26,80.63,6,268,12,69.09,null,77,25,3,3]
["4","13","329","-1",56,12,96.91,3,103,54,105.66,null,49,7]
["4","13","330","-1",40,11,76.98,5,109,27.2,81.010000000000005,null,33,4,3]
["4","13","331","-1",156,28,77.95,8,513,32.880000000000003,61.16,1,123,27,2,3]
["4","13","333","-1",20,4,50.15,3,87,11.67,70.72,null,14,5,1]
["4","13","334","-1",64,9,50.86,10,259,90,63.6,null,51,11,2]
["4","13","335","-1",28,7,130.07,1,87,2,88.71,null,21,6,null,1]
["4","13","339","-1",218,30,53.68,48,1130,26.48,42.86,null,158,46,10,4]
["4","13","340","-1",36,7,74.36,12,179,57.25,77.66,null,29,6,1]
["4","13","341","-1",58,9,59.14,6,256,13.17,52.57,1,47,9,1]
["4","13","343","-1",135,23,75.47,14,543,25.14,63.04,null,108,22,4,1]
["4","13","344","-1",213,40,75.98,28,730,69.930000000000007,63.79,null,164,38,7,4]
["4","13","345","-1",117,28,77.8,13,362,57.46,66.27,null,88,22,4,3]
["4","13","346","-1",287,47,66.16,32,1045,33,64.05,null,224,39,19,5]
["4","13","347","-1",43,10,87.77,10,234,33.799999999999997,48.06,null,30,11,null,2]
["4","13","348","-1",33,8,90.39,2,106,22,92.62,null,27,5,1]
["4","13","349","-1",313,58,73.33,46,1531,35.43,56.23,1,232,68,6,6]
["4","13","350","-1",30,9,87.2,6,154,43.83,68.150000000000006,null,20,9,null,1]
["4","13","351","-1",128,20,55.48,28,674,34.79,46.95,null,97,22,5,4]
["4","13","354","-1",79,4,36.82,14,505,9.86,46.15,null,60,16,2,1]
["4","13","355","-1",23,8,98.87,null,44,null,87.48,null,15,7,1]
["4","13","358","-1",1,1,186,null,11,null,73.27,null,1]
["4","13","362","-1",254,43,62.83,27,1017,30.52,60.41,1,198,43,9,3]
["4","13","372","-1",3,1,146,2,25,108.5,125.84,null,2,null,1]
["4","13","373","-1",15,1,52.87,1,56,118,76.05,1,11,3]
["4","13","377","-1",789,156,68.56,88,2928,37.65,55.17,null,621,138,24,6]
["4","13","402","-1",25,4,78.88,1,73,125,90.66,null,24,1]
["4","13","405","-1",10,5,115.9,null,17,null,61.59,null,9,1]
["4","13","436","-1",17,5,90.06,4,78,21,62.23,null,15,2]
["4","13","437","-1",17,2,47.88,3,68,33.33,72.400000000000006,null,12,3,2]
["4","13","438","-1",22,7,72.59,3,77,74.33,69.16,null,18,4]
["4","13","442","-1",13,2,71,4,54,48.75,98.39,null,10,2,1]
["4","13","452","-1",110,26,70.819999999999993,9,357,37.78,58.7,1,85,19,3,2]
["4","13","459","-1",155,29,64.760000000000005,11,573,93.27,60.48,null,120,31,3,1]
["4","13","460","-1",25,null,26.92,2,49,37.5,48.98,1,19,5]
["4","13","463","-1",41,9,84.68,3,191,34.33,54.16,null,35,4,1,1]
["4","13","100","-1",9363,1594,65.75,1078,35697,43,60.28,16,7226,1718,296,107]
["4","14","-1","-1",1,1,197,null,4,null,87.75,null,1]
["4","14","100","-1",1,1,197,null,4,null,87.75,null,1]
["4","13","395","-1",1987,371,69.459999999999994,233,7663,42.24,58.83,1,1554,341,67,24]
["4","11","395","-1",146623,42069,100.67,4564,245302,124.12,123.61,23549,107062,14772,854,386]
["4","13","384","-1",1204,213,65.010000000000005,186,5419,35.369999999999997,55.23,3,911,231,39,20]
["4","13","394","-1",1599,320,73.64,143,5505,45.9,74.55,5,1262,266,50,16]
["4","13","35","-1",1878,262,57.82,193,6322,45.08,58.73,2,1422,375,56,23]
["4","13","393","-1",2695,428,64.180000000000007,323,10788,45.4,57.46,5,2077,505,84,24]
["4","11","35","-1",135956,52815,132.41,3338,285004,172.55,156.69,9804,112376,12394,1030,352]
["4","11","384","-1",155725,41344,96.82,4648,251532,137.08000000000001,130.80000000000001,27706,110934,15804,888,393]
["4","11","394","-1",183409,50778,97.82,5888,318686,132.01,123.67,31012,132506,18070,1260,561]
["4","11","393","-1",277458,72695,94.26,8468,444014,137.63999999999999,125.82,50436,194555,29957,1728,782]
["4","0","35","-1",145018,55200,130.16,3765,304253,163.49,153.58000000000001,12923,117524,12944,1215,412]
["4","0","384","-1",163753,43791,97.02,5074,270583,133.37,128.51,30634,115412,16207,1050,450]
["4","0","394","-1",193749,53949,97.94,6357,341746,130.02000000000001,122.62,35164,137957,18520,1489,619]
["4","0","395","-1",152927,43762,100.21,4966,262088,120.56,121.16,25562,110700,15230,1002,433]
["4","0","393","-1",288695,75823,94.19,9104,472934,133.62,123.57,54429,200796,30646,1974,850]
["5","0","-1","-1",1406,201,58.28,null,null,null,null,1176,79,70,62,19]
["5","0","100","-1",944142,272525,101.95,29266,1651604,134.41999999999999,129.33000000000001,158712,682389,93547,6730,2764]
["5","0","101","-1",1557,503,129.49,11,249,33.909999999999997,13.21,973,521,44,16,3]
["5","0","301","-1",1049,259,86.31,166,13435,105.27,115.43,299,401,227,62,60]
["5","0","304","-1",1917,393,83.45,472,31774,29.97,59.27,408,837,501,137,34]
["5","0","306","-1",1740,391,84.1,168,9384,123.43,142.44999999999999,562,838,259,61,20]
["5","0","307","-1",2044,641,99.8,298,13715,124.96,125.24,509,932,457,95,51]
["5","0","308","-1",1304,357,112.75,169,11005,135.43,140.19999999999999,441,619,214,30]
["5","0","309","-1",843,224,86.04,217,13209,113.28,114.91,207,350,242,34,10]
["5","0","310","-1",10062,5417,145.21,1298,77528,161.41999999999999,129.07,2044,5209,1897,657,255]
["5","0","311","-1",1986,570,111.46,271,12724,179.45,160.71,625,716,391,169,85]
["5","0","313","-1",1419,286,66.13,130,7921,132.32,130.01,646,580,163,20,10]
["5","0","314","-1",3939,901,83.24,613,38896,127.26,125.85,1357,1494,940,56,92]
["5","0","315","-1",1941,491,115.76,420,21468,129.86000000000001,129.85,524,876,447,60,34]
["5","0","316","-1",8007,2419,92.81,1015,64338,131.22999999999999,127.17,2537,3645,1531,232,62]
["5","0","317","-1",10794,4274,125.79,1742,97697,185.21,157.53,2820,4897,2805,211,61]
["5","0","318","-1",8369,2326,88.99,1814,95262,120.66,114.37,2166,3188,2333,424,258]
["5","0","319","-1",4244,1215,92.33,696,40002,125.6,125.2,1196,1909,1053,57,29]
["5","0","320","-1",3610,949,94.62,599,32071,144.51,132.62,977,1437,1068,93,35]
["5","0","321","-1",2004,567,93.5,246,15505,126.76,122.52,621,847,476,56,4]
["5","0","322","-1",1877,527,81.78,374,20510,121.68,108.82,666,651,478,45,37]
["5","0","323","-1",1770,523,97.98,353,16084,143.22,131.62,507,857,366,38,2]
["5","0","325","-1",3887,1296,103.39,657,40240,129.69999999999999,125.05,1169,1738,803,83,94]
["5","0","326","-1",2226,699,97.97,328,18076,137.63999999999999,133.02000000000001,584,1069,506,52,15]
["5","0","327","-1",3119,1566,162.32,498,31375,142.26,120.48,485,1852,594,108,80]
["5","0","328","-1",2400,640,82.59,207,14355,134.80000000000001,122.54,819,987,453,100,41]
["5","0","329","-1",2642,695,89.07,490,25542,121.59,112.94,726,1087,723,16,90]
["5","0","330","-1",3608,1115,108.47,635,41821,143.56,145.18,1162,1385,615,352,94]
["5","0","331","-1",6721,2722,110.69,588,30165,179.16,162.94999999999999,1779,3570,1255,55,62]
["5","0","333","-1",1680,515,94.71,269,12939,119.12,110.49,470,701,413,63,33]
["5","0","334","-1",2430,741,103.52,422,23063,125.9,131.97999999999999,475,1225,575,113,42]
["5","0","335","-1",4354,1478,126.43,1158,58566,135.94,147.22999999999999,1088,1561,1251,327,127]
["5","0","339","-1",3373,854,108.45,475,29722,112.96,119.04,1153,1264,622,293,41]
["5","0","340","-1",1330,350,84.79,219,11097,137.99,137.93,452,646,182,44,6]
["5","0","341","-1",2977,905,101.41,580,34499,124.89,132.08000000000001,723,1484,613,128,29]
["5","0","343","-1",2055,503,84.13,359,22572,107.38,119.47,765,831,408,38,13]
["5","0","344","-1",3643,773,99.95,503,25445,125.43,122.13,1238,1655,712,14,24]
["5","0","345","-1",4699,1821,122.92,677,40713,162.19999999999999,165.23,1366,2282,877,137,37]
["5","0","346","-1",6223,2089,113.16,1236,71705,98.68,95.79,1254,2239,1840,736,154]
["5","0","347","-1",1108,467,108.79,156,8781,129.91999999999999,113,151,319,402,129,107]
["5","0","348","-1",2253,739,121.04,242,13000,137.59,168.96,721,1034,461,32,5]
["5","0","349","-1",8662,2827,103.35,1969,102552,138.35,137.55000000000001,2669,3878,1909,119,87]
["5","0","350","-1",1922,460,105.12,300,18488,129.31,120.81,679,860,358,20,5]
["5","0","351","-1",4366,1423,104.68,773,45318,127.27,121.2,1205,2089,973,66,33]
["5","0","354","-1",1048,291,99.58,232,13085,116.47,131.57,289,424,289,25,21]
["5","0","355","-1",3413,1770,180.41,688,32340,215.44,204.31,429,2152,726,81,25]
["5","0","358","-1",512,173,114.54,125,9048,160.91,158.58000000000001,147,170,165,27,3]
["5","0","362","-1",7652,2479,96.72,1130,61266,131.96,124.55,2340,3168,1751,193,200]
["5","0","372","-1",9,null,13.89,null,null,null,null,7,1,null,1]
["5","0","373","-1",633,168,84.35,102,5925,119.77,133.76,200,247,167,18,1]
["5","0","377","-1",7235,2310,94.07,1139,64481,122.72,122.66,2102,3234,1696,132,71]
["5","0","387","-1",null,null,null,null,3,null,25.67]
["5","0","388","-1",null,null,null,null,1,null,260]
["5","0","397","-1",null,null,null,44,2058,204.18,163.12]
["5","0","398","-1",4837,null,3.37,null,9,null,7.11,3795,313,729]
["5","0","402","-1",1823,523,142.1,471,26171,118.76,121.73,443,908,395,56,21]
["5","0","405","-1",347,84,81.319999999999993,33,1705,156.76,135.24,93,188,53,10,3]
["5","0","436","-1",1055,336,96.3,238,11211,128.33000000000001,125.3,276,529,229,6,15]
["5","0","437","-1",483,167,112.98,103,6988,111.26,131.97,120,220,129,10,4]
["5","0","438","-1",913,260,95.79,185,10360,140.43,128.53,198,472,212,26,5]
["5","0","442","-1",338,75,90.65,50,2677,85.18,139.85,75,170,82,11]
["5","0","452","-1",1017,255,93.73,175,8190,133.18,139.35,341,391,183,91,11]
["5","0","459","-1",848,250,95.19,149,7155,138.28,133.33000000000001,256,363,205,24]
["5","0","460","-1",339,60,66.849999999999994,56,2956,96.2,119.11,132,142,60,5]
["5","0","463","-1",451,131,93.55,50,4068,144.24,140.52000000000001,125,224,84,15,3]
["5","0","499","-1",763629,215081,101.43,17,1220,71.41,81.97,104950,604434,53885,359,1]
["5","0","-1","-1",null,null,null,466,27876,76.11,83.14]
["5","11","-1","-1",7721,692,38.090000000000003,229,13710,126.39,129.41999999999999,5879,901,842,78,21]
["5","11","301","-1",1010,251,87.19,153,13131,111.85,116.76,295,385,213,58,59]
["5","11","304","-1",1877,387,83.93,465,31412,29.03,59.29,407,822,483,134,31]
["5","11","306","-1",1715,388,84.7,165,9133,125.61,144.69,555,829,253,59,19]
["5","11","307","-1",1970,627,101.06,282,13221,129.22,127.72,507,908,416,89,50]
["5","11","308","-1",1278,356,114.47,165,10705,138.09,142.41999999999999,438,610,201,29]
["5","11","309","-1",808,216,86.66,211,12934,115.17,116.11,203,337,229,31,8]
["5","11","310","-1",9932,5402,146.44,1276,76768,163.41,129.74,2030,5161,1847,641,253]
["5","11","311","-1",1898,557,114.01,258,11949,186.4,165.33,617,687,365,152,77]
["5","11","313","-1",1326,273,67.14,119,7608,139.97,132.24,637,517,144,18,10]
["5","11","314","-1",3782,887,84.98,588,37671,130.75,127.85,1341,1415,888,51,87]
["5","11","315","-1",1908,489,117.22,408,21073,133.06,131.35,523,862,433,58,32]
["5","11","316","-1",7783,2391,94.19,988,62848,133.22,128.57,2514,3525,1467,219,58]
["5","11","317","-1",10573,4261,127.78,1682,96146,189.66,159.02000000000001,2783,4810,2716,203,61]
["5","11","318","-1",8120,2304,90.55,1744,93190,123.68,115.66,2141,3103,2229,401,246]
["5","11","319","-1",4124,1201,93.59,657,38893,130.63999999999999,127.14,1189,1857,996,54,28]
["5","11","320","-1",3471,935,96.74,568,31143,150.41,134.84,962,1392,991,91,35]
["5","11","321","-1",1970,565,94.73,244,15169,127.79,124.19,612,834,466,54,4]
["5","11","322","-1",1842,524,82.76,360,20017,125.51,110.77,654,644,464,44,36]
["5","11","323","-1",1697,511,98.96,340,15610,145.36000000000001,132.22999999999999,500,824,337,34,2]
["5","11","325","-1",3783,1283,105.08,632,39563,133.24,126.23,1153,1695,767,76,92]
["5","11","326","-1",2149,689,99.95,301,17390,144.47999999999999,135.94,575,1050,459,50,15]
["5","11","327","-1",2960,1457,160.02000000000001,464,30635,141.35,120.94,475,1745,572,98,70]
["5","11","328","-1",2298,625,83.65,191,13868,140.62,124.75,808,942,413,99,36]
["5","11","329","-1",2596,693,90.32,465,25003,127.24,114.62,718,1069,707,14,88]
["5","11","330","-1",2712,791,98.41,343,25456,148.84,129.33000000000001,844,1124,547,170,27]
["5","11","331","-1",6604,2702,111.47,563,29281,185.4,165.76,1772,3516,1208,47,61]
["5","11","333","-1",1642,513,96.45,260,12476,122.82,113.57,454,694,405,58,31]
["5","11","334","-1",2368,733,104.86,405,22604,129.62,133.33000000000001,470,1197,560,102,39]
["5","11","335","-1",3476,1198,124.16,804,41140,139.81,150.18,756,1398,1023,210,89]
["5","11","339","-1",3304,852,110.34,460,29081,115.73,120.66,1145,1247,605,270,37]
["5","11","340","-1",1277,344,86.2,206,10725,144.02000000000001,140.30000000000001,447,615,168,41,6]
["5","11","341","-1",2933,901,102.29,566,33999,126.76,133.11000000000001,719,1461,601,123,29]
["5","11","343","-1",1974,494,85.66,332,22052,112.78,120.86,756,794,375,37,12]
["5","11","344","-1",3589,770,101.03,495,24756,127.18,123.8,1226,1636,694,13,20]
["5","11","345","-1",4578,1805,124.85,657,40092,166.14,166.64,1350,2232,827,133,36]
["5","11","346","-1",6126,2079,114.24,1211,70810,99.73,96.2,1247,2186,1820,722,151]
["5","11","347","-1",1079,465,110.8,156,8601,129.91999999999999,114.49,146,313,395,122,103]
["5","11","348","-1",2209,736,122.71,228,12527,143.59,173.08,717,1011,447,30,4]
["5","11","349","-1",8433,2808,105.07,1907,100737,142.30000000000001,139,2655,3795,1789,110,84]
["5","11","350","-1",1898,459,106.06,294,18124,130.22999999999999,122.07,676,849,348,20,5]
["5","11","351","-1",4249,1409,106.29,743,44183,131.19,123,1195,2028,931,62,33]
["5","11","354","-1",1019,286,100.43,213,12693,124.69,134.03,288,416,271,24,20]
["5","11","355","-1",3285,1742,184.58,658,31367,221.68,207.84,425,2060,697,78,25]
["5","11","358","-1",494,169,115.16,119,8481,163.82,164.3,146,168,151,26,3]
["5","11","362","-1",7434,2460,98.39,1100,59939,133.85,125.9,2325,3077,1657,188,187]
["5","11","372","-1",7,null,1.43,null,null,null,null,7]
["5","11","373","-1",606,160,84.77,88,5658,131.74,137.86000000000001,198,237,154,16,1]
["5","11","377","-1",6996,2280,95.53,1087,62948,126.23,123.89,2093,3085,1625,127,66]
["5","11","402","-1",1799,522,143.63,457,25754,122.11,122.98,442,900,383,54,20]
["5","11","405","-1",338,82,81.72,30,1617,168.33,140.55000000000001,92,184,49,10,3]
["5","11","436","-1",1021,329,97.01,220,10838,135.1,127.27,276,509,216,5,15]
["5","11","437","-1",466,165,115.27,92,6734,123.18,135.04,117,217,120,8,4]
["5","11","438","-1",884,252,96.17,171,10049,148.91999999999999,130.74,196,457,201,25,5]
["5","11","442","-1",325,72,92.42,45,2508,94.22,144.91,74,164,77,10]
["5","11","452","-1",995,253,95.07,166,7938,137.66999999999999,141.97,337,381,179,88,10]
["5","11","459","-1",798,244,97.98,136,6829,144.99,136.72999999999999,249,348,181,20]
["5","11","460","-1",321,57,66.83,49,2831,101.47,122.47,131,132,53,5]
["5","11","463","-1",425,129,96.98,44,3848,161.93,144.77000000000001,122,215,72,14,2]
["5","11","499","-1",725426,204548,101.71,17,1090,71.41,82.49,89784,581984,53553,105]
["5","11","100","-1",899681,260773,102.38,27277,1566556,138.72,131.07,142393,657554,91280,5908,2546]
["5","12","-1","-1",616,121,65.45,306,16720,67.98,57.55,473,103,22,9,9]
["5","12","310","-1",17,2,31.94,null,27,null,55.22,14,3]
["5","12","330","-1",837,318,144.78,269,15739,144.57,174.34,318,232,46,174,67]
["5","12","335","-1",787,270,143.24,336,16769,131.30000000000001,143.68,332,125,184,111,35]
["5","12","499","-1",32840,9446,99.24,null,92,null,102.67,15166,17145,297,232]
["5","12","100","-1",35097,10157,100.69,911,49347,113.95,124.15,16303,17608,549,526,111]
["5","13","-1","-1",3,1,86.33,null,56,null,13.95,null,2,1]
["5","13","301","-1",35,8,70.510000000000005,13,304,27.85,57.67,null,16,14,4,1]
["5","13","304","-1",39,6,62.59,7,362,91.86,57.3,null,15,18,3,3]
["5","13","306","-1",16,3,65,3,250,3.67,60.36,null,7,6,2,1]
["5","13","307","-1",72,14,67.959999999999994,16,494,49.81,58.75,null,24,41,6,1]
["5","13","308","-1",24,1,30.13,4,300,25.5,60.77,1,9,13,1]
["5","13","309","-1",30,7,76.73,6,275,46.83,58.41,null,12,13,3,2]
["5","13","310","-1",113,13,54.4,22,733,46.05,61.59,null,45,50,16,2]
["5","13","311","-1",80,13,61.74,13,775,41.54,89.53,null,29,26,17,8]
["5","13","313","-1",84,13,55.69,11,313,49.45,75.63,null,63,19,2]
["5","13","314","-1",142,14,45.49,25,1225,45.08,64.39,2,79,52,4,5]
["5","13","315","-1",30,1,27,12,393,21,47.55,null,13,13,2,2]
["5","13","316","-1",200,28,50.01,27,1489,58.26,67.86,null,119,64,13,4]
["5","13","317","-1",184,13,36.33,60,1549,60.42,65.61,null,87,89,8]
["5","13","318","-1",224,22,41.89,70,2072,45.41,56.18,null,85,104,23,12]
["5","13","319","-1",112,14,52.28,39,1106,40.82,57.22,null,51,57,3,1]
["5","13","320","-1",123,14,46.57,31,926,36.35,58.23,null,44,77,2]
["5","13","321","-1",24,2,30.46,2,335,1.5,46.3,null,12,10,2]
["5","13","322","-1",24,2,35.92,14,493,23.21,29.66,1,7,14,1,1]
["5","13","323","-1",64,10,59.61,12,432,71.67,67.45,null,32,28,4]
["5","13","325","-1",88,13,49.3,25,676,40.28,56,null,43,36,7,2]
["5","13","326","-1",67,9,46.63,27,684,61.33,58.97,null,19,46,2]
["5","13","327","-1",40,7,57.68,21,580,29.14,50.84,3,28,4,3,2]
["5","13","328","-1",91,15,65.44,16,487,65.31,59.38,null,45,40,1,5]
["5","13","329","-1",36,2,23.08,25,539,16.440000000000001,35.06,null,16,16,2,2]
["5","13","330","-1",59,6,55.92,23,626,53,56.34,null,29,22,8]
["5","13","331","-1",110,20,70.66,25,883,38.840000000000003,69.92,null,54,47,8,1]
["5","13","333","-1",24,2,29.67,9,463,12.11,27.56,2,7,8,5,2]
["5","13","334","-1",57,8,56.81,17,459,37.24,65.489999999999995,null,28,15,11,3]
["5","13","335","-1",91,10,67.67,18,656,49.83,52.54,null,38,44,6,3]
["5","13","339","-1",61,2,19.850000000000001,15,641,28.07,45.32,null,17,17,23,4]
["5","13","340","-1",47,6,56.79,13,372,42.31,69.56,null,31,14,2]
["5","13","341","-1",41,4,45.51,14,498,49.36,62.63,1,23,12,5]
["5","13","343","-1",71,9,52.8,27,520,41,60.31,null,36,33,1,1]
["5","13","344","-1",42,3,34.86,8,689,16.88,62.17,null,19,18,1,4]
["5","13","345","-1",103,15,54.59,20,614,32.6,71.150000000000006,null,49,49,4,1]
["5","13","346","-1",91,10,47.67,25,890,47.6,62.46,1,53,20,14,3]
["5","13","347","-1",24,2,40.630000000000003,null,180,null,41.67,null,6,7,7,4]
["5","13","348","-1",40,3,40.85,14,473,39.79,59.83,null,23,14,2,1]
["5","13","349","-1",215,19,42.61,62,1803,16.899999999999999,55.69,null,83,120,9,3]
["5","13","350","-1",21,1,35.14,6,363,84.17,58.18,null,11,10]
["5","13","351","-1",107,14,50.16,30,1134,30.23,50.69,null,61,42,4]
["5","13","354","-1",28,5,72.069999999999993,19,391,24.32,52.15,null,8,18,1,1]
["5","13","355","-1",124,28,75.569999999999993,30,973,78.569999999999993,90.38,null,92,29,3]
["5","13","358","-1",17,3,74.12,6,565,103.17,73.11,1,1,14,1]
["5","13","362","-1",204,19,42.17,30,1327,62.67,63.58,1,91,94,5,13]
["5","13","372","-1",2,null,57.5,null,null,null,null,null,1,null,1]
["5","13","373","-1",26,8,77.69,14,267,44.57,46.85,1,10,13,2]
["5","13","377","-1",230,30,53.07,52,1531,49.21,71.84,null,149,71,5,5]
["5","13","402","-1",23,1,28.83,14,416,9.2100000000000009,43.21,null,8,12,2,1]
["5","13","405","-1",9,2,66.11,3,88,41,37.75,1,4,4]
["5","13","436","-1",34,7,75.150000000000006,18,373,45.5,67.89,null,20,13,1]
["5","13","437","-1",15,2,56.33,11,253,11.55,50.21,1,3,9,2]
["5","13","438","-1",27,8,90.19,14,311,36.64,57.3,null,15,11,1]
["5","13","442","-1",12,3,49.92,5,168,3.8,64.13,null,6,5,1]
["5","13","452","-1",18,2,39.67,9,251,50.22,56.11,null,10,4,3,1]
["5","13","459","-1",43,6,58.4,13,326,68.08,62.05,null,15,24,4]
["5","13","460","-1",17,3,70.59,7,125,59.29,42.99,null,10,7]
["5","13","463","-1",23,2,41.83,6,220,14.5,66.22,null,9,12,1,1]
["5","13","499","-1",5362,1086,76.5,null,null,null,null,null,5304,35,22,1]
["5","13","100","-1",9363,1594,65.75,1078,35697,43,60.28,16,7226,1718,296,107]
["5","14","-1","-1",null,null,null,null,3,null,71.67]
["5","14","377","-1",null,null,null,null,1,null,136]
["5","14","499","-1",1,1,197,null,null,null,null,null,1]
["5","14","100","-1",1,1,197,null,4,null,87.75,null,1]
["5","0","35","-1",771429,215785,100.79,538,31416,85.57,87.76,110894,605347,54728,437,23]
["5","0","384","-1",36323,11410,104.31,6947,372852,131.24,131.52000000000001,10410,15668,8329,1318,598]
["5","0","393","-1",55009,17988,108.53,9358,524036,146.01,134.11000000000001,14964,24665,13175,1481,724]
["5","0","394","-1",46999,16540,109.56,6756,397651,134.03,126.39,12855,21804,9381,2013,946]
["5","0","395","-1",34382,10802,104.51,5667,325649,124.29,126.72,9589,14905,7934,1481,473]
["5","11","35","-1",733147,205240,101.04,246,14800,122.59,125.96,95663,582885,54395,183,21]
["5","11","384","-1",34597,11044,105.05,6373,348227,134.91,132.65,10000,15164,7763,1136,534]
["5","11","393","-1",53413,17726,109.98,8995,511886,149.44999999999999,135.72999999999999,14795,23920,12604,1405,689]
["5","11","394","-1",45027,16061,110.31,6213,373282,137.57,125.9,12429,21105,8891,1752,850]
["5","11","395","-1",33497,10702,106,5450,318361,127.5,128.13,9506,14480,7627,1432,452]
["5","13","35","-1",5365,1087,76.5,null,56,null,13.95,null,5306,36,22,1]
["5","13","384","-1",865,96,48.09,238,7839,32.880000000000003,54.77,4,379,382,71,29]
["5","13","393","-1",1312,156,47.82,349,11936,49.1,61.3,6,660,551,68,27]
["5","13","394","-1",1021,157,58.32,274,8597,43.41,60.15,3,459,443,87,29]
["5","13","395","-1",800,98,51.59,217,7269,43.75,65.05,3,422,306,48,21]
["6","0","100","-1",944142,272525,101.95,29266,1651604,134.41999999999999,129.33000000000001]
["6","11","100","-1",899171,259701,102.24,26906,1544538,138.35,131.53]
["6","11","AK","-1",2858,903,110.21,81,4714,128.94999999999999,137.61000000000001]
["6","11","AL","-1",22098,6191,98.64,617,38202,138.24,131.19]
["6","11","AR","-1",10714,2979,99.76,302,17114,146.36000000000001,136.74]
["6","11","AZ","-1",22384,6769,105.37,648,34134,132.41,133.37]
["6","11","CA","-1",71628,21380,105.8,2120,120365,132.19999999999999,130.09]
["6","11","CO","-1",16726,4126,92.45,483,30395,125.94,125.97]
["6","11","CT","-1",4731,1403,102.13,168,8572,137.74,131.76]
["6","11","DC","-1",1045,317,108.39,34,1814,113.32,133.59]
["6","11","DE","-1",2743,749,100.27,93,4784,136.99,132.41]
["6","11","FL","-1",80116,21709,99.21,2503,142478,136.79,128.77000000000001]
["6","11","GA","-1",45525,12476,98.86,1413,78176,135.51,125.98]
["6","11","HI","-1",5874,1823,108.22,174,9450,128.9,126.26]
["6","11","IA","-1",7337,2226,103.75,209,12354,161.41999999999999,137.85]
["6","11","ID","-1",5079,1495,106.26,158,8850,149.56,137.22]
["6","11","IL","-1",20541,6275,105.71,591,33555,150.66,138.74]
["6","11","IN","-1",16099,4561,99.25,463,27942,138.41999999999999,132.29]
["6","11","KS","-1",7925,2503,104.33,256,12790,136.26,134.72999999999999]
["6","11","KY","-1",12901,4053,106.37,372,20959,150.31,136.97]
["6","11","LA","-1",17005,4982,102.09,485,28566,144.11000000000001,132.75]
["6","11","MA","-1",8632,2576,107.2,251,15837,135.52000000000001,131.99]
["6","11","MD","-1",17585,4837,98.67,514,31287,128.87,129.05000000000001]
["6","11","ME","-1",4057,1144,102.56,114,6158,136.77000000000001,142.88999999999999]
["6","11","MI","-1",18502,5309,100.77,541,33734,137.47999999999999,134.46]
["6","11","MN","-1",10968,3023,98.65,333,20230,131.57,129.13]
["6","11","MO","-1",16185,4561,99.93,484,28532,151.55000000000001,134.5]
["6","11","MS","-1",12578,3738,105.72,364,19882,140.43,134.26]
["6","11","MT","-1",4064,1245,106.47,93,6363,153.78,137.69999999999999]
["6","11","NC","-1",39880,11062,98.64,1286,74710,130.29,123.44]
["6","11","ND","-1",2103,705,107.8,67,3265,165.72,141.52000000000001]
["6","11","NE","-1",5610,1579,97.32,185,10426,132.91999999999999,130.38999999999999]
["6","11","NH","-1",2817,793,101.07,101,4922,144.80000000000001,141.19]
["6","11","NJ","-1",11044,3292,104.31,309,18605,139.41,136.69]
["6","11","NM","-1",6810,2264,109.5,167,10024,141.74,140.57]
["6","11","NV","-1",12387,3884,108.46,370,19476,143.38999999999999,140.13]
["6","11","NY","-1",21072,6282,103.59,658,36925,146.33000000000001,134.09]
["6","11","OH","-1",25271,7441,102.92,794,46740,142.47999999999999,133.02000000000001]
["6","11","OK","-1",15635,4280,96.8,479,27658,131.13,130.02000000000001]
["6","11","OR","-1",9222,2864,109.19,253,16625,141.37,140.5]
["6","11","OT","-1",10911,5869,171.5,257,10157,218.61,201.92]
["6","11","PA","-1",24533,7065,101.33,676,39946,149.6,137.56]
["6","11","PI","-1",2,null,110]
["6","11","PR","-1",7550,2461,109.24,296,12870,136.19999999999999,114.03]
["6","11","RI","-1",2009,579,101.76,68,3910,125.32,129.94]
["6","11","SC","-1",23564,6640,101.39,688,41904,135.57,127.64]
["6","11","SD","-1",2776,890,110.42,98,5572,136.88,140.91999999999999]
["6","11","TN","-1",22205,6176,99.04,728,40502,139.94999999999999,132]
["6","11","TX","-1",105119,28570,98.08,3090,180794,132.81,128.68]
["6","11","UT","-1",5701,1761,105.62,149,8526,145,134.86000000000001]
["6","11","VA","-1",35671,9625,97.24,1162,63338,136.49,128.65]
["6","11","VT","-1",1019,343,108.39,26,1621,125.46,141.56]
["6","11","WA","-1",19479,5992,107.72,550,32217,140.47999999999999,132.05000000000001]
["6","11","WI","-1",12899,3621,99.52,367,23191,144.59,134.76]
["6","11","WV","-1",5783,1702,102.56,152,9829,143.63,135.01]
["6","11","WY","-1",2199,608,108.64,66,3548,139.29,142.88]
["6","12","100","-1",35607,11229,104.1,1282,71365,128.83000000000001,116.19]
["6","12","AK","-1",60,22,108.27,2,114,70.5,105.46]
["6","12","AL","-1",1016,341,107.17,33,2019,130.88,122.07]
["6","12","AR","-1",510,175,104.95,23,1040,235.43,110.8]
["6","12","AZ","-1",914,287,101.08,33,1860,140.27000000000001,114.9]
["6","12","CA","-1",2792,854,103.81,106,5569,132.12,120.39]
["6","12","CO","-1",534,147,95.6,26,1008,144.5,121.51]
["6","12","CT","-1",236,65,98.97,16,491,169.5,127.65]
["6","12","DC","-1",42,9,87.71,null,66,null,148.72999999999999]
["6","12","DE","-1",99,22,86.73,1,252,54,104.96]
["6","12","FL","-1",3050,859,97.4,116,6088,113.22,115.13]
["6","12","GA","-1",1498,445,101.28,46,2868,138.30000000000001,118.01]
["6","12","HI","-1",144,36,90.8,4,266,194.75,106.54]
["6","12","IA","-1",463,144,98.71,10,797,105.5,127.64]
["6","12","ID","-1",195,58,93.08,8,406,126.75,100.36]
["6","12","IL","-1",935,289,99.51,28,1889,143.5,119.35]
["6","12","IN","-1",712,258,111.52,26,1346,148,109.6]
["6","12","KS","-1",361,111,103.63,11,694,65.27,116.83]
["6","12","KY","-1",466,155,106.84,23,1182,85.3,106.9]
["6","12","LA","-1",658,210,99.42,17,1321,117,126]
["6","12","MA","-1",453,171,114.89,22,809,164.14,115.42]
["6","12","MD","-1",507,148,99.64,29,1006,123.14,116.44]
["6","12","ME","-1",139,48,119.12,7,317,75.290000000000006,84.49]
["6","12","MI","-1",1045,374,113.83,41,2311,184.63,114.51]
["6","12","MN","-1",469,154,107.31,17,1071,99,107.04]
["6","12","MO","-1",799,237,103.79,31,1623,115.87,118.83]
["6","12","MS","-1",465,131,102.48,12,912,82,124.31]
["6","12","MT","-1",154,47,103.69,4,322,78.75,109.92]
["6","12","NC","-1",1420,435,103.31,52,3038,143.52000000000001,104.26]
["6","12","ND","-1",66,22,96.39,null,154,null,112.09]
["6","12","NE","-1",210,70,110.89,13,424,150.91999999999999,101.64]
["6","12","NH","-1",124,41,118.15,3,256,177.33,119.45]
["6","12","NJ","-1",614,207,109.99,15,1071,104.27,122.49]
["6","12","NM","-1",247,74,101.66,7,538,114.14,109.76]
["6","12","NV","-1",435,141,106.52,13,825,153.85,126.9]
["6","12","NY","-1",1163,368,105.58,38,2128,101.95,116.92]
["6","12","OH","-1",1346,475,108.83,48,2699,111.21,118.73]
["6","12","OK","-1",614,180,100.68,21,1464,93.57,102.84]
["6","12","OR","-1",431,140,101.73,10,998,111.2,107.42]
["6","12","OT","-1",251,99,122.03,10,439,168.6,124.42]
["6","12","PA","-1",1352,404,100.93,51,2254,101.24,137.01]
["6","12","PR","-1",484,155,111.93,13,862,173.54,150.44999999999999]
["6","12","RI","-1",75,22,111.73,3,166,77,115.36]
["6","12","SC","-1",952,315,110.13,36,1990,132.08000000000001,115.62]
["6","12","SD","-1",93,37,110.31,3,217,53,97.17]
["6","12","TN","-1",955,313,102.76,30,1983,119.67,112.58]
["6","12","TX","-1",3285,1009,104,123,6587,132.97999999999999,116.3]
["6","12","UT","-1",248,72,94.73,8,404,104.75,117.43]
["6","12","VA","-1",940,319,106.79,35,1897,142.77000000000001,112.33]
["6","12","VT","-1",26,10,124.42,1,79,176,103]
["6","12","WA","-1",702,222,104.17,30,1464,120.07,107.13]
["6","12","WI","-1",551,194,107.81,13,1113,141.69,107.16]
["6","12","WV","-1",241,79,107.44,12,534,80.67,104.05]
["6","12","WY","-1",66,29,122.5,2,134,83.5,107.44]
["6","13","100","-1",9363,1594,65.75,1078,35697,43,60.28]
["6","13","AK","-1",78,11,62.29,10,271,40.6,63.37]
["6","13","AL","-1",188,32,67.31,18,669,46.11,58.77]
["6","13","AR","-1",55,20,95.69,6,237,91.33,70.849999999999994]
["6","13","AZ","-1",218,41,66.459999999999994,31,813,47.71,60.87]
["6","13","CA","-1",970,170,68.790000000000006,109,3612,60.36,58.45]
["6","13","CO","-1",236,27,53.71,42,1191,35.83,50.65]
["6","13","CT","-1",37,5,59.05,9,157,61.22,75.13]
["6","13","DC","-1",32,7,73.38,4,80,118.75,65.56]
["6","13","DE","-1",34,2,47.09,2,87,1.5,49.72]
["6","13","FL","-1",808,141,62.81,106,3301,46.85,60.31]
["6","13","GA","-1",415,67,63.75,38,1488,48.08,66.790000000000006]
["6","13","HI","-1",112,15,57.64,11,450,57.55,59.03]
["6","13","IA","-1",36,8,68.25,4,159,1.5,61.31]
["6","13","ID","-1",55,12,65.709999999999994,8,274,17.13,53.26]
["6","13","IL","-1",164,31,70.099999999999994,19,571,46,65.349999999999994]
["6","13","IN","-1",94,14,70.23,9,286,99.22,74.69]
["6","13","KS","-1",109,26,71.73,11,378,46.55,57.53]
["6","13","KY","-1",106,16,69.08,7,375,29.86,53.7]
["6","13","LA","-1",102,19,63.27,11,339,27.82,63.25]
["6","13","MA","-1",79,17,75.680000000000007,6,217,12,72.84]
["6","13","MD","-1",291,48,64.86,37,1107,32.049999999999997,65.89]
["6","13","ME","-1",23,3,77.17,5,77,75.400000000000006,92.32]
["6","13","MI","-1",111,22,78.709999999999994,10,334,90.2,82.62]
["6","13","MN","-1",55,10,62.45,6,193,71.5,79.11]
["6","13","MO","-1",175,37,81.75,10,503,61,61.34]
["6","13","MS","-1",79,20,84.35,8,210,37.630000000000003,73.55]
["6","13","MT","-1",33,11,97.58,7,111,14.43,71.48]
["6","13","NC","-1",539,88,63.68,71,2306,34.340000000000003,51.28]
["6","13","ND","-1",23,3,62.65,3,61,33.33,59.72]
["6","13","NE","-1",69,8,49.71,8,219,72.38,58.75]
["6","13","NH","-1",28,6,97.61,null,72,null,71.180000000000007]
["6","13","NJ","-1",101,17,64.260000000000005,4,331,39.75,66.05]
["6","13","NM","-1",65,9,63.42,10,213,46.5,85.6]
["6","13","NV","-1",115,19,60.08,21,545,7.9,46.25]
["6","13","NY","-1",162,30,67.03,10,511,33.1,73.05]
["6","13","OH","-1",160,20,52.99,17,608,88.94,61.68]
["6","13","OK","-1",98,16,56.79,18,512,4.3899999999999997,52.57]
["6","13","OR","-1",53,10,88.75,6,215,2.5,71.16]
["6","13","OT","-1",276,68,90.56,14,684,66.709999999999994,88.58]
["6","13","PA","-1",128,20,59.46,19,557,38.47,63.3]
["6","13","PR","-1",35,11,86.46,null,75,null,70.39]
["6","13","RI","-1",15,2,80.33,1,41,48,71.44]
["6","13","SC","-1",233,31,60,22,800,53.64,61.8]
["6","13","SD","-1",29,7,67.31,5,91,34.200000000000003,67.650000000000006]
["6","13","TN","-1",223,22,50.91,23,941,42.48,52.64]
["6","13","TX","-1",989,183,68.28,114,4148,34.04,56.7]
["6","13","UT","-1",72,7,51.82,9,302,6.33,52.49]
["6","13","VA","-1",793,105,58.9,89,3155,39.299999999999997,55.95]
["6","13","VT","-1",8,4,100.75,2,38,39,46.26]
["6","13","WA","-1",330,52,62.38,44,1344,29.39,58.53]
["6","13","WI","-1",75,15,62.92,15,278,38.6,74.19]
["6","13","WV","-1",22,4,72.73,1,85,70,78]
["6","13","WY","-1",27,5,56.59,8,75,36.380000000000003,67.989999999999995]
["6","14","100","-1",1,1,197,null,4,null,87.75]
["6","14","CO","-1",null,null,null,null,1,null,41]
["6","14","MI","-1",null,null,null,null,1,null,84]
["6","14","NE","-1",null,null,null,null,1,null,136]
["6","14","OH","-1",null,null,null,null,1,null,90]
["6","14","OT","-1",1,1,197]
["6","0","AK","-1",2996,936,108.92,93,5099,118.19,132.94]
["6","0","AL","-1",23302,6564,98.76,668,40890,135.4,129.55000000000001]
["6","0","AR","-1",11279,3174,99.97,331,18391,151.55000000000001,134.43]
["6","0","AZ","-1",23516,7097,104.84,712,36807,129.09,130.84]
["6","0","CA","-1",75390,22404,105.25,2335,129546,128.84,127.67]
["6","0","CO","-1",17496,4300,92.02,551,32595,119.95,123.08]
["6","0","CT","-1",5004,1473,101.67,193,9220,136.80000000000001,130.58000000000001]
["6","0","DC","-1",1119,333,106.61,38,1960,113.89,131.32]
["6","0","DE","-1",2876,773,99.17,96,5123,133.30000000000001,129.66]
["6","0","FL","-1",83974,22709,98.8,2725,151867,132.28,126.74]
["6","0","GA","-1",47438,12988,98.63,1497,82532,133.38,124.63]
["6","0","HI","-1",6130,1874,106.89,189,10166,126.14,122.77]
["6","0","IA","-1",7836,2378,103.29,223,13310,156.04,136.33000000000001]
["6","0","ID","-1",5329,1565,105.36,174,9530,142.43,133.24]
["6","0","IL","-1",21640,6595,105.17,638,36015,147.22999999999999,136.56]
["6","0","IN","-1",16905,4833,99.6,498,29574,138.21,130.69999999999999]
["6","0","KS","-1",8395,2640,103.88,278,13862,129.9,131.72999999999999]
["6","0","KY","-1",13473,4224,106.09,402,22516,144.5,134]
["6","0","LA","-1",17765,5211,101.77,513,30226,140.71,131.66999999999999]
["6","0","MA","-1",9164,2764,107.3,279,16863,135.12,130.44]
["6","0","MD","-1",18383,5033,98.16,580,33400,122.41,126.58]
["6","0","ME","-1",4219,1195,102.97,126,6552,130.91999999999999,139.47]
["6","0","MI","-1",19658,5705,101.34,592,36380,139.94,132.72]
["6","0","MN","-1",11492,3187,98.83,356,21494,129.01,127.58]
["6","0","MO","-1",17159,4835,99.92,525,30658,147.72,132.47]
["6","0","MS","-1",13122,3889,105.48,384,21004,136.46,133.22]
["6","0","MT","-1",4251,1303,106.3,104,6796,141.52000000000001,135.30000000000001]
["6","0","NC","-1",41839,11585,98.35,1409,80054,125.94,120.64]
["6","0","ND","-1",2192,730,106.98,70,3480,160.04,138.79]
["6","0","NE","-1",5889,1657,97.25,206,11070,131.71,127.87]
["6","0","NH","-1",2969,840,101.75,104,5250,145.74,139.16999999999999]
["6","0","NJ","-1",11759,3516,104.27,328,20007,136.59,134.76]
["6","0","NM","-1",7122,2347,108.81,184,10775,135.51,137.94999999999999]
["6","0","NV","-1",12937,4044,107.96,404,20846,136.68,137.15]
["6","0","NY","-1",22397,6680,103.43,706,39564,142.33000000000001,132.37]
["6","0","OH","-1",26777,7936,102.92,859,50048,139.66999999999999,131.38999999999999]
["6","0","OK","-1",16347,4476,96.7,518,29634,125.2,127.34]
["6","0","OR","-1",9706,3014,108.74,269,17838,137.15,137.82]
["6","0","OT","-1",11439,6037,168.47,281,11280,209.26,192.03]
["6","0","PA","-1",26013,7489,101.11,746,42757,143.46,136.56]
["6","0","PI","-1",2,null,110]
["6","0","PR","-1",8069,2627,109.3,309,13807,137.77000000000001,116.06]
["6","0","RI","-1",2099,603,101.96,72,4117,122.24,128.77000000000001]
["6","0","SC","-1",24749,6986,101.34,746,44694,132.99,125.93]
["6","0","SD","-1",2898,934,109.98,106,5880,129.66,138.16999999999999]
["6","0","TN","-1",23383,6511,98.73,781,43426,136.30000000000001,129.38999999999999]
["6","0","TX","-1",109393,29762,97.99,3327,191529,129.43,126.69]
["6","0","UT","-1",6021,1840,104.53,166,9232,135.54,131.41]
["6","0","VA","-1",37404,10049,96.66,1286,68390,129.94,124.84]
["6","0","VT","-1",1053,357,108.72,29,1738,121.24,137.72]
["6","0","WA","-1",20511,6266,106.87,624,35025,131.66999999999999,128.19]
["6","0","WI","-1",13525,3830,99.66,395,24582,140.47,132.83000000000001]
["6","0","WV","-1",6046,1785,102.65,165,10448,138.61000000000001,132.96]
["6","0","WY","-1",2292,642,108.43,76,3757,126.99,140.12]
["6","0","35","-1",11439,6037,168.47,281,11280,209.26,192.03]
["6","0","384","-1",188481,52009,98.44,5815,333407,129.81,127.74]
["6","0","393","-1",351843,98302,99.69,11216,628245,133.65,126.6]
["6","0","394","-1",222719,64790,101.96,6804,393808,139.19999999999999,132.69]
["6","0","395","-1",169660,51387,106.05,5150,284864,130.88999999999999,130.09]
["6","11","35","-1",10911,5869,171.5,257,10157,218.61,201.92]
["6","11","384","-1",180462,49755,98.58,5359,313395,134.18,129.91999999999999]
["6","11","393","-1",335590,93794,99.96,10368,588530,137.32,128.69]
["6","11","394","-1",210784,61148,102.02,6252,368075,142.28,134.49]
["6","11","395","-1",161424,49135,106.7,4670,264381,135.75,132.93]
["6","12","35","-1",251,99,122.03,10,439,168.6,124.42]
["6","12","384","-1",6315,1950,103.23,230,12872,122.34,114.03]
["6","12","393","-1",12655,3932,103.06,448,25734,129.9,115.63]
["6","12","394","-1",10218,3342,106.48,373,19876,129.28,118.39]
["6","12","395","-1",6168,1906,102.44,221,12444,130.86000000000001,115.76]
["6","13","35","-1",276,68,90.56,14,684,66.709999999999994,88.58]
["6","13","384","-1",1704,304,65.17,226,7138,33.869999999999997,56.72]
["6","13","393","-1",3598,576,62.97,400,13981,42.88,58.46]
["6","13","394","-1",1717,300,68.03,179,5855,52.41,67.760000000000005]
["6","13","395","-1",2068,346,65.86,259,8039,43.36,58.74]
["6","14","35","-1",1,1,197]
["6","14","384","-1",null,null,null,null,2,null,88.5]
["6","14","394","-1",null,null,null,null,2,null,87]
["5","0","AK-1","499",508,193,124.64,null,null,null,null,107,243,134,19,5]
["5","11","AK-1","499",478,189,129.24,null,null,null,null,105,236,117,16,4]
["5","12","AK-1","499",4,1,141.75,null,null,null,null,2,null,1,1]
["5","13","AK-1","499",26,3,37.380000000000003,null,null,null,null,null,7,16,2,1]
["5","0","AK463","499",60,3,20.03,null,null,null,null,48,9,2,null,1]
["5","11","AK463","499",51,3,22.16,null,null,null,null,45,6]
["5","12","AK463","499",3,null,3.67,null,null,null,null,3]
["5","13","AK463","499",6,null,10.17,null,null,null,null,null,3,2,null,1]
["5","0","AK499","499",2428,740,107.83,null,null,null,null,251,2063,114]
["5","11","AK499","499",2332,714,108.41,null,null,null,null,229,1990,113]
["5","12","AK499","499",50,18,103.36,null,null,null,null,22,28]
["5","13","AK499","499",46,8,83.17,null,null,null,null,null,45,1]
["5","0","AL-1","499",3946,1364,112.96,null,null,null,null,1013,1732,968,165,68]
["5","11","AL-1","499",3827,1341,113.87,null,null,null,null,987,1688,935,154,63]
["5","12","AL-1","499",48,14,119.38,null,null,null,null,26,9,3,7,3]
["5","13","AL-1","499",71,9,59.54,null,null,null,null,null,35,30,4,2]
["5","0","AL322","499",552,29,21.76,null,null,null,null,439,67,40,3,3]
["5","11","AL322","499",536,27,21.38,null,null,null,null,428,66,36,3,3]
["5","12","AL322","499",11,1,16.09,null,null,null,null,11]
["5","13","AL322","499",5,1,74.2,null,null,null,null,null,1,4]
["5","0","AL499","499",18804,5171,98.04,null,null,null,null,3035,14278,1475,16]
["5","11","AL499","499",17751,4856,98.04,null,null,null,null,2601,13680,1464,6]
["5","12","AL499","499",941,293,101.07,null,null,null,null,434,486,11,10]
["5","13","AL499","499",112,22,71.94,null,null,null,null,null,112]
["5","0","AR-1","499",1966,648,109.84,null,null,null,null,516,917,422,79,32]
["5","11","AR-1","499",1924,637,109.82,null,null,null,null,508,909,404,73,30]
["5","12","AR-1","499",23,9,166.09,null,null,null,null,7,5,4,6,1]
["5","13","AR-1","499",19,2,43.79,null,null,null,null,1,3,14,null,1]
["5","0","AR350","499",324,23,34.479999999999997,null,null,null,null,234,72,15,2,1]
["5","11","AR350","499",320,23,34.770000000000003,null,null,null,null,231,71,15,2,1]
["5","12","AR350","499",3,null,3.33,null,null,null,null,3]
["5","13","AR350","499",1,null,35,null,null,null,null,null,1]
["5","0","AR499","499",8989,2503,100.18,null,null,null,null,1240,7136,609,4]
["5","11","AR499","499",8476,2328,99.95,null,null,null,null,1030,6839,605,2]
["5","12","AR499","499",478,157,102.33,null,null,null,null,210,262,4,2]
["5","13","AR499","499",35,18,125.6,null,null,null,null,null,35]
["5","0","AZ-1","499",3774,1391,116.27,null,null,null,null,877,1885,840,119,53]
["5","11","AZ-1","499",3666,1362,117.11,null,null,null,null,863,1854,795,110,44]
["5","12","AZ-1","499",46,19,142.04,null,null,null,null,14,9,11,5,7]
["5","13","AZ-1","499",62,10,47.06,null,null,null,null,null,22,34,4,2]
["5","0","AZ345","499",727,117,49.65,null,null,null,null,463,200,54,8,2]
["5","11","AZ345","499",676,112,50.58,null,null,null,null,447,179,42,7,1]
["5","12","AZ345","499",17,null,2.82,null,null,null,null,16,1]
["5","13","AZ345","499",34,5,54.59,null,null,null,null,null,20,12,1,1]
["5","0","AZ499","499",19015,5589,104.68,null,null,null,null,2438,15430,1142,5]
["5","11","AZ499","499",18065,5332,105.21,null,null,null,null,2053,14878,1134]
["5","12","AZ499","499",828,231,96.83,null,null,null,null,385,430,8,5]
["5","13","AZ499","499",122,26,79.62,null,null,null,null,null,122]
["5","0","CA-1","499",11473,4161,118.85,null,null,null,null,2612,5508,2706,455,192]
["5","11","CA-1","499",11066,4075,120,null,null,null,null,2549,5360,2574,405,178]
["5","12","CA-1","499",148,51,145.93,null,null,null,null,62,32,21,26,7]
["5","13","CA-1","499",259,35,54.18,null,null,null,null,1,116,111,24,7]
["5","0","CA343","499",781,65,37.31,null,null,null,null,515,192,67,4,3]
["5","11","CA343","499",742,61,37.479999999999997,null,null,null,null,506,173,57,4,2]
["5","12","CA343","499",10,null,2.9,null,null,null,null,9,1]
["5","13","CA343","499",29,4,44.69,null,null,null,null,null,18,10,null,1]
["5","0","CA344","499",900,116,54.79,null,null,null,null,517,264,113,3,3]
["5","11","CA344","499",875,116,55.94,null,null,null,null,505,257,108,3,2]
["5","12","CA344","499",12,null,2.83,null,null,null,null,12]
["5","13","CA344","499",13,null,25.38,null,null,null,null,null,7,5,null,1]
["5","0","CA377","499",1269,316,73.7,null,null,null,null,561,453,232,16,7]
["5","11","CA377","499",1136,301,76.78,null,null,null,null,552,374,192,13,5]
["5","12","CA377","499",9,null,2.89,null,null,null,null,9]
["5","13","CA377","499",124,15,50.6,null,null,null,null,null,79,40,3,2]
["5","0","CA499","499",60967,17746,104.97,null,null,null,null,8168,48643,4133,23]
["5","11","CA499","499",57890,16942,105.52,null,null,null,null,6976,46802,4106,6]
["5","12","CA499","499",2532,688,97.23,null,null,null,null,1192,1305,23,12]
["5","13","CA499","499",545,116,82.19,null,null,null,null,null,536,4,5]
["5","0","CO-1","499",3012,934,103.96,null,null,null,null,743,1356,749,111,53]
["5","11","CO-1","499",2891,914,105.5,null,null,null,null,735,1309,703,98,46]
["5","12","CO-1","499",28,11,151.46,null,null,null,null,7,7,5,6,3]
["5","13","CO-1","499",93,9,41.88,null,null,null,null,1,40,41,7,4]
["5","0","CO339","499",497,49,43.16,null,null,null,null,341,94,40,21,1]
["5","11","CO339","499",471,47,44.28,null,null,null,null,333,85,34,18,1]
["5","12","CO339","499",8,null,2.88,null,null,null,null,8]
["5","13","CO339","499",18,2,31.78,null,null,null,null,null,9,6,3]
["5","0","CO499","499",13987,3317,91.19,null,null,null,null,1936,11012,1034,5]
["5","11","CO499","499",13369,3180,91.45,null,null,null,null,1708,10629,1031,1]
["5","12","CO499","499",493,121,90.49,null,null,null,null,228,260,3,2]
["5","13","CO499","499",125,16,65.66,null,null,null,null,null,123,null,2]
["5","0","CT-1","499",850,306,108.32,null,null,null,null,205,386,196,45,18]
["5","11","CT-1","499",827,303,109.12,null,null,null,null,203,377,187,42,18]
["5","12","CT-1","499",9,1,113.67,null,null,null,null,2,3,2,2]
["5","13","CT-1","499",14,2,57.93,null,null,null,null,null,6,7,1]
["5","0","CT308","499",116,12,37.54,null,null,null,null,89,17,7,3]
["5","11","CT308","499",112,12,38.130000000000003,null,null,null,null,87,15,7,3]
["5","12","CT308","499",2,null,7,null,null,null,null,2]
["5","13","CT308","499",2,null,35,null,null,null,null,null,2]
["5","0","CT499","499",4038,1155,102.11,null,null,null,null,531,3256,249,2]
["5","11","CT499","499",3798,1095,102.59,null,null,null,null,421,3129,247,1]
["5","12","CT499","499",219,57,97.58,null,null,null,null,110,106,2,1]
["5","13","CT499","499",21,3,62.1,null,null,null,null,null,21]
["5","0","DC-1","499",204,65,107.11,null,null,null,null,60,82,50,7,5]
["5","11","DC-1","499",189,63,110.97,null,null,null,null,57,77,44,6,5]
["5","12","DC-1","499",3,null,38.33,null,null,null,null,3]
["5","13","DC-1","499",12,2,63.5,null,null,null,null,null,5,6,1]
["5","0","DC499","499",915,268,106.5,null,null,null,null,119,718,77,1]
["5","11","DC499","499",856,255,107.94,null,null,null,null,97,681,77,1]
["5","12","DC499","499",39,8,88.92,null,null,null,null,22,17]
["5","13","DC499","499",20,5,79.3,null,null,null,null,null,20]
["5","0","DE-1","499",456,149,113.09,null,null,null,null,128,206,102,12,8]
["5","11","DE-1","499",445,148,114.51,null,null,null,null,126,201,98,12,8]
["5","12","DE-1","499",2,null,102,null,null,null,null,2]
["5","13","DE-1","499",9,1,45.33,null,null,null,null,null,5,4]
["5","0","DE460","499",86,2,13.49,null,null,null,null,70,14,2]
["5","11","DE460","499",85,2,13.54,null,null,null,null,69,14,2]
["5","12","DE460","499",1,null,9,null,null,null,null,1]
["5","0","DE499","499",2334,622,99.61,null,null,null,null,347,1836,150,1]
["5","11","DE499","499",2214,600,100.74,null,null,null,null,294,1770,150]
["5","12","DE499","499",95,21,86.85,null,null,null,null,53,41,null,1]
["5","13","DE499","499",25,1,47.72,null,null,null,null,null,25]
["5","0","FL-1","499",13509,4486,110.35,null,null,null,null,3323,6069,3288,571,258]
["5","11","FL-1","499",13117,4402,111.08,null,null,null,null,3254,5940,3155,528,240]
["5","12","FL-1","499",160,57,141.57,null,null,null,null,69,35,19,28,9]
["5","13","FL-1","499",232,27,47.16,null,null,null,null,null,94,114,15,9]
["5","0","FL317","499",2887,589,70.39,null,null,null,null,1460,866,505,49,7]
["5","11","FL317","499",2737,578,72.540000000000006,null,null,null,null,1423,812,450,45,7]
["5","12","FL317","499",37,null,3.81,null,null,null,null,37]
["5","13","FL317","499",113,11,40.08,null,null,null,null,null,54,55,4]
["5","0","FL499","499",67578,17634,97.7,null,null,null,null,9853,52717,4978,30]
["5","11","FL499","499",64321,16819,98.05,null,null,null,null,8415,50947,4947,12]
["5","12","FL499","499",2794,712,93.3,null,null,null,null,1438,1310,30,16]
["5","13","FL499","499",463,103,76.19,null,null,null,null,null,460,1,2]
["5","0","GA-1","499",7694,2531,110.43,null,null,null,null,1930,3395,1926,306,137]
["5","11","GA-1","499",7502,2490,110.72,null,null,null,null,1888,3335,1863,288,128]
["5","12","GA-1","499",83,26,144.37,null,null,null,null,42,16,9,11,5]
["5","13","GA-1","499",109,15,64.55,null,null,null,null,null,44,54,7,4]
["5","0","GA316","499",1569,219,49.6,null,null,null,null,895,463,183,25,3]
["5","11","GA316","499",1478,209,50.42,null,null,null,null,872,417,165,21,3]
["5","12","GA316","499",24,null,2.75,null,null,null,null,23,1]
["5","13","GA316","499",67,10,48.18,null,null,null,null,null,45,18,4]
["5","0","GA499","499",38175,10238,98.27,null,null,null,null,5513,29787,2858,16,1]
["5","11","GA499","499",36555,9814,98.45,null,null,null,null,4888,28815,2848,4]
["5","12","GA499","499",1381,382,98.83,null,null,null,null,625,736,9,11]
["5","13","GA499","499",239,42,67.760000000000005,null,null,null,null,null,236,1,1,1]
["5","0","HI-1","499",1070,428,119.48,null,null,null,null,232,526,244,49,19]
["5","11","HI-1","499",1030,423,122.13,null,null,null,null,232,515,219,45,19]
["5","12","HI-1","499",1,1,220,null,null,null,null,null,null,1]
["5","13","HI-1","499",39,4,46.82,null,null,null,null,null,11,24,4]
["5","0","HI459","499",144,9,23.69,null,null,null,null,108,25,11]
["5","11","HI459","499",132,8,23.24,null,null,null,null,103,22,7]
["5","12","HI459","499",5,null,3.6,null,null,null,null,5]
["5","13","HI459","499",7,1,46.43,null,null,null,null,null,3,4]
["5","0","HI499","499",4916,1437,106.59,null,null,null,null,643,3931,340,2]
["5","11","HI499","499",4725,1405,107.63,null,null,null,null,586,3798,339,2]
["5","12","HI499","499",125,22,89.01,null,null,null,null,57,67,1]
["5","13","HI499","499",66,10,65.23,null,null,null,null,null,66]
["5","0","IA-1","499",1275,461,116.44,null,null,null,null,294,648,267,46,20]
["5","11","IA-1","499",1242,454,117.04,null,null,null,null,281,641,258,43,19]
["5","12","IA-1","499",24,7,115.83,null,null,null,null,13,5,2,3,1]
["5","13","IA-1","499",9,null,35.33,null,null,null,null,null,2,7]
["5","0","IA333","499",183,13,21.41,null,null,null,null,146,27,8,2]
["5","11","IA333","499",166,13,23.08,null,null,null,null,132,25,8,1]
["5","12","IA333","499",14,null,2.86,null,null,null,null,14]
["5","13","IA333","499",3,null,15.33,null,null,null,null,null,2,null,1]
["5","0","IA499","499",6378,1904,103.01,null,null,null,null,905,5051,412,10]
["5","11","IA499","499",5937,1768,103.36,null,null,null,null,720,4804,412,1]
["5","12","IA499","499",417,128,98.95,null,null,null,null,185,223,null,9]
["5","13","IA499","499",24,8,87.21,null,null,null,null,null,24]
["5","0","ID-1","499",893,357,121.89,null,null,null,null,163,467,223,27,13]
["5","11","ID-1","499",862,346,123,null,null,null,null,160,456,207,27,12]
["5","12","ID-1","499",10,7,170.8,null,null,null,null,2,4,4]
["5","13","ID-1","499",21,4,53.1,null,null,null,null,1,7,12,null,1]
["5","0","ID347","499",106,5,13.73,null,null,null,null,93,5,5,1,2]
["5","11","ID347","499",98,4,12.63,null,null,null,null,88,3,5,1,1]
["5","12","ID347","499",5,null,3,null,null,null,null,5]
["5","13","ID347","499",3,1,67.33,null,null,null,null,null,2,null,null,1]
["5","0","ID499","499",4330,1203,104.19,null,null,null,null,400,3811,117,2]
["5","11","ID499","499",4125,1148,104.98,null,null,null,null,320,3690,115]
["5","12","ID499","499",174,48,90.8,null,null,null,null,80,90,2,2]
["5","13","ID499","499",31,7,74.099999999999994,null,null,null,null,null,31]
["5","0","IL-1","499",3503,1342,126.2,null,null,null,null,820,1599,868,151,65]
["5","11","IL-1","499",3410,1317,127.15,null,null,null,null,797,1566,839,146,62]
["5","12","IL-1","499",40,15,131.30000000000001,null,null,null,null,23,9,5,2,1]
["5","13","IL-1","499",53,10,61.26,null,null,null,null,null,24,24,3,2]
["5","0","IL328","499",551,51,36.06,null,null,null,null,373,123,39,9,7]
["5","11","IL328","499",514,46,35.090000000000003,null,null,null,null,362,106,31,9,6]
["5","12","IL328","499",11,null,3.09,null,null,null,null,11]
["5","13","IL328","499",26,5,69.19,null,null,null,null,null,17,8,null,1]
["5","0","IL499","499",17586,5202,103.14,null,null,null,null,2476,13942,1164,4]
["5","11","IL499","499",16641,4946,103.71,null,null,null,null,2070,13417,1152,2]
["5","12","IL499","499",860,240,94.87,null,null,null,null,406,440,12,2]
["5","13","IL499","499",85,16,75.88,null,null,null,null,null,85]
["5","0","IN-1","499",2823,998,116.08,null,null,null,null,684,1323,681,99,36]
["5","11","IN-1","499",2773,981,115.92,null,null,null,null,672,1302,671,93,35]
["5","12","IN-1","499",31,14,152.77000000000001,null,null,null,null,12,11,3,4,1]
["5","13","IN-1","499",19,3,78.790000000000006,null,null,null,null,null,10,7,2]
["5","0","IN326","499",409,30,33.08,null,null,null,null,264,107,37,null,1]
["5","11","IN326","499",389,29,33.6,null,null,null,null,255,100,33,null,1]
["5","12","IN326","499",9,null,3.22,null,null,null,null,9]
["5","13","IN326","499",11,1,39.18,null,null,null,null,null,7,4]
["5","0","IN499","499",13673,3805,98.19,null,null,null,null,1873,10869,928,3]
["5","11","IN499","499",12949,3571,97.87,null,null,null,null,1593,10436,920]
["5","12","IN499","499",660,224,106.98,null,null,null,null,280,371,7,2]
["5","13","IN499","499",64,10,73.03,null,null,null,null,null,62,1,1]
["5","0","KS-1","499",1381,581,125.06,null,null,null,null,301,709,304,44,23]
["5","11","KS-1","499",1320,562,126.12,null,null,null,null,296,681,283,41,19]
["5","12","KS-1","499",20,11,177.15,null,null,null,null,4,7,5,1,3]
["5","13","KS-1","499",41,8,65.540000000000006,null,null,null,null,1,21,16,2,1]
["5","0","KS452","499",206,16,25.28,null,null,null,null,156,35,11,3,1]
["5","11","KS452","499",197,16,25.74,null,null,null,null,152,32,9,3,1]
["5","12","KS452","499",4,null,3.75,null,null,null,null,4]
["5","13","KS452","499",5,null,24.6,null,null,null,null,null,3,2]
["5","0","KS499","499",6808,2043,101.96,null,null,null,null,880,5451,472,5]
["5","11","KS499","499",6427,1945,102.64,null,null,null,null,716,5239,471,1]
["5","12","KS499","499",318,80,92.59,null,null,null,null,164,150,1,3]
["5","13","KS499","499",63,18,79.510000000000005,null,null,null,null,null,62,null,1]
["5","0","KY-1","499",2203,826,116.25,null,null,null,null,511,1050,525,85,32]
["5","11","KY-1","499",2157,819,117.01,null,null,null,null,507,1035,508,77,30]
["5","12","KY-1","499",14,4,153.63999999999999,null,null,null,null,4,1,4,4,1]
["5","13","KY-1","499",32,3,48.88,null,null,null,null,null,14,13,4,1]
["5","0","KY327","499",288,35,42.64,null,null,null,null,198,75,11,2,2]
["5","11","KY327","499",277,34,42.93,null,null,null,null,193,70,10,2,2]
["5","12","KY327","499",5,null,2.8,null,null,null,null,5]
["5","13","KY327","499",6,1,62.33,null,null,null,null,null,5,1]
["5","0","KY499","499",10982,3363,105.72,null,null,null,null,1421,8711,846,4]
["5","11","KY499","499",10472,3214,105.96,null,null,null,null,1236,8394,841,1]
["5","12","KY499","499",442,137,104.13,null,null,null,null,185,251,4,2]
["5","13","KY499","499",68,12,79.19,null,null,null,null,null,66,1,1]
["5","0","LA-1","499",3008,1087,116.41,null,null,null,null,715,1396,728,122,47]
["5","11","LA-1","499",2938,1065,116.74,null,null,null,null,704,1371,701,116,46]
["5","12","LA-1","499",34,15,146.32,null,null,null,null,10,9,9,5,1]
["5","13","LA-1","499",36,7,61.08,null,null,null,null,1,16,18,1]
["5","0","LA321","499",416,34,31.25,null,null,null,null,299,79,36,2]
["5","11","LA321","499",400,33,31.82,null,null,null,null,290,72,36,2]
["5","12","LA321","499",10,null,3,null,null,null,null,9,1]
["5","13","LA321","499",6,1,41,null,null,null,null,null,6]
["5","0","LA499","499",14341,4090,100.75,null,null,null,null,2108,11110,1119,4]
["5","11","LA499","499",13676,3899,101.12,null,null,null,null,1818,10741,1114,3]
["5","12","LA499","499",605,180,95.72,null,null,null,null,290,312,2,1]
["5","13","LA499","499",60,11,66.819999999999993,null,null,null,null,null,57,3]
["5","0","MA-1","499",1644,596,120.51,null,null,null,null,383,803,380,47,31]
["5","11","MA-1","499",1594,581,121.45,null,null,null,null,374,783,364,46,27]
["5","12","MA-1","499",21,10,130.29,null,null,null,null,8,6,4,1,2]
["5","13","MA-1","499",29,5,61.79,null,null,null,null,1,14,12,null,2]
["5","0","MA301","499",160,11,22.11,null,null,null,null,117,30,9,3,1]
["5","11","MA301","499",151,9,19.62,null,null,null,null,113,27,7,3,1]
["5","12","MA301","499",4,null,2.5,null,null,null,null,4]
["5","13","MA301","499",5,2,112.8,null,null,null,null,null,3,2]
["5","0","MA499","499",7360,2157,106.21,null,null,null,null,856,6035,469]
["5","11","MA499","499",6898,2001,105.99,null,null,null,null,698,5734,466]
["5","12","MA499","499",417,146,112.51,null,null,null,null,158,257,2]
["5","13","MA499","499",45,10,80.510000000000005,null,null,null,null,null,44,1]
["5","0","MD-1","499",3269,1086,109.92,null,null,null,null,785,1451,826,137,70]
["5","11","MD-1","499",3126,1057,111.2,null,null,null,null,774,1391,777,118,66]
["5","12","MD-1","499",37,18,169.7,null,null,null,null,11,14,6,4,2]
["5","13","MD-1","499",106,11,51.54,null,null,null,null,null,46,43,15,2]
["5","0","MD313","499",523,42,29.47,null,null,null,null,357,139,20,5,2]
["5","11","MD313","499",463,35,28.16,null,null,null,null,348,95,13,5,2]
["5","12","MD313","499",9,null,14.56,null,null,null,null,9]
["5","13","MD313","499",51,7,44.06,null,null,null,null,null,44,7]
["5","0","MD499","499",14591,3905,97.98,null,null,null,null,2171,11248,1170,2]
["5","11","MD499","499",14004,3756,98.26,null,null,null,null,1948,10888,1167,1]
["5","12","MD499","499",453,119,93.81,null,null,null,null,223,226,3,1]
["5","13","MD499","499",134,30,83.32,null,null,null,null,null,134]
["5","0","ME-1","499",681,235,113.55,null,null,null,null,170,310,158,31,12]
["5","11","ME-1","499",666,231,114.4,null,null,null,null,169,301,154,30,12]
["5","12","ME-1","499",5,3,138.6,null,null,null,null,1,3,null,1]
["5","13","ME-1","499",10,1,44.5,null,null,null,null,null,6,4]
["5","0","ME402","499",107,8,50.72,null,null,null,null,88,19]
["5","11","ME402","499",106,8,51.17,null,null,null,null,87,19]
["5","12","ME402","499",1,null,3,null,null,null,null,1]
["5","0","ME499","499",3431,952,102.5,null,null,null,null,418,2808,202,3]
["5","11","ME499","499",3285,910,101.99,null,null,null,null,372,2713,200]
["5","12","ME499","499",133,40,114.97,null,null,null,null,46,83,2,2]
["5","13","ME499","499",13,2,102.31,null,null,null,null,null,12,null,1]
["5","0","MI-1","499",3198,1133,114.13,null,null,null,null,772,1537,704,130,55]
["5","11","MI-1","499",3104,1102,113.3,null,null,null,null,755,1499,688,111,51]
["5","12","MI-1","499",61,29,190.11,null,null,null,null,17,21,4,16,3]
["5","13","MI-1","499",33,2,51.36,null,null,null,null,null,17,12,3,1]
["5","0","MI329","499",426,25,23.19,null,null,null,null,317,66,37,1,5]
["5","11","MI329","499",413,25,23.61,null,null,null,null,309,63,35,1,5]
["5","12","MI329","499",10,null,2.8,null,null,null,null,8,2]
["5","13","MI329","499",3,null,32.67,null,null,null,null,null,1,2]
["5","0","MI499","499",16034,4547,100.87,null,null,null,null,2155,12837,1027,15]
["5","11","MI499","499",15012,4216,100.64,null,null,null,null,1742,12251,1016,3]
["5","12","MI499","499",947,311,105.14,null,null,null,null,413,511,11,12]
["5","13","MI499","499",75,20,92.59,null,null,null,null,null,75]
["5","0","MN-1","499",1906,631,107.84,null,null,null,null,504,930,381,62,29]
["5","11","MN-1","499",1866,620,108.02,null,null,null,null,493,914,375,57,27]
["5","12","MN-1","499",20,7,123.8,null,null,null,null,11,5,null,4]
["5","13","MN-1","499",20,4,75.3,null,null,null,null,null,11,6,1,2]
["5","0","MN335","499",255,39,43.85,null,null,null,null,165,50,30,7,3]
["5","11","MN335","499",239,35,41.34,null,null,null,null,160,47,23,6,3]
["5","12","MN335","499",11,4,107.73,null,null,null,null,5,2,3,1]
["5","13","MN335","499",5,null,23.2,null,null,null,null,null,1,4]
["5","0","MN499","499",9331,2517,98.49,null,null,null,null,1248,7507,569,7]
["5","11","MN499","499",8878,2384,98.41,null,null,null,null,1060,7253,563,2]
["5","12","MN499","499",423,127,102.81,null,null,null,null,188,225,5,5]
["5","13","MN499","499",30,6,60.43,null,null,null,null,null,29,1]
["5","0","MO-1","499",2707,932,111.74,null,null,null,null,644,1223,675,115,50]
["5","11","MO-1","499",2619,907,111.82,null,null,null,null,629,1201,647,101,41]
["5","12","MO-1","499",39,15,142.31,null,null,null,null,15,5,5,10,4]
["5","13","MO-1","499",49,10,83.02,null,null,null,null,null,17,23,4,5]
["5","0","MO331","499",526,94,50.13,null,null,null,null,311,154,58,3]
["5","11","MO331","499",494,88,49.06,null,null,null,null,304,136,51,3]
["5","12","MO331","499",7,null,2.71,null,null,null,null,7]
["5","13","MO331","499",25,6,84.52,null,null,null,null,null,18,7]
["5","0","MO499","499",13926,3809,99.51,null,null,null,null,1988,10993,933,12]
["5","11","MO499","499",13092,3591,99.76,null,null,null,null,1618,10544,929,1]
["5","12","MO499","499",733,197,97.62,null,null,null,null,370,349,4,10]
["5","13","MO499","499",101,21,80.459999999999994,null,null,null,null,null,100,null,1]
["5","0","MS-1","499",2207,796,116.8,null,null,null,null,573,1024,503,87,20]
["5","11","MS-1","499",2164,782,116.63,null,null,null,null,560,1011,494,80,19]
["5","12","MS-1","499",29,11,137.52000000000001,null,null,null,null,13,8,1,7]
["5","13","MS-1","499",14,3,98.71,null,null,null,null,null,5,8,null,1]
["5","0","MS323","499",309,37,42.14,null,null,null,null,197,78,31,3]
["5","11","MS323","499",287,33,41.02,null,null,null,null,190,68,26,3]
["5","12","MS323","499",7,null,3.71,null,null,null,null,7]
["5","13","MS323","499",15,4,81.400000000000006,null,null,null,null,null,10,5]
["5","0","MS499","499",10606,3056,104.96,null,null,null,null,1457,8343,804,2]
["5","11","MS499","499",10129,2936,105.42,null,null,null,null,1243,8082,804]
["5","12","MS499","499",427,107,97.01,null,null,null,null,214,211,null,2]
["5","13","MS499","499",50,13,81.22,null,null,null,null,null,50]
["5","0","MT-1","499",636,252,125.88,null,null,null,null,137,365,106,21,7]
["5","11","MT-1","499",618,246,126.15,null,null,null,null,134,359,99,20,6]
["5","12","MT-1","499",9,4,160.78,null,null,null,null,3,2,2,1,1]
["5","13","MT-1","499",9,2,72.67,null,null,null,null,null,4,5]
["5","0","MT436","499",62,9,35.950000000000003,null,null,null,null,47,10,5]
["5","11","MT436","499",59,9,35,null,null,null,null,47,8,4]
["5","13","MT436","499",3,null,54.67,null,null,null,null,null,2,1]
["5","0","MT499","499",3553,1042,104.02,null,null,null,null,407,2996,149,1]
["5","11","MT499","499",3395,998,104.29,null,null,null,null,343,2903,149]
["5","12","MT499","499",137,35,95.75,null,null,null,null,64,72,null,1]
["5","13","MT499","499",21,9,114.38,null,null,null,null,null,21]
["5","0","NC-1","499",6932,2240,105.4,null,null,null,null,1690,3194,1665,257,126]
["5","11","NC-1","499",6705,2189,106.23,null,null,null,null,1666,3111,1590,223,115]
["5","12","NC-1","499",71,32,149.41,null,null,null,null,22,22,7,14,6]
["5","13","NC-1","499",156,19,49.79,null,null,null,null,2,61,68,20,5]
["5","0","NC318","499",1338,176,45.4,null,null,null,null,743,318,222,34,21]
["5","11","NC318","499",1230,166,46.48,null,null,null,null,718,286,178,28,20]
["5","12","NC318","499",25,null,3.4,null,null,null,null,25]
["5","13","NC318","499",83,10,42.04,null,null,null,null,null,32,44,6,1]
["5","0","NC499","499",33569,9169,99,null,null,null,null,4663,26278,2608,20]
["5","11","NC499","499",31964,8749,99.16,null,null,null,null,4073,25299,2586,6]
["5","12","NC499","499",1305,361,100.09,null,null,null,null,590,683,19,13]
["5","13","NC499","499",300,59,76.900000000000006,null,null,null,null,null,296,3,1]
["5","0","ND-1","499",352,133,109.3,null,null,null,null,80,169,82,16,5]
["5","11","ND-1","499",340,132,110.95,null,null,null,null,79,164,78,14,5]
["5","12","ND-1","499",4,1,139,null,null,null,null,1,2,1]
["5","13","ND-1","499",8,null,24.13,null,null,null,null,null,3,3,2]
["5","0","ND437","499",46,2,20.72,null,null,null,null,39,4,2,1]
["5","11","ND437","499",44,2,21.52,null,null,null,null,38,3,2,1]
["5","12","ND437","499",1,null,2,null,null,null,null,1]
["5","13","ND437","499",1,null,4,null,null,null,null,null,1]
["5","0","ND499","499",1794,595,108.74,null,null,null,null,205,1467,122]
["5","11","ND499","499",1718,574,109.79,null,null,null,null,180,1416,122]
["5","12","ND499","499",62,18,84.13,null,null,null,null,25,37]
["5","13","ND499","499",14,3,88.86,null,null,null,null,null,14]
["5","0","NE-1","499",958,321,111.18,null,null,null,null,240,453,216,37,12]
["5","11","NE-1","499",925,313,112.05,null,null,null,null,235,440,204,34,12]
["5","12","NE-1","499",10,5,179.8,null,null,null,null,5,null,3,2]
["5","13","NE-1","499",23,3,46.7,null,null,null,null,null,13,9,1]
["5","0","NE334","499",180,15,32.130000000000003,null,null,null,null,101,59,15,5]
["5","11","NE334","499",169,15,32.68,null,null,null,null,96,57,13,3]
["5","12","NE334","499",5,null,3,null,null,null,null,5]
["5","13","NE334","499",6,null,40.83,null,null,null,null,null,2,2,2]
["5","0","NE499","499",4751,1321,96.91,null,null,null,null,611,3768,372]
["5","11","NE499","499",4519,1256,96.89,null,null,null,null,536,3616,367]
["5","12","NE499","499",192,60,106.55,null,null,null,null,75,114,3]
["5","13","NE499","499",40,5,52.78,null,null,null,null,null,38,2]
["5","0","NH-1","499",502,188,121.52,null,null,null,null,111,245,127,16,3]
["5","11","NH-1","499",484,181,121.22,null,null,null,null,110,236,120,15,3]
["5","12","NH-1","499",10,5,153.6,null,null,null,null,1,4,4,1]
["5","13","NH-1","499",8,2,99.5,null,null,null,null,null,5,3]
["5","0","NH373","499",81,3,28.06,null,null,null,null,60,15,4,2]
["5","11","NH373","499",80,3,28.39,null,null,null,null,59,15,4,2]
["5","12","NH373","499",1,null,2,null,null,null,null,1]
["5","0","NH499","499",2386,649,100.09,null,null,null,null,289,1935,162]
["5","11","NH499","499",2253,613,99.59,null,null,null,null,238,1854,161]
["5","12","NH499","499",113,32,110.67,null,null,null,null,51,61,1]
["5","13","NH499","499",20,4,96.85,null,null,null,null,null,20]
["5","0","NJ-1","499",2043,730,114.3,null,null,null,null,558,903,463,79,40]
["5","11","NJ-1","499",1970,708,114.74,null,null,null,null,547,876,440,67,40]
["5","12","NJ-1","499",32,14,141.22,null,null,null,null,11,6,8,7]
["5","13","NJ-1","499",41,8,72.069999999999993,null,null,null,null,null,21,15,5]
["5","0","NJ309","499",144,7,22.65,null,null,null,null,105,26,12,1]
["5","11","NJ309","499",138,7,23.41,null,null,null,null,101,25,11,1]
["5","12","NJ309","499",4,null,3,null,null,null,null,4]
["5","13","NJ309","499",2,null,9.5,null,null,null,null,null,1,1]
["5","0","NJ499","499",9572,2779,103.35,null,null,null,null,1323,7626,616,7]
["5","11","NJ499","499",8881,2569,103.47,null,null,null,null,1029,7245,607]
["5","12","NJ499","499",633,201,105.58,null,null,null,null,294,323,9,7]
["5","13","NJ499","499",58,9,60.62,null,null,null,null,null,58]
["5","0","NM-1","499",1187,481,122.72,null,null,null,null,266,582,275,42,22]
["5","11","NM-1","499",1149,473,124.14,null,null,null,null,262,570,260,35,22]
["5","12","NM-1","499",13,6,144.77000000000001,null,null,null,null,4,3,4,2]
["5","13","NM-1","499",25,2,45.84,null,null,null,null,null,9,11,5]
["5","0","NM340","499",170,8,19.82,null,null,null,null,130,33,6,1]
["5","11","NM340","499",155,8,20.059999999999999,null,null,null,null,125,26,4]
["5","12","NM340","499",6,null,2.5,null,null,null,null,5,null,null,1]
["5","13","NM340","499",9,null,27.22,null,null,null,null,null,7,2]
["5","0","NM499","499",5765,1858,108.56,null,null,null,null,787,4587,387,4]
["5","11","NM499","499",5516,1796,109.18,null,null,null,null,680,4448,386,2]
["5","12","NM499","499",218,55,95.96,null,null,null,null,107,108,1,2]
["5","13","NM499","499",31,7,88.1,null,null,null,null,null,31]
["5","0","NV-1","499",2270,837,122.43,null,null,null,null,538,1071,533,93,35]
["5","11","NV-1","499",2212,826,123.79,null,null,null,null,529,1049,515,89,30]
["5","12","NV-1","499",18,6,123.33,null,null,null,null,9,3,2,2,2]
["5","13","NV-1","499",40,5,47.15,null,null,null,null,null,19,16,2,3]
["5","0","NV354","499",246,16,26.11,null,null,null,null,192,29,22,2,1]
["5","11","NV354","499",239,14,24.23,null,null,null,null,191,25,20,2,1]
["5","12","NV354","499",1,null,3,null,null,null,null,1]
["5","13","NV354","499",6,2,104.83,null,null,null,null,null,4,2]
["5","0","NV499","499",10421,3191,106.74,null,null,null,null,1303,8327,787,4]
["5","11","NV499","499",9947,3060,107.24,null,null,null,null,1120,8041,784,2]
["5","12","NV499","499",405,119,101.68,null,null,null,null,183,218,2,2]
["5","13","NV499","499",69,12,63.68,null,null,null,null,null,68,1]
["5","0","NY-1","499",3695,1349,116.92,null,null,null,null,828,1778,879,152,58]
["5","11","NY-1","499",3582,1316,116.2,null,null,null,null,806,1735,851,140,50]
["5","12","NY-1","499",57,24,227.39,null,null,null,null,22,15,6,9,5]
["5","13","NY-1","499",56,9,50.66,null,null,null,null,null,28,22,3,3]
["5","0","NY306","499",337,31,35.619999999999997,null,null,null,null,220,92,20,4,1]
["5","11","NY306","499",324,30,36.049999999999997,null,null,null,null,213,86,20,4,1]
["5","12","NY306","499",9,null,3.11,null,null,null,null,7,2]
["5","13","NY306","499",4,1,74,null,null,null,null,null,4]
["5","0","NY307","499",306,39,45.31,null,null,null,null,153,103,41,7,2]
["5","11","NY307","499",295,38,45.02,null,null,null,null,151,100,35,7,2]
["5","12","NY307","499",2,null,2,null,null,null,null,2]
["5","13","NY307","499",9,1,64.44,null,null,null,null,null,3,6]
["5","0","NY499","499",18059,5261,102.92,null,null,null,null,2345,14459,1242,13]
["5","11","NY499","499",16902,4928,103.25,null,null,null,null,1838,13827,1233,4]
["5","12","NY499","499",1064,314,100.03,null,null,null,null,507,540,8,9]
["5","13","NY499","499",93,19,76.84,null,null,null,null,null,92,1]
["5","0","OH-1","499",4308,1610,116.98,null,null,null,null,1034,2070,981,146,77]
["5","11","OH-1","499",4200,1582,117.39,null,null,null,null,1010,2021,956,138,75]
["5","12","OH-1","499",63,23,141.65,null,null,null,null,24,23,7,7,2]
["5","13","OH-1","499",45,5,44.18,null,null,null,null,null,26,18,1]
["5","0","OH325","499",684,80,38.36,null,null,null,null,490,131,52,3,8]
["5","11","OH325","499",646,79,39.18,null,null,null,null,474,116,46,2,8]
["5","12","OH325","499",16,null,2.69,null,null,null,null,16]
["5","13","OH325","499",22,1,40.049999999999997,null,null,null,null,null,15,6,1]
["5","0","OH499","499",21785,6246,102.17,null,null,null,null,2641,17877,1252,15]
["5","11","OH499","499",20459,5835,102.19,null,null,null,null,2083,17132,1240,4]
["5","12","OH499","499",1233,397,105.06,null,null,null,null,558,652,12,11]
["5","13","OH499","499",93,14,60.31,null,null,null,null,null,93]
["5","0","OK-1","499",2658,858,104.16,null,null,null,null,690,1208,610,106,44]
["5","11","OK-1","499",2610,848,104.5,null,null,null,null,678,1191,594,105,42]
["5","12","OK-1","499",21,8,139.05000000000001,null,null,null,null,12,6,1,1,1]
["5","13","OK-1","499",27,2,44.59,null,null,null,null,null,11,15,null,1]
["5","0","OK351","499",408,37,32.299999999999997,null,null,null,null,295,81,30,1,1]
["5","11","OK351","499",389,36,33.380000000000003,null,null,null,null,285,74,29,null,1]
["5","12","OK351","499",10,null,2.8,null,null,null,null,10]
["5","13","OK351","499",9,1,18.559999999999999,null,null,null,null,null,7,1,1]
["5","0","OK499","499",13281,3581,97.19,null,null,null,null,2053,10166,1058,4]
["5","11","OK499","499",12650,3416,97.34,null,null,null,null,1798,9798,1053,1]
["5","12","OK499","499",569,152,96.89,null,null,null,null,255,306,5,3]
["5","13","OK499","499",62,13,67.650000000000006,null,null,null,null,null,62]
["5","0","OR-1","499",1602,611,121.81,null,null,null,null,391,799,333,57,22]
["5","11","OR-1","499",1562,598,121.39,null,null,null,null,379,789,323,53,18]
["5","12","OR-1","499",27,11,171.89,null,null,null,null,12,4,4,3,4]
["5","13","OR-1","499",13,2,68.23,null,null,null,null,null,6,6,1]
["5","0","OR348","499",261,28,40.9,null,null,null,null,184,56,21]
["5","11","OR348","499",253,28,41.71,null,null,null,null,180,54,19]
["5","12","OR348","499",4,null,2.5,null,null,null,null,4]
["5","13","OR348","499",4,null,27.75,null,null,null,null,null,2,2]
["5","0","OR499","499",7843,2375,108.33,null,null,null,null,779,6802,260,2]
["5","11","OR499","499",7424,2250,109,null,null,null,null,603,6564,257]
["5","12","OR499","499",383,117,95.97,null,null,null,null,176,202,3,2]
["5","13","OR499","499",36,8,102.94,null,null,null,null,null,36]
["5","0","OT-1","499",1443,646,161.84,null,null,null,null,340,551,402,105,45]
["5","11","OT-1","499",1317,624,170.4,null,null,null,null,331,500,358,87,41]
["5","12","OT-1","499",17,8,152.76,null,null,null,null,7,6,2,1,1]
["5","13","OT-1","499",109,14,59.72,null,null,null,null,2,45,42,17,3]
["5","0","OT499","499",9996,5391,169.43,null,null,null,null,935,8349,708,4]
["5","11","OT499","499",9588,5251,171.87,null,null,null,null,843,8040,701,4]
["5","12","OT499","499",240,85,112.59,null,null,null,null,92,145,3]
["5","13","OT499","499",167,54,110.69,null,null,null,null,null,163,4]
["5","14","OT499","499",1,1,197,null,null,null,null,null,1]
["5","0","PA-1","499",4010,1387,111.18,null,null,null,null,1005,1887,891,146,81]
["5","11","PA-1","499",3865,1345,111.14,null,null,null,null,964,1841,860,131,69]
["5","12","PA-1","499",101,37,137.35,null,null,null,null,41,23,14,13,10]
["5","13","PA-1","499",44,5,54.16,null,null,null,null,null,23,17,2,2]
["5","0","PA310","499",715,211,82.83,null,null,null,null,372,241,72,25,5]
["5","11","PA310","499",699,210,83.98,null,null,null,null,369,231,69,25,5]
["5","12","PA310","499",4,null,3.25,null,null,null,null,3,1]
["5","13","PA310","499",12,1,42.42,null,null,null,null,null,9,3]
["5","0","PA311","499",263,11,16.420000000000002,null,null,null,null,222,27,7,3,4]
["5","11","PA311","499",254,10,16.28,null,null,null,null,214,27,7,3,3]
["5","12","PA311","499",8,null,2.5,null,null,null,null,8]
["5","13","PA311","499",1,1,162,null,null,null,null,null,null,null,null,1]
["5","0","PA499","499",21025,5880,100.87,null,null,null,null,3174,16545,1293,13]
["5","11","PA499","499",19503,5441,101.02,null,null,null,null,2493,15732,1273,5]
["5","12","PA499","499",1451,426,100.66,null,null,null,null,681,744,19,7]
["5","13","PA499","499",71,13,64.180000000000007,null,null,null,null,null,69,1,1]
["5","0","PI-1","499",2,null,110,null,null,null,null,1,1]
["5","11","PI-1","499",2,null,110,null,null,null,null,1,1]
["5","0","PR-1","499",461,158,122.33,null,null,null,null,192,146,86,23,14]
["5","11","PR-1","499",426,144,119.99,null,null,null,null,178,135,85,18,10]
["5","12","PR-1","499",33,13,155.03,null,null,null,null,14,9,1,5,4]
["5","13","PR-1","499",2,1,81.5,null,null,null,null,null,2]
["5","0","PR355","499",1166,336,100.12,null,null,null,null,243,589,310,14,10]
["5","11","PR355","499",1151,331,100.39,null,null,null,null,239,586,302,14,10]
["5","12","PR355","499",4,null,3,null,null,null,null,4]
["5","13","PR355","499",11,5,107.36,null,null,null,null,null,3,8]
["5","0","PR499","499",6442,2133,110.03,null,null,null,null,909,4863,658,12]
["5","11","PR499","499",5980,1998,110.46,null,null,null,null,694,4630,656]
["5","12","PR499","499",440,130,105.86,null,null,null,null,215,211,2,12]
["5","13","PR499","499",22,5,76.45,null,null,null,null,null,22]
["5","0","RI-1","499",346,131,117.1,null,null,null,null,67,157,102,12,8]
["5","11","RI-1","499",332,127,117.42,null,null,null,null,66,148,99,12,7]
["5","12","RI-1","499",6,3,149.5,null,null,null,null,1,2,2,null,1]
["5","13","RI-1","499",8,1,79.38,null,null,null,null,null,7,1]
["5","0","RI304","499",57,7,40.98,null,null,null,null,40,11,6]
["5","11","RI304","499",56,7,41.68,null,null,null,null,39,11,6]
["5","12","RI304","499",1,null,2,null,null,null,null,1]
["5","0","RI499","499",1696,465,100.92,null,null,null,null,205,1368,123]
["5","11","RI499","499",1620,446,100.76,null,null,null,null,178,1320,122]
["5","12","RI499","499",69,18,106.61,null,null,null,null,27,41,1]
["5","13","RI499","499",7,1,81.430000000000007,null,null,null,null,null,7]
["5","0","SC-1","499",3881,1430,123.54,null,null,null,null,932,1762,960,171,56]
["5","11","SC-1","499",3768,1410,124.68,null,null,null,null,911,1725,921,161,50]
["5","12","SC-1","499",48,16,152.1,null,null,null,null,21,10,5,8,4]
["5","13","SC-1","499",65,4,36.49,null,null,null,null,null,27,34,2,2]
["5","0","SC319","499",864,78,38.69,null,null,null,null,513,248,95,6,2]
["5","11","SC319","499",826,74,38.299999999999997,null,null,null,null,506,230,82,6,2]
["5","12","SC319","499",8,null,2.75,null,null,null,null,7,1]
["5","13","SC319","499",30,4,59.1,null,null,null,null,null,17,13]
["5","0","SC499","499",20004,5478,99.74,null,null,null,null,2739,15803,1451,11]
["5","11","SC499","499",18973,5177,99.58,null,null,null,null,2378,15148,1442,5]
["5","12","SC499","499",893,278,107.46,null,null,null,null,361,519,7,6]
["5","13","SC499","499",138,23,71.260000000000005,null,null,null,null,null,136,2]
["5","0","SD-1","499",478,191,133.21,null,null,null,null,93,244,119,19,3]
["5","11","SD-1","499",466,189,135.25,null,null,null,null,92,237,116,18,3]
["5","12","SD-1","499",2,null,102.5,null,null,null,null,1,1]
["5","13","SD-1","499",10,2,44.6,null,null,null,null,null,6,3,1]
["5","0","SD438","499",56,5,37.729999999999997,null,null,null,null,44,6,6]
["5","11","SD438","499",53,4,33.47,null,null,null,null,42,5,6]
["5","12","SD438","499",2,null,3,null,null,null,null,2]
["5","13","SD438","499",1,1,333,null,null,null,null,null,1]
["5","0","SD499","499",2364,738,106.99,null,null,null,null,253,1992,117,2]
["5","11","SD499","499",2263,702,107.23,null,null,null,null,223,1923,116,1]
["5","12","SD499","499",83,32,109.69,null,null,null,null,30,51,1,1]
["5","13","SD499","499",18,4,65.17,null,null,null,null,null,18]
["5","0","TN-1","499",3769,1321,110.28,null,null,null,null,882,1735,934,161,57]
["5","11","TN-1","499",3651,1293,110.93,null,null,null,null,869,1694,894,142,52]
["5","12","TN-1","499",48,25,177.13,null,null,null,null,13,15,9,8,3]
["5","13","TN-1","499",70,3,30.69,null,null,null,null,null,26,31,11,2]
["5","0","TN320","499",638,77,44.19,null,null,null,null,415,129,85,8,1]
["5","11","TN320","499",586,74,45.43,null,null,null,null,400,114,63,8,1]
["5","12","TN320","499",16,null,3,null,null,null,null,15,1]
["5","13","TN320","499",36,3,42.28,null,null,null,null,null,14,22]
["5","0","TN499","499",18976,5113,98.27,null,null,null,null,2730,14728,1508,10]
["5","11","TN499","499",17991,4844,98.44,null,null,null,null,2355,14132,1502,2]
["5","12","TN499","499",868,253,99.24,null,null,null,null,375,479,6,8]
["5","13","TN499","499",117,16,65.66,null,null,null,null,null,117]
["5","0","TX-1","499",16302,5379,110.25,null,null,null,null,4088,7339,3981,624,270]
["5","11","TX-1","499",15877,5271,110.66,null,null,null,null,4024,7179,3840,574,260]
["5","12","TX-1","499",160,61,148.34,null,null,null,null,63,39,23,30,5]
["5","13","TX-1","499",265,47,62.49,null,null,null,null,1,121,118,20,5]
["5","0","TX349","499",2119,471,70.42,null,null,null,null,1077,637,374,16,15]
["5","11","TX349","499",2008,457,71.69,null,null,null,null,1063,590,326,15,14]
["5","12","TX349","499",14,null,3.21,null,null,null,null,14]
["5","13","TX349","499",97,14,53.8,null,null,null,null,null,47,48,1,1]
["5","0","TX362","499",1899,388,64.680000000000007,null,null,null,null,963,547,321,34,34]
["5","11","TX362","499",1798,377,66.06,null,null,null,null,948,496,293,31,30]
["5","12","TX362","499",14,null,3.21,null,null,null,null,14]
["5","13","TX362","499",87,11,45.97,null,null,null,null,1,51,28,3,4]
["5","0","TX499","499",89073,23524,97.11,null,null,null,null,12925,69325,6787,36]
["5","11","TX499","499",85541,22580,97.22,null,null,null,null,11503,67265,6758,15]
["5","12","TX499","499",2992,833,97.44,null,null,null,null,1422,1525,25,20]
["5","13","TX499","499",540,111,77.31,null,null,null,null,null,535,4,1]
["5","0","UT-1","499",950,376,123.54,null,null,null,null,210,443,249,37,11]
["5","11","UT-1","499",919,372,125.48,null,null,null,null,204,430,241,33,11]
["5","12","UT-1","499",13,4,123.92,null,null,null,null,6,3,2,2]
["5","13","UT-1","499",18,null,24.44,null,null,null,null,null,10,6,2]
["5","0","UT341","499",133,16,40.369999999999997,null,null,null,null,91,29,11,1,1]
["5","11","UT341","499",122,14,39.79,null,null,null,null,88,23,9,1,1]
["5","12","UT341","499",3,null,3.33,null,null,null,null,3]
["5","13","UT341","499",8,2,63.13,null,null,null,null,null,6,2]
["5","0","UT499","499",4938,1448,102.6,null,null,null,null,665,4006,266,1]
["5","11","UT499","499",4666,1386,103.78,null,null,null,null,553,3850,263]
["5","12","UT499","499",226,57,86.69,null,null,null,null,112,110,3,1]
["5","13","UT499","499",46,5,60.57,null,null,null,null,null,46]
["5","0","VA-1","499",6482,2224,109.75,null,null,null,null,1505,2935,1667,260,115]
["5","11","VA-1","499",6215,2193,112.2,null,null,null,null,1489,2820,1566,234,106]
["5","12","VA-1","499",35,12,134.37,null,null,null,null,14,13,4,3,1]
["5","13","VA-1","499",232,19,40.32,null,null,null,null,2,102,97,23,8]
["5","0","VA314","499",955,71,30.23,null,null,null,null,659,181,92,12,11]
["5","11","VA314","499",853,64,29.27,null,null,null,null,646,129,61,8,9]
["5","12","VA314","499",13,null,2.77,null,null,null,null,12,null,null,1]
["5","13","VA314","499",89,7,43.44,null,null,null,null,1,52,31,3,2]
["5","0","VA499","499",29967,7754,95.95,null,null,null,null,4226,23245,2486,10]
["5","11","VA499","499",28637,7420,96.25,null,null,null,null,3859,22301,2475,2]
["5","12","VA499","499",858,255,99.62,null,null,null,null,367,475,9,7]
["5","13","VA499","499",472,79,70.95,null,null,null,null,null,469,2,1]
["5","0","VT-1","499",189,82,136.22999999999999,null,null,null,null,34,93,51,8,3]
["5","11","VT-1","499",183,79,136.02000000000001,null,null,null,null,33,90,50,8,2]
["5","12","VT-1","499",3,1,139.33000000000001,null,null,null,null,1,1,null,null,1]
["5","13","VT-1","499",3,2,146,null,null,null,null,null,2,1]
["5","0","VT405","499",27,2,38.56,null,null,null,null,21,5,null,1]
["5","11","VT405","499",27,2,38.56,null,null,null,null,21,5,null,1]
["5","0","VT499","499",837,273,104.78,null,null,null,null,86,698,53]
["5","11","VT499","499",809,263,105.12,null,null,null,null,77,679,53]
["5","12","VT499","499",23,8,99.43,null,null,null,null,9,14]
["5","13","VT499","499",5,2,73.599999999999994,null,null,null,null,null,5]
["5","0","WA-1","499",3520,1284,118.71,null,null,null,null,857,1713,781,119,50]
["5","11","WA-1","499",3379,1257,120.36,null,null,null,null,841,1654,736,104,44]
["5","12","WA-1","499",38,14,164.05,null,null,null,null,16,7,6,6,3]
["5","13","WA-1","499",103,13,48.02,null,null,null,null,null,52,39,9,3]
["5","0","WA346","499",681,92,45.25,null,null,null,null,397,156,93,27,8]
["5","11","WA346","499",636,88,46.01,null,null,null,null,391,133,85,21,6]
["5","12","WA346","499",6,null,3.33,null,null,null,null,6]
["5","13","WA346","499",39,4,39.28,null,null,null,null,null,23,8,6,2]
["5","0","WA499","499",16310,4890,106.88,null,null,null,null,1983,13392,928,7]
["5","11","WA499","499",15495,4685,107.76,null,null,null,null,1695,12875,924,1]
["5","12","WA499","499",627,170,94.87,null,null,null,null,288,333,3,3]
["5","13","WA499","499",188,35,75.040000000000006,null,null,null,null,null,184,1,3]
["5","0","WI-1","499",2215,765,112.23,null,null,null,null,562,1056,470,87,40]
["5","11","WI-1","499",2178,757,112.61,null,null,null,null,556,1040,461,83,38]
["5","12","WI-1","499",15,7,157.33000000000001,null,null,null,null,6,3,2,3,1]
["5","13","WI-1","499",22,1,43.86,null,null,null,null,null,13,7,1,1]
["5","0","WI330","499",333,31,33.200000000000003,null,null,null,null,232,68,18,15]
["5","11","WI330","499",304,26,30.01,null,null,null,null,218,61,17,8]
["5","12","WI330","499",21,5,80.14,null,null,null,null,14,2,null,5]
["5","13","WI330","499",8,null,31.13,null,null,null,null,null,5,1,2]
["5","0","WI499","499",10977,3034,99.14,null,null,null,null,1454,8816,703,4]
["5","11","WI499","499",10434,2862,99.13,null,null,null,null,1244,8491,698,1]
["5","12","WI499","499",498,158,101.1,null,null,null,null,210,280,5,3]
["5","13","WI499","499",45,14,77.89,null,null,null,null,null,45]
["5","0","WV-1","499",1072,362,107.53,null,null,null,null,282,508,213,47,22]
["5","11","WV-1","499",1054,360,108.15,null,null,null,null,278,504,209,43,20]
["5","12","WV-1","499",9,2,100.67,null,null,null,null,4,1,null,3,1]
["5","13","WV-1","499",9,null,42.22,null,null,null,null,null,3,4,1,1]
["5","0","WV315","499",115,10,34.130000000000003,null,null,null,null,85,24,4,1,1]
["5","11","WV315","499",111,10,34.51,null,null,null,null,84,21,4,1,1]
["5","12","WV315","499",1,null,4,null,null,null,null,1]
["5","13","WV315","499",3,null,30,null,null,null,null,null,3]
["5","0","WV499","499",4859,1413,103.19,null,null,null,null,611,3949,298,1]
["5","11","WV499","499",4631,1344,103.28,null,null,null,null,520,3816,295]
["5","12","WV499","499",218,65,100.98,null,null,null,null,91,123,3,1]
["5","13","WV499","499",10,4,113,null,null,null,null,null,10]
["5","0","WY-1","499",390,134,116.88,null,null,null,null,99,189,87,10,5]
["5","11","WY-1","499",377,130,118.15,null,null,null,null,99,183,82,9,4]
["5","12","WY-1","499",5,3,149.80000000000001,null,null,null,null,null,1,2,1,1]
["5","13","WY-1","499",8,1,36.5,null,null,null,null,null,5,3]
["5","0","WY442","499",39,1,16.38,null,null,null,null,31,6,2]
["5","11","WY442","499",36,1,15.75,null,null,null,null,30,4,2]
["5","12","WY442","499",1,null,4,null,null,null,null,1]
["5","13","WY442","499",2,null,34,null,null,null,null,null,2]
["5","0","WY499","499",1863,507,108.59,null,null,null,null,219,1544,100]
["5","11","WY499","499",1790,480,108.78,null,null,null,null,196,1495,99]
["5","12","WY499","499",56,23,114.7,null,null,null,null,23,32,1]
["5","13","WY499","499",17,4,68.709999999999994,null,null,null,null,null,17]
["5","11","AK100","499",2861,906,110.35,null,null,null,null,379,2232,230,16,4]
["5","12","AK100","499",57,19,100.81,null,null,null,null,27,28,1,1]
["5","13","AK100","499",78,11,62.29,null,null,null,null,null,55,19,2,2]
["5","0","AK100","499",2996,936,108.92,null,null,null,null,406,2315,250,19,6]
["5","11","AL100","499",22114,6224,98.93,null,null,null,null,4016,15434,2435,163,66]
["5","12","AL100","499",1000,308,101.01,null,null,null,null,471,495,14,17,3]
["5","13","AL100","499",188,32,67.31,null,null,null,null,null,148,34,4,2]
["5","0","AL100","499",23302,6564,98.76,null,null,null,null,4487,16077,2483,184,71]
["5","11","AR100","499",10720,2988,99.78,null,null,null,null,1769,7819,1024,77,31]
["5","12","AR100","499",504,166,104.65,null,null,null,null,220,267,8,8,1]
["5","13","AR100","499",55,20,95.69,null,null,null,null,1,39,14,null,1]
["5","0","AR100","499",11279,3174,99.97,null,null,null,null,1990,8125,1046,85,33]
["5","11","AZ100","499",22407,6806,105.51,null,null,null,null,3363,16911,1971,117,45]
["5","12","AZ100","499",891,250,97.37,null,null,null,null,415,440,19,10,7]
["5","13","AZ100","499",218,41,66.459999999999994,null,null,null,null,null,164,46,5,3]
["5","0","AZ100","499",23516,7097,104.84,null,null,null,null,3778,17515,2036,132,55]
["5","11","CA100","499",71709,21495,105.99,null,null,null,null,11088,52966,7037,431,187]
["5","12","CA100","499",2711,739,98.81,null,null,null,null,1284,1338,44,38,7]
["5","13","CA100","499",970,170,68.790000000000006,null,null,null,null,1,756,170,32,11]
["5","0","CA100","499",75390,22404,105.25,null,null,null,null,12373,55060,7251,501,205]
["5","11","CO100","499",16731,4141,92.55,null,null,null,null,2776,12023,1768,117,47]
["5","12","CO100","499",529,132,92.39,null,null,null,null,243,267,8,8,3]
["5","13","CO100","499",236,27,53.71,null,null,null,null,1,172,47,12,4]
["5","0","CO100","499",17496,4300,92.02,null,null,null,null,3020,12462,1823,137,54]
["5","11","CT100","499",4737,1410,102.2,null,null,null,null,711,3521,441,46,18]
["5","12","CT100","499",230,58,97.42,null,null,null,null,114,109,4,3]
["5","13","CT100","499",37,5,59.05,null,null,null,null,null,29,7,1]
["5","0","CT100","499",5004,1473,101.67,null,null,null,null,825,3659,452,50,18]
["5","11","DC100","499",1045,318,108.49,null,null,null,null,154,758,121,7,5]
["5","12","DC100","499",42,8,85.31,null,null,null,null,25,17]
["5","13","DC100","499",32,7,73.38,null,null,null,null,null,25,6,1]
["5","0","DC100","499",1119,333,106.61,null,null,null,null,179,800,127,8,5]
["5","11","DE100","499",2744,750,100.27,null,null,null,null,489,1985,250,12,8]
["5","12","DE100","499",98,21,86.37,null,null,null,null,56,41,null,1]
["5","13","DE100","499",34,2,47.09,null,null,null,null,null,30,4]
["5","0","DE100","499",2876,773,99.17,null,null,null,null,545,2056,254,13,8]
["5","11","FL100","499",80175,21799,99.31,null,null,null,null,13092,57699,8552,585,247]
["5","12","FL100","499",2991,769,94.77,null,null,null,null,1544,1345,49,44,9]
["5","13","FL100","499",808,141,62.81,null,null,null,null,null,608,170,21,9]
["5","0","FL100","499",83974,22709,98.8,null,null,null,null,14636,59652,8771,650,265]
["5","11","GA100","499",45535,12513,98.91,null,null,null,null,7648,32567,4876,313,131]
["5","12","GA100","499",1488,408,99.82,null,null,null,null,690,753,18,22,5]
["5","13","GA100","499",415,67,63.75,null,null,null,null,null,325,73,12,5]
["5","0","GA100","499",47438,12988,98.63,null,null,null,null,8338,33645,4967,347,141]
["5","11","HI100","499",5887,1836,108.27,null,null,null,null,921,4335,565,47,19]
["5","12","HI100","499",131,23,86.75,null,null,null,null,62,67,2]
["5","13","HI100","499",112,15,57.64,null,null,null,null,null,80,28,4]
["5","0","HI100","499",6130,1874,106.89,null,null,null,null,983,4482,595,51,19]
["5","11","IA100","499",7345,2235,103.86,null,null,null,null,1133,5470,678,45,19]
["5","12","IA100","499",455,135,96.88,null,null,null,null,212,228,2,12,1]
["5","13","IA100","499",36,8,68.25,null,null,null,null,null,28,7,1]
["5","0","IA100","499",7836,2378,103.29,null,null,null,null,1345,5726,687,58,20]
["5","11","ID100","499",5085,1498,106.26,null,null,null,null,568,4149,327,28,13]
["5","12","ID100","499",189,55,92.71,null,null,null,null,87,94,6,2]
["5","13","ID100","499",55,12,65.709999999999994,null,null,null,null,1,40,12,null,2]
["5","0","ID100","499",5329,1565,105.36,null,null,null,null,656,4283,345,30,15]
["5","11","IL100","499",20565,6309,105.88,null,null,null,null,3229,15089,2022,157,68]
["5","12","IL100","499",911,255,95.37,null,null,null,null,440,449,17,4,1]
["5","13","IL100","499",164,31,70.099999999999994,null,null,null,null,null,126,32,3,3]
["5","0","IL100","499",21640,6595,105.17,null,null,null,null,3669,15664,2071,164,72]
["5","11","IN100","499",16111,4581,99.43,null,null,null,null,2520,11838,1624,93,36]
["5","12","IN100","499",700,238,107.68,null,null,null,null,301,382,10,6,1]
["5","13","IN100","499",94,14,70.23,null,null,null,null,null,79,12,3]
["5","0","IN100","499",16905,4833,99.6,null,null,null,null,2821,12299,1646,102,37]
["5","11","KS100","499",7944,2523,104.63,null,null,null,null,1164,5952,763,45,20]
["5","12","KS100","499",342,91,96.5,null,null,null,null,172,157,6,4,3]
["5","13","KS100","499",109,26,71.73,null,null,null,null,1,86,18,3,1]
["5","0","KS100","499",8395,2640,103.88,null,null,null,null,1337,6195,787,52,24]
["5","11","KY100","499",12906,4067,106.45,null,null,null,null,1936,9499,1359,80,32]
["5","12","KY100","499",461,141,104.54,null,null,null,null,194,252,8,6,1]
["5","13","KY100","499",106,16,69.08,null,null,null,null,null,85,15,5,1]
["5","0","KY100","499",13473,4224,106.09,null,null,null,null,2130,9836,1382,91,34]
["5","11","LA100","499",17014,4997,102.19,null,null,null,null,2812,12184,1851,121,46]
["5","12","LA100","499",649,195,96.94,null,null,null,null,309,322,11,6,1]
["5","13","LA100","499",102,19,63.27,null,null,null,null,1,79,21,1]
["5","0","LA100","499",17765,5211,101.77,null,null,null,null,3122,12585,1883,128,47]
["5","11","MA100","499",8643,2591,107.34,null,null,null,null,1185,6544,837,49,28]
["5","12","MA100","499",442,156,112.36,null,null,null,null,170,263,6,1,2]
["5","13","MA100","499",79,17,75.680000000000007,null,null,null,null,1,61,15,null,2]
["5","0","MA100","499",9164,2764,107.3,null,null,null,null,1356,6868,858,50,32]
["5","11","MD100","499",17593,4848,98.71,null,null,null,null,3070,12374,1957,124,68]
["5","12","MD100","499",499,137,98,null,null,null,null,243,240,9,5,2]
["5","13","MD100","499",291,48,64.86,null,null,null,null,null,224,50,15,2]
["5","0","MD100","499",18383,5033,98.16,null,null,null,null,3313,12838,2016,144,72]
["5","11","ME100","499",4057,1149,102.7,null,null,null,null,628,3033,354,30,12]
["5","12","ME100","499",139,43,115.01,null,null,null,null,48,86,2,3]
["5","13","ME100","499",23,3,77.17,null,null,null,null,null,18,4,1]
["5","0","ME100","499",4219,1195,102.97,null,null,null,null,676,3137,360,34,12]
["5","11","MI100","499",18529,5343,101.04,null,null,null,null,2806,13813,1739,115,56]
["5","12","MI100","499",1018,340,109.22,null,null,null,null,438,534,15,28,3]
["5","13","MI100","499",111,22,78.709999999999994,null,null,null,null,null,93,14,3,1]
["5","0","MI100","499",19658,5705,101.34,null,null,null,null,3244,14440,1768,146,60]
["5","11","MN100","499",10983,3039,98.8,null,null,null,null,1713,8214,961,65,30]
["5","12","MN100","499",454,138,103.85,null,null,null,null,204,232,8,10]
["5","13","MN100","499",55,10,62.45,null,null,null,null,null,41,11,1,2]
["5","0","MN100","499",11492,3187,98.83,null,null,null,null,1917,8487,980,76,32]
["5","11","MO100","499",16205,4586,100.16,null,null,null,null,2551,11881,1627,105,41]
["5","12","MO100","499",779,212,99.01,null,null,null,null,392,354,9,20,4]
["5","13","MO100","499",175,37,81.75,null,null,null,null,null,135,30,5,5]
["5","0","MO100","499",17159,4835,99.92,null,null,null,null,2943,12370,1666,130,50]
["5","11","MS100","499",12580,3751,105.88,null,null,null,null,1993,9161,1324,83,19]
["5","12","MS100","499",463,118,98.14,null,null,null,null,234,219,1,9]
["5","13","MS100","499",79,20,84.35,null,null,null,null,null,65,13,null,1]
["5","0","MS100","499",13122,3889,105.48,null,null,null,null,2227,9445,1338,92,20]
["5","11","MT100","499",4072,1253,106.6,null,null,null,null,524,3270,252,20,6]
["5","12","MT100","499",146,39,99.76,null,null,null,null,67,74,2,2,1]
["5","13","MT100","499",33,11,97.58,null,null,null,null,null,27,6]
["5","0","MT100","499",4251,1303,106.3,null,null,null,null,591,3371,260,22,7]
["5","11","NC100","499",39899,11104,98.73,null,null,null,null,6457,28696,4354,257,135]
["5","12","NC100","499",1401,393,100.86,null,null,null,null,637,705,26,27,6]
["5","13","NC100","499",539,88,63.68,null,null,null,null,2,389,115,27,6]
["5","0","NC100","499",41839,11585,98.35,null,null,null,null,7096,29790,4495,311,147]
["5","11","ND100","499",2102,708,108.13,null,null,null,null,297,1583,202,15,5]
["5","12","ND100","499",67,19,86.18,null,null,null,null,27,39,1]
["5","13","ND100","499",23,3,62.65,null,null,null,null,null,18,3,2]
["5","0","ND100","499",2192,730,106.98,null,null,null,null,324,1640,206,17,5]
["5","11","NE100","499",5613,1584,97.45,null,null,null,null,867,4113,584,37,12]
["5","12","NE100","499",207,65,107.59,null,null,null,null,85,114,6,2]
["5","13","NE100","499",69,8,49.71,null,null,null,null,null,53,13,3]
["5","0","NE100","499",5889,1657,97.25,null,null,null,null,952,4280,603,42,12]
["5","11","NH100","499",2817,797,101.28,null,null,null,null,407,2105,285,17,3]
["5","12","NH100","499",124,37,113.26,null,null,null,null,53,65,5,1]
["5","13","NH100","499",28,6,97.61,null,null,null,null,null,25,3]
["5","0","NH100","499",2969,840,101.75,null,null,null,null,460,2195,293,18,3]
["5","11","NJ100","499",10989,3284,104.49,null,null,null,null,1677,8146,1058,68,40]
["5","12","NJ100","499",669,215,106.67,null,null,null,null,309,329,17,14]
["5","13","NJ100","499",101,17,64.260000000000005,null,null,null,null,null,80,16,5]
["5","0","NJ100","499",11759,3516,104.27,null,null,null,null,1986,8555,1091,87,40]
["5","11","NM100","499",6820,2277,109.67,null,null,null,null,1067,5044,650,37,22]
["5","12","NM100","499",237,61,96.27,null,null,null,null,116,111,5,5]
["5","13","NM100","499",65,9,63.42,null,null,null,null,null,47,13,5]
["5","0","NM100","499",7122,2347,108.81,null,null,null,null,1183,5202,668,47,22]
["5","11","NV100","499",12398,3900,108.6,null,null,null,null,1840,9115,1319,93,31]
["5","12","NV100","499",424,125,102.37,null,null,null,null,193,221,4,4,2]
["5","13","NV100","499",115,19,60.08,null,null,null,null,null,91,19,2,3]
["5","0","NV100","499",12937,4044,107.96,null,null,null,null,2033,9427,1342,99,36]
["5","11","NY100","499",21103,6312,103.6,null,null,null,null,3008,15748,2139,155,53]
["5","12","NY100","499",1132,338,105.49,null,null,null,null,538,557,14,18,5]
["5","13","NY100","499",162,30,67.03,null,null,null,null,null,127,29,3,3]
["5","0","NY100","499",22397,6680,103.43,null,null,null,null,3546,16432,2182,176,61]
["5","11","OH100","499",25305,7496,103.1,null,null,null,null,3567,19269,2242,144,83]
["5","12","OH100","499",1312,420,105.57,null,null,null,null,598,675,19,18,2]
["5","13","OH100","499",160,20,52.99,null,null,null,null,null,134,24,2]
["5","0","OH100","499",26777,7936,102.92,null,null,null,null,4165,20078,2285,164,85]
["5","11","OK100","499",15649,4300,96.95,null,null,null,null,2761,11063,1676,106,43]
["5","12","OK100","499",600,160,96.8,null,null,null,null,277,312,6,4,1]
["5","13","OK100","499",98,16,56.79,null,null,null,null,null,80,16,1,1]
["5","0","OK100","499",16347,4476,96.7,null,null,null,null,3038,11455,1698,111,45]
["5","11","OR100","499",9239,2876,109.25,null,null,null,null,1162,7407,599,53,18]
["5","12","OR100","499",414,128,100.02,null,null,null,null,192,206,7,5,4]
["5","13","OR100","499",53,10,88.75,null,null,null,null,null,44,8,1]
["5","0","OR100","499",9706,3014,108.74,null,null,null,null,1354,7657,614,59,22]
["5","11","OT100","499",10905,5875,171.69,null,null,null,null,1174,8540,1059,91,41]
["5","12","OT100","499",257,93,115.25,null,null,null,null,99,151,5,1,1]
["5","13","OT100","499",276,68,90.56,null,null,null,null,2,208,46,17,3]
["5","14","OT100","499",1,1,197,null,null,null,null,null,1]
["5","0","OT100","499",11439,6037,168.47,null,null,null,null,1275,8900,1110,109,45]
["5","11","PA100","499",24321,7006,101.25,null,null,null,null,4040,17831,2209,164,77]
["5","12","PA100","499",1564,463,102.28,null,null,null,null,733,768,33,20,10]
["5","13","PA100","499",128,20,59.46,null,null,null,null,null,101,21,3,3]
["5","0","PA100","499",26013,7489,101.11,null,null,null,null,4773,18700,2263,187,90]
["5","11","PI100","499",2,null,110,null,null,null,null,1,1]
["5","0","PI100","499",2,null,110,null,null,null,null,1,1]
["5","11","PR100","499",7557,2473,109.47,null,null,null,null,1111,5351,1043,32,20]
["5","12","PR100","499",477,143,108.4,null,null,null,null,233,220,3,17,4]
["5","13","PR100","499",35,11,86.46,null,null,null,null,null,27,8]
["5","0","PR100","499",8069,2627,109.3,null,null,null,null,1344,5598,1054,49,24]
["5","11","RI100","499",2008,580,101.87,null,null,null,null,283,1479,227,12,7]
["5","12","RI100","499",76,21,108.62,null,null,null,null,29,43,3,null,1]
["5","13","RI100","499",15,2,80.33,null,null,null,null,null,14,1]
["5","0","RI100","499",2099,603,101.96,null,null,null,null,312,1536,231,12,8]
["5","11","SC100","499",23567,6661,101.45,null,null,null,null,3795,17103,2445,172,52]
["5","12","SC100","499",949,294,108.84,null,null,null,null,389,530,12,14,4]
["5","13","SC100","499",233,31,60,null,null,null,null,null,180,49,2,2]
["5","0","SC100","499",24749,6986,101.34,null,null,null,null,4184,17813,2506,188,58]
["5","11","SD100","499",2782,895,110.52,null,null,null,null,357,2165,238,19,3]
["5","12","SD100","499",87,32,107.07,null,null,null,null,33,52,1,1]
["5","13","SD100","499",29,7,67.31,null,null,null,null,null,25,3,1]
["5","0","SD100","499",2898,934,109.98,null,null,null,null,390,2242,242,21,3]
["5","11","TN100","499",22228,6211,99.09,null,null,null,null,3624,15940,2459,152,53]
["5","12","TN100","499",932,278,101.6,null,null,null,null,403,495,15,16,3]
["5","13","TN100","499",223,22,50.91,null,null,null,null,null,157,53,11,2]
["5","0","TN100","499",23383,6511,98.73,null,null,null,null,4027,16592,2527,179,58]
["5","11","TX100","499",105224,28685,98.23,null,null,null,null,17538,75530,11217,635,304]
["5","12","TX100","499",3180,894,99.18,null,null,null,null,1513,1564,48,50,5]
["5","13","TX100","499",989,183,68.28,null,null,null,null,2,754,198,25,10]
["5","0","TX100","499",109393,29762,97.99,null,null,null,null,19053,77848,11463,710,319]
["5","11","UT100","499",5707,1772,105.91,null,null,null,null,845,4303,513,34,12]
["5","12","UT100","499",242,61,87.66,null,null,null,null,121,113,5,3]
["5","13","UT100","499",72,7,51.82,null,null,null,null,null,62,8,2]
["5","0","UT100","499",6021,1840,104.53,null,null,null,null,966,4478,526,39,12]
["5","11","VA100","499",35705,9677,97.43,null,null,null,null,5994,25250,4102,244,115]
["5","12","VA100","499",906,267,99.58,null,null,null,null,393,488,13,11,1]
["5","13","VA100","499",793,105,58.9,null,null,null,null,3,623,130,27,10]
["5","0","VA100","499",37404,10049,96.66,null,null,null,null,6390,26361,4245,282,126]
["5","11","VT100","499",1019,344,108.91,null,null,null,null,131,774,103,9,2]
["5","12","VT100","499",26,9,104.04,null,null,null,null,10,15,null,null,1]
["5","13","VT100","499",8,4,100.75,null,null,null,null,null,7,1]
["5","0","VT100","499",1053,357,108.72,null,null,null,null,141,796,104,9,3]
["5","11","WA100","499",19510,6030,107.93,null,null,null,null,2927,14662,1745,126,50]
["5","12","WA100","499",671,184,97.97,null,null,null,null,310,340,9,9,3]
["5","13","WA100","499",330,52,62.38,null,null,null,null,null,259,48,18,5]
["5","0","WA100","499",20511,6266,106.87,null,null,null,null,3237,15261,1802,153,58]
["5","11","WI100","499",12916,3645,99.78,null,null,null,null,2018,9592,1176,92,38]
["5","12","WI100","499",534,170,101.85,null,null,null,null,230,285,7,11,1]
["5","13","WI100","499",75,15,62.92,null,null,null,null,null,63,8,3,1]
["5","0","WI100","499",13525,3830,99.66,null,null,null,null,2248,9940,1191,106,40]
["5","11","WV100","499",5796,1714,102.85,null,null,null,null,882,4341,508,44,21]
["5","12","WV100","499",228,67,100.54,null,null,null,null,96,124,3,4,1]
["5","13","WV100","499",22,4,72.73,null,null,null,null,null,16,4,1,1]
["5","0","WV100","499",6046,1785,102.65,null,null,null,null,978,4481,515,49,23]
["5","11","WY100","499",2203,611,108.86,null,null,null,null,325,1682,183,9,4]
["5","12","WY100","499",62,26,115.74,null,null,null,null,24,33,3,1,1]
["5","13","WY100","499",27,5,56.59,null,null,null,null,null,24,3]
["5","0","WY100","499",2292,642,108.43,null,null,null,null,349,1739,189,10,5]
["5","0","35","499",11439,6037,168.47,281,11280,209.26,192.03,1275,8900,1110,109,45]
["5","0","384","499",188481,52009,98.44,5815,333407,129.81,127.74,32316,135445,18938,1256,526]
["5","0","393","499",351843,98302,99.69,11216,628245,133.65,126.6,60949,250000,37212,2635,1047]
["5","0","394","499",222719,64790,101.96,6804,393808,139.19999999999999,132.69,37202,162363,20858,1600,696]
["5","0","395","499",169660,51387,106.05,5150,284864,130.88999999999999,130.09,26970,125681,15429,1130,450]
["5","11","35","499",10905,5875,171.69,264,10372,217.7,199.98,1174,8540,1059,91,41]
["5","11","384","499",180648,49974,98.74,5429,317961,134.58000000000001,129.44999999999999,29455,131065,18522,1113,493]
["5","11","393","499",335796,94179,100.07,10511,597019,137.81,128.21,55129,241044,36332,2323,968]
["5","11","394","499",210707,61349,102.15,6337,372841,142.55000000000001,134.11000000000001,32474,155780,20411,1399,643]
["5","11","395","499",161625,49396,106.87,4736,268363,135.96,132.43,24161,121125,14956,982,401]
["5","12","35","499",257,93,115.25,3,224,131.33000000000001,139.71,99,151,5,1,1]
["5","12","384","499",6129,1731,98.82,160,8306,103.61,123.39,2857,3072,91,94,15]
["5","12","393","499",12449,3547,100.12,305,17245,109.63,125.8,5813,6215,181,201,39]
["5","12","394","499",10295,3141,103.76,288,15110,119.54,122.76,4727,5212,170,153,33]
["5","12","395","499",5967,1645,97.85,155,8462,122.39,123.61,2807,2958,102,77,23]
["5","13","35","499",276,68,90.56,14,684,66.709999999999994,88.58,2,208,46,17,3]
["5","13","384","499",1704,304,65.17,226,7138,33.869999999999997,56.72,4,1308,325,49,18]
["5","13","393","499",3598,576,62.97,400,13981,42.88,58.46,7,2741,699,111,40]
["5","13","394","499",1717,300,68.03,179,5855,52.41,67.760000000000005,1,1371,277,48,20]
["5","13","395","499",2068,346,65.86,259,8039,43.36,58.74,2,1598,371,71,26]
["5","14","35","499",1,1,197,null,null,null,null,null,1]
["5","14","384","499",null,null,null,null,2,null,88.5]
["5","14","394","499",null,null,null,null,2,null,87]
["5","0","499","499",763629,215081,101.43,17,1182,71.41,84.06,104950,604434,53885,359,1]
["5","0","499","499",null,null,null,null,38,null,17.21]
["5","11","499","499",725426,204548,101.71,17,1090,71.41,82.49,89784,581984,53553,105]
["5","12","499","499",32840,9446,99.24,null,92,null,102.67,15166,17145,297,232]
["5","13","499","499",5362,1086,76.5,null,null,null,null,null,5304,35,22,1]
["5","13","499","499",null,null,null,null,38,null,17.21]
["5","14","499","499",1,1,197,null,null,null,null,null,1]
["7","1","100","9",181,null,2389.25]
["7","1","100","2",105,null,1207.22]
["7","1","100","3",31597,null,212.66]
["7","1","100","10",49327,null,52.43]
["7","1","100","1",216,null,2210.56]
["7","1","100","6"]
["7","2","-1","2000",30172,null,201.09]
["7","2","307","2000",2,null,642.5]
["7","2","309","2000",2,null,716]
["7","2","310","2000",3,null,970.33]
["7","2","313","2000",2,null,1063.5]
["7","2","314","2000",1,null,297]
["7","2","316","2000",3,null,1190]
["7","2","317","2000",27,null,993.15]
["7","2","318","2000",1,null,1483]
["7","2","319","2000",1,null,150]
["7","2","320","2000",7,null,466.14]
["7","2","321","2000",2,null,101.5]
["7","2","322","2000",2,null,142.5]
["7","2","323","2000",265,null,962.42]
["7","2","325","2000",2,null,1304]
["7","2","327","2000",294,null,408.8]
["7","2","328","2000",1,null,1244]
["7","2","329","2000",1,null,1331]
["7","2","330","2000",1,null,794]
["7","2","331","2000",1,null,934]
["7","2","335","2000",218,null,329.83]
["7","2","339","2000",8,null,704.88]
["7","2","340","2000",3,null,1038]
["7","2","343","2000",4,null,734.75]
["7","2","344","2000",4,null,126.75]
["7","2","345","2000",2,null,221]
["7","2","346","2000",237,null,512.82000000000005]
["7","2","347","2000",1,null,290]
["7","2","348","2000",1,null,445]
["7","2","349","2000",4,null,177.5]
["7","2","351","2000",14,null,728.86]
["7","2","354","2000",2,null,392.5]
["7","2","358","2000",2,null,927]
["7","2","362","2000",1,null,598]
["7","2","373","2000",1,null,257]
["7","2","377","2000",4,null,249]
["7","2","397","2000",320,null,1667.6]
["7","2","463","2000",1,null,91]
["7","2","100","2000",31617,null,229.28]
["7","2","-1","3000",299,null,248.66]
["7","2","310","3000",1,null,17]
["7","2","330","3000",1,null,4]
["7","2","100","3000",301,null,247.08]
["7","2","35","2000",30492,null,216.48]
["7","2","384","2000",245,null,363.49]
["7","2","393","2000",603,null,682.08]
["7","2","394","2000",16,null,932.69]
["7","2","395","2000",261,null,509.58]
["10","1","-1","-1",24364]
["11","1","-1","-1",1,1]
["8","11","301","17-JUL-23",0.9859,0.93864999999999998,0.88490000000000002,8.7970000000000007E-2,0.89026000000000005,8.7690000000000004E-2]
["8","11","308","17-JUL-23",0.99319999999999997,0.93879999999999997,0.89117999999999997,7.3359999999999995E-2,0.93830000000000002,6.3920000000000005E-2]
["8","11","315","17-JUL-23",0.97243999999999997,0.87219000000000002,0.83262000000000003,0.10571,0.90895000000000004,7.2959999999999997E-2]
["8","11","329","17-JUL-23",0.97021000000000002,0.88300000000000001,0.88055000000000005,7.6789999999999997E-2,0.92789999999999995,7.2940000000000005E-2]
["8","11","333","17-JUL-23",1,1,0.97538000000000002,3.7249999999999998E-2,0.94527000000000005,6.0089999999999998E-2]
["8","11","354","17-JUL-23",0.92107000000000006,0.71648999999999996,0.85836999999999997,8.5400000000000004E-2,0.81818000000000002,0.12709999999999999]
["8","11","355","17-JUL-23",0.96120000000000005,0.93920000000000003,0.93623000000000001,6.4100000000000004E-2,0.83799999999999997,8.3629999999999996E-2]
["8","11","1","17-JUL-23",0.95901000000000003,0.88087000000000004,0.87895999999999996,1.4409999999999999E-2,0.91771999999999998,1.7659999999999999E-2]
["8","11","304","17-JUL-23",1,1,0.98568999999999996,2.1649999999999999E-2,0.93376000000000003,4.9029999999999997E-2]
["8","11","306","17-JUL-23",0.95669999999999999,0.87356,0.85389999999999999,9.8760000000000001E-2,0.87626000000000004,8.1470000000000001E-2]
["8","11","311","17-JUL-23",0.97738000000000003,0.87309000000000003,0.88351999999999997,7.6100000000000001E-2,0.89092000000000005,0.1128]
["8","11","322","17-JUL-23",0.91696,0.83047000000000004,0.90515000000000001,6.9599999999999995E-2,0.90590000000000004,7.3400000000000007E-2]
["8","11","341","17-JUL-23",0.80828,0.66496999999999995,0.80610999999999999,0.12623000000000001,0.98592000000000002,1.7239999999999998E-2]
["8","11","350","17-JUL-23",0.96465000000000001,0.86241999999999996,0.90178000000000003,6.7419999999999994E-2,0.89198,9.4030000000000002E-2]
["8","11","402","17-JUL-23",0.95132000000000005,0.77876999999999996,0.84697,9.9930000000000005E-2,0.94984000000000002,6.1289999999999997E-2]
["8","11","436","17-JUL-23",0.96535000000000004,1,0.89432999999999996,7.6420000000000002E-2,0.94682999999999995,2.7869999999999999E-2]
["8","11","437","17-JUL-23",0.97787999999999997,0.94027000000000005,0.93152000000000001,5.9799999999999999E-2,0.87287000000000003,0.11724]
["8","11","452","17-JUL-23",0.98341000000000001,0.92588000000000004,0.91998999999999997,7.3109999999999994E-2,0.89746000000000004,7.4639999999999998E-2]
["8","11","463","17-JUL-23",1,1,0.93364999999999998,4.836E-2,0.77268999999999999,0.1239]
["8","11","319","17-JUL-23",0.98897000000000002,0.92530000000000001,0.91247,8.8429999999999995E-2,0.85601000000000005,0.10621]
["8","11","323","17-JUL-23",0.93022000000000005,0.81616,0.82686000000000004,8.2600000000000007E-2,0.83257999999999999,9.332E-2]
["8","11","335","17-JUL-23",0.98495999999999995,1,0.98231999999999997,2.6780000000000002E-2,0.97692999999999997,3.4329999999999999E-2]
["8","11","351","17-JUL-23",0.91310999999999998,0.82723000000000002,0.8921,9.4750000000000001E-2,0.94854000000000005,6.3339999999999994E-2]
["8","11","320","17-JUL-23",0.97423000000000004,0.82721,0.81101000000000001,9.5930000000000001E-2,0.96194000000000002,5.5440000000000003E-2]
["8","11","325","17-JUL-23",0.95113999999999999,0.72931999999999997,0.88466,9.2619999999999994E-2,0.90727999999999998,8.6669999999999997E-2]
["8","11","326","17-JUL-23",0.97074000000000005,0.90903999999999996,0.89995999999999998,7.3319999999999996E-2,0.74753000000000003,0.14968999999999999]
["8","11","331","17-JUL-23",0.98721999999999999,1,0.90400000000000003,6.7659999999999998E-2,0.85028999999999999,0.10256]
["8","11","340","17-JUL-23",0.94728999999999997,0.83333000000000002,0.84726000000000001,8.974E-2,0.82625999999999999,0.10761]
["8","11","344","17-JUL-23",0.94350000000000001,0.88978999999999997,0.88644000000000001,7.8520000000000006E-2,0.87631000000000003,7.6770000000000005E-2]
["8","11","346","17-JUL-23",0.98841000000000001,0.90007999999999999,0.88610999999999995,8.7410000000000002E-2,0.93769000000000002,7.646E-2]
["8","11","348","17-JUL-23",0.98563000000000001,0.86826999999999999,0.86821999999999999,8.7980000000000003E-2,0.94504999999999995,5.9650000000000002E-2]
["8","11","373","17-JUL-23",0.98077000000000003,0.89598999999999995,0.91102000000000005,6.7599999999999993E-2,0.90600999999999998,7.7649999999999997E-2]
["8","11","438","17-JUL-23",0.98960000000000004,0.93637000000000004,0.94674999999999998,5.3620000000000001E-2,0.88929000000000002,9.9460000000000007E-2]
["8","11","460","17-JUL-23",0.94635000000000002,0.88510999999999995,0.88753000000000004,8.6220000000000005E-2,0.86090999999999995,0.14155000000000001]
["8","11","309","17-JUL-23",0.81438999999999995,0.8,0.90029999999999999,7.5740000000000002E-2,0.75934000000000001,8.2559999999999995E-2]
["8","11","314","17-JUL-23",0.97465000000000002,1,0.88756999999999997,9.8830000000000001E-2,0.94081000000000004,8.6959999999999996E-2]
["8","11","334","17-JUL-23",0.92776999999999998,0.89061000000000001,0.92918000000000001,8.1339999999999996E-2,0.96467999999999998,4.3060000000000001E-2]
["8","11","362","17-JUL-23",0.89456999999999998,0.83660999999999996,0.88858999999999999,9.0300000000000005E-2,0.82937000000000005,0.10521]
["8","11","384","17-JUL-23",0.95875999999999995,0.91608000000000001,0.89105000000000001,3.322E-2,0.93869999999999998,3.1419999999999997E-2]
["8","11","393","17-JUL-23",0.95577000000000001,0.87258000000000002,0.87219999999999998,2.469E-2,0.91832000000000003,3.3090000000000001E-2]
["8","11","316","17-JUL-23",0.90774999999999995,0.73029999999999995,0.80793000000000004,9.0429999999999996E-2,0.79612000000000005,0.11472]
["8","11","317","17-JUL-23",0.93974000000000002,0.72831000000000001,0.80169000000000001,9.1539999999999996E-2,0.89258000000000004,9.4960000000000003E-2]
["8","11","327","17-JUL-23",0.94164999999999999,0.88512999999999997,0.84404000000000001,9.7500000000000003E-2,0.84992999999999996,0.10416]
["8","11","358","17-JUL-23",0.97948000000000002,0.89183000000000001,0.90859000000000001,7.2870000000000004E-2,0.93959000000000004,7.5439999999999993E-2]
["8","11","377","17-JUL-23",0.97045000000000003,0.76404000000000005,0.78620999999999996,0.12089999999999999,0.90310000000000001,8.1680000000000003E-2]
["8","11","459","17-JUL-23",0.98133999999999999,0.89493,0.87636999999999998,9.0459999999999999E-2,0.88363999999999998,0.10020999999999999]
["8","11","395","17-JUL-23",0.95752999999999999,0.84589999999999999,0.85424999999999995,3.6740000000000002E-2,0.90778000000000003,4.6980000000000001E-2]
["8","11","307","17-JUL-23",0.93532000000000004,0.83903000000000005,0.86912999999999996,8.3989999999999995E-2,0.75277000000000005,0.12820000000000001]
["8","11","310","17-JUL-23",0.90175000000000005,0.88544,0.88439999999999996,9.6570000000000003E-2,0.93779999999999997,6.7919999999999994E-2]
["8","11","318","17-JUL-23",0.98173999999999995,1,0.96667999999999998,4.045E-2,0.93789999999999996,6.7769999999999997E-2]
["8","11","328","17-JUL-23",1,1,0.94752000000000003,5.7099999999999998E-2,0.86807000000000001,9.0270000000000003E-2]
["8","11","330","17-JUL-23",1,1,0.92671999999999999,6.9500000000000006E-2,0.95001000000000002,6.4640000000000003E-2]
["8","11","343","17-JUL-23",0.96345000000000003,0.93752999999999997,0.88875999999999999,8.8669999999999999E-2,0.93067999999999995,7.8700000000000006E-2]
["8","11","345","17-JUL-23",0.96555999999999997,1,0.85460999999999998,0.11029,0.88395999999999997,0.10677]
["8","11","349","17-JUL-23",0.98924000000000001,0.94899,0.84860999999999998,8.8020000000000001E-2,0.90169999999999995,7.2010000000000005E-2]
["8","11","372","17-JUL-23",null,null,null,null,0.84679000000000004,0.13825999999999999]
["8","11","442","17-JUL-23",1,1,0.90563000000000005,8.7419999999999998E-2,0.86992000000000003,6.9220000000000004E-2]
["8","11",null,"17-JUL-23",0.96479000000000004,0.88756999999999997,0.89983999999999997,2.0629999999999999E-2,0.90395999999999999,3.1609999999999999E-2]
["8","11","313","17-JUL-23",0.98736000000000002,0.93539000000000005,0.89981999999999995,7.6170000000000002E-2,0.872,8.4059999999999996E-2]
["8","11","321","17-JUL-23",0.97250999999999999,0.94386000000000003,0.82942000000000005,9.579E-2,0.83989999999999998,0.1066]
["8","11","339","17-JUL-23",0.98395999999999995,0.93161000000000005,0.81791000000000003,0.10254000000000001,0.88773999999999997,7.0639999999999994E-2]
["8","11","347","17-JUL-23",0.91264000000000001,0.82831999999999995,0.95154000000000005,5.9240000000000001E-2,0.86334,0.10397000000000001]
["8","11","405","17-JUL-23",0.96860999999999997,0.85714000000000001,0.80483000000000005,0.1082,0.87226999999999999,8.0629999999999993E-2]
["8","12","1","17-JUL-23",null,0.94416999999999995,0.96943000000000001,3.288E-2,0.94486000000000003,3.6670000000000001E-2]
["8","12","310","17-JUL-23",null,0.88375999999999999,0.95820000000000005,5.407E-2,0.92986000000000002,5.3170000000000002E-2]
["8","12","330","17-JUL-23",null,1,0.98599999999999999,2.0969999999999999E-2,0.93428999999999995,7.5109999999999996E-2]
["8","12","335","17-JUL-23",null,1,0.97457000000000005,3.832E-2,0.96809000000000001,2.674E-2]
["9","1","307","04-AUG-23",7556,7323,233]
["9","1","351","04-AUG-23",5917,6034,-117]
["9","1","1","04-AUG-23",13473,13357,116]
["9","2","307","04-AUG-23",22473,19628,2845]
["9","2","351","04-AUG-23",22169,20286,1883]
["9","2","1","04-AUG-23",44642,39914,4728]

{"sheet":"Transformation","index":3,"n_rows":38,"n_cols":10,"rows_kept":38,"cut":false,"hidden":false,"merged":[[37,1,37,9],[2,9,3,9],[31,1,31,5],[26,1,26,5],[27,1,27,5],[28,1,28,5],[29,1,29,5],[30,1,30,5],[24,1,24,5],[2,8,3,8],[2,7,3,7],[5,1,5,5],[4,1,4,5],[2,1,2,5],[10,1,10,5],[11,1,11,5],[12,1,12,5],[1,1,1,5],[6,1,6,5],[7,1,7,5],[8,1,8,5],[9,1,9,5],[13,1,13,5],[14,1,14,5],[36,1,36,9],[15,1,15,5],[16,1,16,5],[18,1,18,5],[20,1,20,5],[25,1,25,5],[32,1,32,5],[33,1,33,5],[34,1,34,5],[19,1,19,5],[21,1,21,5],[22,1,22,5],[17,1,17,5]]}
[null," "]
[null,"Compensation and Pension Rating Bundle Metrics"]
[null,"National View",null,null,null,null,null,"# Pending","# Pending > 125","% Pending > 125 days"]
[null,{"$f":"\"Reporting through \"&TEXT(D_DT[],\"MMMM DD, YYYY\")","v":"Reporting through August 05, 2023"}]
[null,"Compensation and Pension Rating Bundle",null,null,null,null,"Total",{"$f":"SUM(H6,H11,H22)","v":944142},{"$f":"SUM(I6,I11,I22)","v":272525},{"$f":"IF(H5=0, 0,I5/H5)","v":0.28864831773186661}]
[null,"Original Entitlement",null,null,null,null,"Total",{"$f":"SUM(H7:H10)","v":233748},{"$f":"SUM(I7:I10)","v":79299},{"$f":"IF(H6=0, 0,I6/H6)","v":0.33924996149699677}]
["010","Initial entitlement for service-connected disability (>=8 issues)",null,null,null,null,"EP 010",{"$f":"IFERROR(SUMIFS(D_D[INV],D_D[MT],3,D_D[EP],$A7),0)","v":78284},{"$f":"IFERROR(SUMIFS(D_D[BL],D_D[MT],3,D_D[EP],$A7),0)","v":31147},0.39787185120842061]
["110","Initial entitlement for service-connected disability (<=7 issues)",null,null,null,null,"EP 110",{"$f":"IFERROR(SUMIFS(D_D[INV],D_D[MT],3,D_D[EP],$A8),0)","v":123423},{"$f":"IFERROR(SUMIFS(D_D[BL],D_D[MT],3,D_D[EP],$A8),0)","v":37321},0.30238286218938121]
["180","Initial entitlement - Veteran's Pension",null,null,null,null,"EP 180",{"$f":"IFERROR(SUMIFS(D_D[INV],D_D[MT],3,D_D[EP],$A9),0)","v":11410},{"$f":"IFERROR(SUMIFS(D_D[BL],D_D[MT],3,D_D[EP],$A9),0)","v":2418},0.21191936897458369]
["140","Initial claims from surviving spouses, children or parents",null,null,null,null,"EP 140",{"$f":"IFERROR(SUMIFS(D_D[INV],D_D[MT],3,D_D[EP],$A10),0)","v":20631},{"$f":"IFERROR(SUMIFS(D_D[BL],D_D[MT],3,D_D[EP],$A10),0)","v":8413},0.40778440211332462]
[null,"Supplemental Entitlement",null,null,null,null,"Total",{"$f":"SUM(H12:H21)","v":702125},{"$f":"SUM(I12:I21)","v":186047},0.2649770340039167]
["120","Increased entitlement and/or reconsideration for Pension",null,null,null,null,"EP 120",{"$f":"IFERROR(SUMIFS(D_D[INV],D_D[MT],3,D_D[EP],$A12),0)","v":5172},{"$f":"IFERROR(SUMIFS(D_D[BL],D_D[MT],3,D_D[EP],$A12),0)","v":1107},0.2140371229698376]
["020","Increased evaluation and/or additional claimed conditions",null,null,null,null,"EP 020",{"$f":"IFERROR(SUMIFS(D_D[INV],D_D[MT],3,D_D[EP],$A13),0)","v":452548},{"$f":"IFERROR(SUMIFS(D_D[BL],D_D[MT],3,D_D[EP],$A13),0)","v":116973},0.25847644890707727]
["310G","Future examination for disabilities",null,null,null,null,"EP 310",{"$f":"IFERROR(SUMIFS(D_D[INV],D_D[MT],3,D_D[EP],$A14),0)","v":9300},{"$f":"IFERROR(SUMIFS(D_D[BL],D_D[MT],3,D_D[EP],$A14),0)","v":548},5.8924731182795696E-2]
["320","Increased entitlement due to hospitalization or surgery",null,null,null,null,"EP 320",{"$f":"IFERROR(SUMIFS(D_D[INV],D_D[MT],3,D_D[EP],$A15),0)","v":974},{"$f":"IFERROR(SUMIFS(D_D[BL],D_D[MT],3,D_D[EP],$A15),0)","v":29},2.9774127310061602E-2]
["681","Used to control claims under the Nehmer Agent Orange stipulation",null,null,null,null,"EP 681",{"$f":"IFERROR(SUMIFS(D_D[INV],D_D[MT],3,D_D[EP],$A16),0)","v":133},{"$f":"IFERROR(SUMIFS(D_D[BL],D_D[MT],3,D_D[EP],$A16),0)","v":70},0.52631578947368418]
["687","Blue Water Navy Agent Orange Nehmer Reviews",null,null,null,null,"EP 687",{"$f":"IFERROR(SUMIFS(D_D[INV],D_D[MT],3,D_D[EP],$A17),0)","v":1},{"$f":"IFERROR(SUMIFS(D_D[BL],D_D[MT],3,D_D[EP],$A17),0)","v":1},{"$f":"IF(H17=0, 0,I17/H17)","v":1}]
["688","NDAA Agent Orange Nehmer Reviews (3 new authorized disabilities)",null,null,null,null,"EP 688",{"$f":"IFERROR(SUMIFS(D_D[INV],D_D[MT],3,D_D[EP],$A18),0)","v":777},{"$f":"IFERROR(SUMIFS(D_D[BL],D_D[MT],3,D_D[EP],$A18),0)","v":757},{"$f":"IF(H18=0, 0,I18/H18)","v":0.97425997425997424}]
["405","Reopened or new Agent Orange claims between 9/01/10 and 10/24/2011",null,null,null,null,"EP 405",{"$f":"IFERROR(SUMIFS(D_D[INV],D_D[MT],3,D_D[EP],$A19),0)","v":0},{"$f":"IFERROR(SUMIFS(D_D[BL],D_D[MT],3,D_D[EP],$A19),0)","v":0},{"$f":"IF(H19=0, 0,I19/H19)","v":0}]
["040","Decision Review Request - AMA Supplemental Claims",null,null,null,null,"EP 040",{"$f":"IFERROR(SUMIFS(D_D[INV],D_D[MT],3.1,D_D[EP],$A20),0)","v":233210},{"$f":"IFERROR(SUMIFS(D_D[BL],D_D[MT],3.1,D_D[EP],$A20),0)","v":66562},{"$f":"IF(H20=0, 0,I20/H20)","v":0.28541657733373355}]
["409","Agent Orange claims where an interim decision was provided; No longer used as of 10/24/2011",null,null,null,null,"EP 409",{"$f":"IFERROR(SUMIFS(D_D[INV],D_D[MT],3,D_D[EP],$A21),0)","v":10},{"$f":"IFERROR(SUMIFS(D_D[BL],D_D[MT],3,D_D[EP],$A21),0)","v":0},{"$f":"IF(H21=0, 0,I21/H21)","v":0}]
[null,"Compensation Other – Diary – Becomes Part of Rating Bundle on 1/1/2020",null,null,null,null,"Total",{"$f":"SUM(H23)","v":8269},{"$f":"SUM(I23)","v":7179},{"$f":"IF(H22=0, 0,I22/H22)","v":0.86818236788003389}]
["335","Blue Water Navy - Agent Orange",null,null,null,null,"EP 335",{"$f":"IFERROR(SUMIFS(D_D[INV],D_D[MT],3,D_D[EP],$A23),0)","v":8269},{"$f":"IFERROR(SUMIFS(D_D[BL],D_D[MT],3,D_D[EP],$A23),0)","v":7179},0.86818236788003389]
[]
[null,"Education Metrics",null,null,null,null,{"$f":"\"Pending on \" &TEXT(D_DT[]-0-1,\"MM/DD/YY\")","v":"Pending on 08/04/23"},{"$f":"\"Pending on \" &TEXT(D_DT[]-8,\"MM/DD/YY\")","v":"Pending on 07/28/23"},"# Change","% Change"]
[1,"Total Chapter 33 Original Claims *",null,null,null,null,{"$f":"IFERROR(SUMIFS(D_D[INV],D_D[MT],9,D_D[CAT],1,D_D[LOC],$A26),0)","v":13473},{"$f":"IFERROR(SUMIFS(D_D[BL],D_D[MT],9,D_D[CAT],1,D_D[LOC],$A26),0)","v":13357},{"$f":"IFERROR(SUMIFS(D_D[ADP],D_D[MT],9,D_D[CAT],1,D_D[LOC],$A26),0)","v":116},{"$f":"IFERROR(I26/H26,0)","v":8.6845848618701798E-3}]
[307,"Buffalo",null,null,null,null,{"$f":"IFERROR(SUMIFS(D_D[INV],D_D[MT],9,D_D[CAT],1,D_D[LOC],$A27),0)","v":7556},{"$f":"IFERROR(SUMIFS(D_D[BL],D_D[MT],9,D_D[CAT],1,D_D[LOC],$A27),0)","v":7323},{"$f":"IFERROR(SUMIFS(D_D[ADP],D_D[MT],9,D_D[CAT],1,D_D[LOC],$A27),0)","v":233},{"$f":"IFERROR(I27/H27,0)","v":3.1817561108835178E-2}]
[316,"Atlanta",null,null,null,null,{"$f":"IFERROR(SUMIFS(D_D[INV],D_D[MT],9,D_D[CAT],1,D_D[LOC],$A28),0)","v":0},{"$f":"IFERROR(SUMIFS(D_D[BL],D_D[MT],9,D_D[CAT],1,D_D[LOC],$A28),0)","v":0},{"$f":"IFERROR(SUMIFS(D_D[ADP],D_D[MT],9,D_D[CAT],1,D_D[LOC],$A28),0)","v":0},{"$f":"IF(H28=0, 0,I28/H28)","v":0}]
[331,"St Louis",null,null,null,null,{"$f":"IFERROR(SUMIFS(D_D[INV],D_D[MT],9,D_D[CAT],1,D_D[LOC],$A29),0)","v":0},{"$f":"IFERROR(SUMIFS(D_D[BL],D_D[MT],9,D_D[CAT],1,D_D[LOC],$A29),0)","v":0},{"$f":"IFERROR(SUMIFS(D_D[ADP],D_D[MT],9,D_D[CAT],1,D_D[LOC],$A29),0)","v":0},{"$f":"IFERROR(I29/H29,0)","v":0}]
[351,"Muskogee",null,null,null,null,{"$f":"IFERROR(SUMIFS(D_D[INV],D_D[MT],9,D_D[CAT],1,D_D[LOC],$A30),0)","v":5917},{"$f":"IFERROR(SUMIFS(D_D[BL],D_D[MT],9,D_D[CAT],1,D_D[LOC],$A30),0)","v":6034},{"$f":"IFERROR(SUMIFS(D_D[ADP],D_D[MT],9,D_D[CAT],1,D_D[LOC],$A30),0)","v":-117},{"$f":"IFERROR(I30/H30,0)","v":-1.9390122638382499E-2}]
[1,"Total Education Claims - All Education Programs **",null,null,null,null,{"$f":"IFERROR(SUMIFS(D_D[INV],D_D[MT],9,D_D[CAT],2,D_D[LOC],$A31),0)","v":44642},{"$f":"IFERROR(SUMIFS(D_D[BL],D_D[MT],9,D_D[CAT],2,D_D[LOC],$A31),0)","v":39914},{"$f":"IFERROR(SUMIFS(D_D[ADP],D_D[MT],9,D_D[CAT],2,D_D[LOC],$A31),0)","v":4728},{"$f":"IFERROR(I31/H31,0)","v":0.118454677556747}]
[307,"Buffalo",null,null,null,null,{"$f":"IFERROR(SUMIFS(D_D[INV],D_D[MT],9,D_D[CAT],2,D_D[LOC],$A32),0)","v":22473},{"$f":"IFERROR(SUMIFS(D_D[BL],D_D[MT],9,D_D[CAT],2,D_D[LOC],$A32),0)","v":19628},{"$f":"IFERROR(SUMIFS(D_D[ADP],D_D[MT],9,D_D[CAT],2,D_D[LOC],$A32),0)","v":2845},{"$f":"IFERROR(I32/H32,0)","v":0.14494599551660892}]
[316,"Atlanta",null,null,null,null,{"$f":"IFERROR(SUMIFS(D_D[INV],D_D[MT],9,D_D[CAT],2,D_D[LOC],$A33),0)","v":0},{"$f":"IFERROR(SUMIFS(D_D[BL],D_D[MT],9,D_D[CAT],2,D_D[LOC],$A33),0)","v":0},{"$f":"IFERROR(SUMIFS(D_D[ADP],D_D[MT],9,D_D[CAT],2,D_D[LOC],$A33),0)","v":0},{"$f":"IF(H33=0, 0,I33/H33)","v":0}]
[331,"St Louis",null,null,null,null,{"$f":"IFERROR(SUMIFS(D_D[INV],D_D[MT],9,D_D[CAT],2,D_D[LOC],$A34),0)","v":0},{"$f":"IFERROR(SUMIFS(D_D[BL],D_D[MT],9,D_D[CAT],2,D_D[LOC],$A34),0)","v":0},{"$f":"IFERROR(SUMIFS(D_D[ADP],D_D[MT],9,D_D[CAT],2,D_D[LOC],$A34),0)","v":0},{"$f":"IFERROR(I34/H34,0)","v":0}]
[351,"Muskogee",null,null,null,null,{"$f":"IFERROR(SUMIFS(D_D[INV],D_D[MT],9,D_D[CAT],2,D_D[LOC],$A35),0)","v":22169},{"$f":"IFERROR(SUMIFS(D_D[BL],D_D[MT],9,D_D[CAT],2,D_D[LOC],$A35),0)","v":20286},{"$f":"IFERROR(SUMIFS(D_D[ADP],D_D[MT],9,D_D[CAT],2,D_D[LOC],$A35),0)","v":1883},{"$f":"IFERROR(I35/H35,0)","v":9.2822636300897168E-2}]
[]
[null,"*Chapter 33 is the Post-9/11GI Bill. "]
[null,"**Represents all Education Benefit Programs, including  Chapter 33 claims."]

{"sheet":"Rating Bundle - SOJ","index":4,"n_rows":35,"n_cols":17,"rows_kept":35,"cut":false,"hidden":false,"merged":[[8,8,10,8],[8,9,10,9],[8,10,10,10],[8,11,10,11],[1,3,1,10],[1,11,1,16],[2,3,2,10],[2,11,2,16],[8,3,10,3],[8,4,10,4],[8,5,10,5],[8,6,10,6],[8,7,10,7],[9,16,10,16],[7,3,7,10],[7,11,7,16],[8,12,10,12],[8,13,8,14],[9,14,10,14],[8,15,8,16],[6,11,6,16]]}
[]
[null,null,"DISTRICT SELECTOR","Compensation and Pension Rating Bundle Metrics",null,null,null,null,null,null,null,"Report through"]
[null,null,null,"Station of Jurisdiction View",null,null,null,null,null,null,null,{"$f":"D_DT[]","v":"2023-08-05"}]
[null,null,null,"The Station of Jurisdiction (SOJ)  is the regional office assigned to work the claim",null,null,null,null,null,null,null,"ADP = Average Days Pending",null,null,"MTD = Month to Date"]
[null,null,null,"Each Special Mission has distinct claim counts",null,null,null,null,null,null,null,"ADC = Average Days to Complete",null,null,"FYTD = Fiscal Year to Date"]
[null,null,null,"When Special Mission is set to Pension, BDD, or Quickstart, the District Selector has no impact"]
[null,null,null,null,null,null,null,null,null,null,null,"Accuracy is available in Compensation and Pension Special Missions"]
[null,null,null,"CLAIM METRICS",null,null,null,null,null,null,null,"ACCURACY METRICS"]
[null,null,"SPECIAL MISSION SELECTOR","#\nPending","#\nPending\n> 125 Days","%\nPending\n> 125 Days","ADP","#\nCompleted\nMTD","ADC\nMTD","#\nCompleted\nFYTD","ADC\nFYTD","Rating\n3 Month Issue","Rating\n3 Month\nClaim","Rating 12 Month",null,"Authorization 12 Month"]
[null,null,null,null,null,null,null,null,null,null,null,null,null,"%","Margin of Error +/-","%","Margin of Error +/-"]
[null,null,null,null,null,null,null,null,null,null,null,null,null,"Correct",null,"Correct"]
[100,null,{"$f":"Driver!$C$20& \" Total\"","v":"USA - All Missions Total"},{"$f":"IF(ISNA($A12),\"\",IFERROR(SUMIFS(D_D[INV],D_D[MT],5,D_D[CAT],SMS, D_D[EP],-1,D_D[LOC],$A12),0))","v":944142},{"$f":"IF(ISNA($A12),\"\",IFERROR(SUMIFS(D_D[BL],D_D[MT],5,D_D[CAT],SMS, D_D[EP],-1,D_D[LOC],$A12),0))","v":272525},{"$f":"IF(ISNA($A12),\"\",IFERROR(E12/D12,0))","v":0.28864831773186661},{"$f":"IF(ISNA($A12),\"\",IFERROR(SUMIFS(D_D[ADP],D_D[MT],5,D_D[CAT],SMS, D_D[EP],-1,D_D[LOC],$A12),0))","v":101.95},{"$f":"IF(ISNA($A12),\"\",IFERROR(SUMIFS(D_D[PROD_MTD],D_D[MT],5,D_D[CAT],SMS, D_D[EP],-1,D_D[LOC],$A12),0))","v":29266},{"$f":"IF(ISNA($A12),\"\",IFERROR(SUMIFS(D_D[ADCM],D_D[MT],5,D_D[CAT],SMS, D_D[EP],-1,D_D[LOC],$A12),0))","v":134.41999999999999},{"$f":"IF(ISNA($A12),\"\",IFERROR(SUMIFS(D_D[PROD_FYTD],D_D[MT],5,D_D[CAT],SMS, D_D[EP],-1,D_D[LOC],$A12),0))","v":1651604},{"$f":"IF(ISNA($A12),\"\",IFERROR(SUMIFS(D_D[ADCF],D_D[MT],5,D_D[CAT],SMS, D_D[EP],-1,D_D[LOC],$A12),0))","v":129.33000000000001},{"$f":"IF(ISNA($A12-99),\"\",IFERROR(SUMIFS(D_D[INV],D_D[MT],8,D_D[CAT],SMS,D_D[LOC],$A12-99),0))","v":0},{"$f":"IF(ISNA($A12-99),\"\",IFERROR(SUMIFS(D_D[BL],D_D[MT],8,D_D[CAT],SMS,D_D[LOC],$A12-99),0))","v":0},{"$f":"IF(ISNA($A12-99),\"\",IFERROR(SUMIFS(D_D[ADP],D_D[MT],8,D_D[CAT],SMS,D_D[LOC],$A12-99),0))","v":0},{"$f":"IF(ISNA($A12-99),\"\",IFERROR(SUMIFS(D_D[PROD_MTD],D_D[MT],8,D_D[CAT],SMS,D_D[LOC],$A12-99),0))","v":0},{"$f":"IF(ISNA($A12-99),\"\",IFERROR(SUMIFS(D_D[PROD_FYTD],D_D[MT],8,D_D[CAT],SMS,D_D[LOC],$A12-99),0))","v":0},{"$f":"IF(ISNA($A12-99),\"\",IFERROR(SUMIFS(D_D[ADCM],D_D[MT],8,D_D[CAT],SMS,D_D[LOC],$A12-99),0))","v":0}]
[{"$f":"INDEX(RO,(MATCH($C13,RO_D,0)))","v":"395"},1,{"$f":"IFERROR(INDEX(INDIRECT(DS_RO_N),B13),\"\")","v":"Pacific District"},{"$f":"IF(ISNA($A13),\"\",IFERROR(SUMIFS(D_D[INV],D_D[MT],5,D_D[CAT],SMS, D_D[EP],-1,D_D[LOC],$A13),0))","v":34382},{"$f":"IF(ISNA($A13),\"\",IFERROR(SUMIFS(D_D[BL],D_D[MT],5,D_D[CAT],SMS, D_D[EP],-1,D_D[LOC],$A13),0))","v":10802},{"$f":"IF(ISNA($A13),\"\",IFERROR(E13/D13,0))","v":0.31417602233726949},{"$f":"IF(ISNA($A13),\"\",IFERROR(SUMIFS(D_D[ADP],D_D[MT],5,D_D[CAT],SMS, D_D[EP],-1,D_D[LOC],$A13),0))","v":104.51},{"$f":"IF(ISNA($A13),\"\",IFERROR(SUMIFS(D_D[PROD_MTD],D_D[MT],5,D_D[CAT],SMS, D_D[EP],-1,D_D[LOC],$A13),0))","v":5667},{"$f":"IF(ISNA($A13),\"\",IFERROR(SUMIFS(D_D[ADCM],D_D[MT],5,D_D[CAT],SMS, D_D[EP],-1,D_D[LOC],$A13),0))","v":124.29},{"$f":"IF(ISNA($A13),\"\",IFERROR(SUMIFS(D_D[PROD_FYTD],D_D[MT],5,D_D[CAT],SMS, D_D[EP],-1,D_D[LOC],$A13),0))","v":325649},{"$f":"IF(ISNA($A13),\"\",IFERROR(SUMIFS(D_D[ADCF],D_D[MT],5,D_D[CAT],SMS, D_D[EP],-1,D_D[LOC],$A13),0))","v":126.72},{"$f":"IF(ISNA($A13),\"\",IFERROR(SUMIFS(D_D[INV],D_D[MT],8,D_D[CAT],SMS,D_D[LOC],$A13),0))","v":0},{"$f":"IF(ISNA($A13),\"\",IFERROR(SUMIFS(D_D[BL],D_D[MT],8,D_D[CAT],SMS,D_D[LOC],$A13),0))","v":0},{"$f":"IF(ISNA($A13),\"\",IFERROR(SUMIFS(D_D[ADP],D_D[MT],8,D_D[CAT],SMS,D_D[LOC],$A13),0))","v":0},{"$f":"IF(ISNA($A13),\"\",IFERROR(SUMIFS(D_D[PROD_MTD],D_D[MT],8,D_D[CAT],SMS,D_D[LOC],$A13),0))","v":0},{"$f":"IF(ISNA($A13),\"\",IFERROR(SUMIFS(D_D[PROD_FYTD],D_D[MT],8,D_D[CAT],SMS,D_D[LOC],$A13),0))","v":0},{"$f":"IF(ISNA($A13),\"\",IFERROR(SUMIFS(D_D[ADCM],D_D[MT],8,D_D[CAT],SMS,D_D[LOC],$A13),0))","v":0}]
["340",2,{"$f":"IFERROR(INDEX(INDIRECT(DS_RO_N),B14),\"\")","v":"Albuquerque"},{"$f":"IF(ISNA($A14),\"\",IFERROR(SUMIFS(D_D[INV],D_D[MT],5,D_D[CAT],SMS, D_D[EP],-1,D_D[LOC],$A14),0))","v":1330},{"$f":"IF(ISNA($A14),\"\",IFERROR(SUMIFS(D_D[BL],D_D[MT],5,D_D[CAT],SMS, D_D[EP],-1,D_D[LOC],$A14),0))","v":350},{"$f":"IF(ISNA($A14),\"\",IFERROR(E14/D14,0))","v":0.26315789473684209},{"$f":"IF(ISNA($A14),\"\",IFERROR(SUMIFS(D_D[ADP],D_D[MT],5,D_D[CAT],SMS, D_D[EP],-1,D_D[LOC],$A14),0))","v":84.79},{"$f":"IF(ISNA($A14),\"\",IFERROR(SUMIFS(D_D[PROD_MTD],D_D[MT],5,D_D[CAT],SMS, D_D[EP],-1,D_D[LOC],$A14),0))","v":219},{"$f":"IF(ISNA($A14),\"\",IFERROR(SUMIFS(D_D[ADCM],D_D[MT],5,D_D[CAT],SMS, D_D[EP],-1,D_D[LOC],$A14),0))","v":137.99},{"$f":"IF(ISNA($A14),\"\",IFERROR(SUMIFS(D_D[PROD_FYTD],D_D[MT],5,D_D[CAT],SMS, D_D[EP],-1,D_D[LOC],$A14),0))","v":11097},{"$f":"IF(ISNA($A14),\"\",IFERROR(SUMIFS(D_D[ADCF],D_D[MT],5,D_D[CAT],SMS, D_D[EP],-1,D_D[LOC],$A14),0))","v":137.93},{"$f":"IF(ISNA($A14),\"\",IFERROR(SUMIFS(D_D[INV],D_D[MT],8,D_D[CAT],SMS,D_D[LOC],$A14),0))","v":0},{"$f":"IF(ISNA($A14),\"\",IFERROR(SUMIFS(D_D[BL],D_D[MT],8,D_D[CAT],SMS,D_D[LOC],$A14),0))","v":0},{"$f":"IF(ISNA($A14),\"\",IFERROR(SUMIFS(D_D[ADP],D_D[MT],8,D_D[CAT],SMS,D_D[LOC],$A14),0))","v":0},{"$f":"IF(ISNA($A14),\"\",IFERROR(SUMIFS(D_D[PROD_MTD],D_D[MT],8,D_D[CAT],SMS,D_D[LOC],$A14),0))","v":0},{"$f":"IF(ISNA($A14),\"\",IFERROR(SUMIFS(D_D[PROD_FYTD],D_D[MT],8,D_D[CAT],SMS,D_D[LOC],$A14),0))","v":0},{"$f":"IF(ISNA($A14),\"\",IFERROR(SUMIFS(D_D[ADCM],D_D[MT],8,D_D[CAT],SMS,D_D[LOC],$A14),0))","v":0}]
["463",3,"Anchorage",{"$f":"IF(ISNA($A15),\"\",IFERROR(SUMIFS(D_D[INV],D_D[MT],5,D_D[CAT],SMS, D_D[EP],-1,D_D[LOC],$A15),0))","v":451},{"$f":"IF(ISNA($A15),\"\",IFERROR(SUMIFS(D_D[BL],D_D[MT],5,D_D[CAT],SMS, D_D[EP],-1,D_D[LOC],$A15),0))","v":131},0.29046563192904656,{"$f":"IF(ISNA($A15),\"\",IFERROR(SUMIFS(D_D[ADP],D_D[MT],5,D_D[CAT],SMS, D_D[EP],-1,D_D[LOC],$A15),0))","v":93.55},{"$f":"IF(ISNA($A15),\"\",IFERROR(SUMIFS(D_D[PROD_MTD],D_D[MT],5,D_D[CAT],SMS, D_D[EP],-1,D_D[LOC],$A15),0))","v":50},{"$f":"IF(ISNA($A15),\"\",IFERROR(SUMIFS(D_D[ADCM],D_D[MT],5,D_D[CAT],SMS, D_D[EP],-1,D_D[LOC],$A15),0))","v":144.24},{"$f":"IF(ISNA($A15),\"\",IFERROR(SUMIFS(D_D[PROD_FYTD],D_D[MT],5,D_D[CAT],SMS, D_D[EP],-1,D_D[LOC],$A15),0))","v":4068},{"$f":"IF(ISNA($A15),\"\",IFERROR(SUMIFS(D_D[ADCF],D_D[MT],5,D_D[CAT],SMS, D_D[EP],-1,D_D[LOC],$A15),0))","v":140.52000000000001},{"$f":"IF(ISNA($A15),\"\",IFERROR(SUMIFS(D_D[INV],D_D[MT],8,D_D[CAT],SMS,D_D[LOC],$A15),0))","v":0},{"$f":"IF(ISNA($A15),\"\",IFERROR(SUMIFS(D_D[BL],D_D[MT],8,D_D[CAT],SMS,D_D[LOC],$A15),0))","v":0},{"$f":"IF(ISNA($A15),\"\",IFERROR(SUMIFS(D_D[ADP],D_D[MT],8,D_D[CAT],SMS,D_D[LOC],$A15),0))","v":0},{"$f":"IF(ISNA($A15),\"\",IFERROR(SUMIFS(D_D[PROD_MTD],D_D[MT],8,D_D[CAT],SMS,D_D[LOC],$A15),0))","v":0},{"$f":"IF(ISNA($A15),\"\",IFERROR(SUMIFS(D_D[PROD_FYTD],D_D[MT],8,D_D[CAT],SMS,D_D[LOC],$A15),0))","v":0},{"$f":"IF(ISNA($A15),\"\",IFERROR(SUMIFS(D_D[ADCM],D_D[MT],8,D_D[CAT],SMS,D_D[LOC],$A15),0))","v":0}]
["347",4,"Boise",{"$f":"IF(ISNA($A16),\"\",IFERROR(SUMIFS(D_D[INV],D_D[MT],5,D_D[CAT],SMS, D_D[EP],-1,D_D[LOC],$A16),0))","v":1108},{"$f":"IF(ISNA($A16),\"\",IFERROR(SUMIFS(D_D[BL],D_D[MT],5,D_D[CAT],SMS, D_D[EP],-1,D_D[LOC],$A16),0))","v":467},0.42148014440433212,{"$f":"IF(ISNA($A16),\"\",IFERROR(SUMIFS(D_D[ADP],D_D[MT],5,D_D[CAT],SMS, D_D[EP],-1,D_D[LOC],$A16),0))","v":108.79},{"$f":"IF(ISNA($A16),\"\",IFERROR(SUMIFS(D_D[PROD_MTD],D_D[MT],5,D_D[CAT],SMS, D_D[EP],-1,D_D[LOC],$A16),0))","v":156},{"$f":"IF(ISNA($A16),\"\",IFERROR(SUMIFS(D_D[ADCM],D_D[MT],5,D_D[CAT],SMS, D_D[EP],-1,D_D[LOC],$A16),0))","v":129.91999999999999},{"$f":"IF(ISNA($A16),\"\",IFERROR(SUMIFS(D_D[PROD_FYTD],D_D[MT],5,D_D[CAT],SMS, D_D[EP],-1,D_D[LOC],$A16),0))","v":8781},{"$f":"IF(ISNA($A16),\"\",IFERROR(SUMIFS(D_D[ADCF],D_D[MT],5,D_D[CAT],SMS, D_D[EP],-1,D_D[LOC],$A16),0))","v":113},{"$f":"IF(ISNA($A16),\"\",IFERROR(SUMIFS(D_D[INV],D_D[MT],8,D_D[CAT],SMS,D_D[LOC],$A16),0))","v":0},{"$f":"IF(ISNA($A16),\"\",IFERROR(SUMIFS(D_D[BL],D_D[MT],8,D_D[CAT],SMS,D_D[LOC],$A16),0))","v":0},{"$f":"IF(ISNA($A16),\"\",IFERROR(SUMIFS(D_D[ADP],D_D[MT],8,D_D[CAT],SMS,D_D[LOC],$A16),0))","v":0},{"$f":"IF(ISNA($A16),\"\",IFERROR(SUMIFS(D_D[PROD_MTD],D_D[MT],8,D_D[CAT],SMS,D_D[LOC],$A16),0))","v":0},{"$f":"IF(ISNA($A16),\"\",IFERROR(SUMIFS(D_D[PROD_FYTD],D_D[MT],8,D_D[CAT],SMS,D_D[LOC],$A16),0))","v":0},{"$f":"IF(ISNA($A16),\"\",IFERROR(SUMIFS(D_D[ADCM],D_D[MT],8,D_D[CAT],SMS,D_D[LOC],$A16),0))","v":0}]
["459",5,"Honolulu",{"$f":"IF(ISNA($A17),\"\",IFERROR(SUMIFS(D_D[INV],D_D[MT],5,D_D[CAT],SMS, D_D[EP],-1,D_D[LOC],$A17),0))","v":848},{"$f":"IF(ISNA($A17),\"\",IFERROR(SUMIFS(D_D[BL],D_D[MT],5,D_D[CAT],SMS, D_D[EP],-1,D_D[LOC],$A17),0))","v":250},0.294811320754717,{"$f":"IF(ISNA($A17),\"\",IFERROR(SUMIFS(D_D[ADP],D_D[MT],5,D_D[CAT],SMS, D_D[EP],-1,D_D[LOC],$A17),0))","v":95.19},{"$f":"IF(ISNA($A17),\"\",IFERROR(SUMIFS(D_D[PROD_MTD],D_D[MT],5,D_D[CAT],SMS, D_D[EP],-1,D_D[LOC],$A17),0))","v":149},{"$f":"IF(ISNA($A17),\"\",IFERROR(SUMIFS(D_D[ADCM],D_D[MT],5,D_D[CAT],SMS, D_D[EP],-1,D_D[LOC],$A17),0))","v":138.28},{"$f":"IF(ISNA($A17),\"\",IFERROR(SUMIFS(D_D[PROD_FYTD],D_D[MT],5,D_D[CAT],SMS, D_D[EP],-1,D_D[LOC],$A17),0))","v":7155},{"$f":"IF(ISNA($A17),\"\",IFERROR(SUMIFS(D_D[ADCF],D_D[MT],5,D_D[CAT],SMS, D_D[EP],-1,D_D[LOC],$A17),0))","v":133.33000000000001},{"$f":"IF(ISNA($A17),\"\",IFERROR(SUMIFS(D_D[INV],D_D[MT],8,D_D[CAT],SMS,D_D[LOC],$A17),0))","v":0},{"$f":"IF(ISNA($A17),\"\",IFERROR(SUMIFS(D_D[BL],D_D[MT],8,D_D[CAT],SMS,D_D[LOC],$A17),0))","v":0},{"$f":"IF(ISNA($A17),\"\",IFERROR(SUMIFS(D_D[ADP],D_D[MT],8,D_D[CAT],SMS,D_D[LOC],$A17),0))","v":0},{"$f":"IF(ISNA($A17),\"\",IFERROR(SUMIFS(D_D[PROD_MTD],D_D[MT],8,D_D[CAT],SMS,D_D[LOC],$A17),0))","v":0},{"$f":"IF(ISNA($A17),\"\",IFERROR(SUMIFS(D_D[PROD_FYTD],D_D[MT],8,D_D[CAT],SMS,D_D[LOC],$A17),0))","v":0},{"$f":"IF(ISNA($A17),\"\",IFERROR(SUMIFS(D_D[ADCM],D_D[MT],8,D_D[CAT],SMS,D_D[LOC],$A17),0))","v":0}]
["344",6,"Los Angeles",{"$f":"IF(ISNA($A18),\"\",IFERROR(SUMIFS(D_D[INV],D_D[MT],5,D_D[CAT],SMS, D_D[EP],-1,D_D[LOC],$A18),0))","v":3643},{"$f":"IF(ISNA($A18),\"\",IFERROR(SUMIFS(D_D[BL],D_D[MT],5,D_D[CAT],SMS, D_D[EP],-1,D_D[LOC],$A18),0))","v":773},0.21218775734284931,{"$f":"IF(ISNA($A18),\"\",IFERROR(SUMIFS(D_D[ADP],D_D[MT],5,D_D[CAT],SMS, D_D[EP],-1,D_D[LOC],$A18),0))","v":99.95},{"$f":"IF(ISNA($A18),\"\",IFERROR(SUMIFS(D_D[PROD_MTD],D_D[MT],5,D_D[CAT],SMS, D_D[EP],-1,D_D[LOC],$A18),0))","v":503},{"$f":"IF(ISNA($A18),\"\",IFERROR(SUMIFS(D_D[ADCM],D_D[MT],5,D_D[CAT],SMS, D_D[EP],-1,D_D[LOC],$A18),0))","v":125.43},{"$f":"IF(ISNA($A18),\"\",IFERROR(SUMIFS(D_D[PROD_FYTD],D_D[MT],5,D_D[CAT],SMS, D_D[EP],-1,D_D[LOC],$A18),0))","v":25445},{"$f":"IF(ISNA($A18),\"\",IFERROR(SUMIFS(D_D[ADCF],D_D[MT],5,D_D[CAT],SMS, D_D[EP],-1,D_D[LOC],$A18),0))","v":122.13},{"$f":"IF(ISNA($A18),\"\",IFERROR(SUMIFS(D_D[INV],D_D[MT],8,D_D[CAT],SMS,D_D[LOC],$A18),0))","v":0},{"$f":"IF(ISNA($A18),\"\",IFERROR(SUMIFS(D_D[BL],D_D[MT],8,D_D[CAT],SMS,D_D[LOC],$A18),0))","v":0},{"$f":"IF(ISNA($A18),\"\",IFERROR(SUMIFS(D_D[ADP],D_D[MT],8,D_D[CAT],SMS,D_D[LOC],$A18),0))","v":0},{"$f":"IF(ISNA($A18),\"\",IFERROR(SUMIFS(D_D[PROD_MTD],D_D[MT],8,D_D[CAT],SMS,D_D[LOC],$A18),0))","v":0},{"$f":"IF(ISNA($A18),\"\",IFERROR(SUMIFS(D_D[PROD_FYTD],D_D[MT],8,D_D[CAT],SMS,D_D[LOC],$A18),0))","v":0},{"$f":"IF(ISNA($A18),\"\",IFERROR(SUMIFS(D_D[ADCM],D_D[MT],8,D_D[CAT],SMS,D_D[LOC],$A18),0))","v":0}]
["358",7,"Manila",{"$f":"IF(ISNA($A19),\"\",IFERROR(SUMIFS(D_D[INV],D_D[MT],5,D_D[CAT],SMS, D_D[EP],-1,D_D[LOC],$A19),0))","v":512},{"$f":"IF(ISNA($A19),\"\",IFERROR(SUMIFS(D_D[BL],D_D[MT],5,D_D[CAT],SMS, D_D[EP],-1,D_D[LOC],$A19),0))","v":173},0.337890625,{"$f":"IF(ISNA($A19),\"\",IFERROR(SUMIFS(D_D[ADP],D_D[MT],5,D_D[CAT],SMS, D_D[EP],-1,D_D[LOC],$A19),0))","v":114.54},{"$f":"IF(ISNA($A19),\"\",IFERROR(SUMIFS(D_D[PROD_MTD],D_D[MT],5,D_D[CAT],SMS, D_D[EP],-1,D_D[LOC],$A19),0))","v":125},{"$f":"IF(ISNA($A19),\"\",IFERROR(SUMIFS(D_D[ADCM],D_D[MT],5,D_D[CAT],SMS, D_D[EP],-1,D_D[LOC],$A19),0))","v":160.91},{"$f":"IF(ISNA($A19),\"\",IFERROR(SUMIFS(D_D[PROD_FYTD],D_D[MT],5,D_D[CAT],SMS, D_D[EP],-1,D_D[LOC],$A19),0))","v":9048},{"$f":"IF(ISNA($A19),\"\",IFERROR(SUMIFS(D_D[ADCF],D_D[MT],5,D_D[CAT],SMS, D_D[EP],-1,D_D[LOC],$A19),0))","v":158.58000000000001},{"$f":"IF(ISNA($A19),\"\",IFERROR(SUMIFS(D_D[INV],D_D[MT],8,D_D[CAT],SMS,D_D[LOC],$A19),0))","v":0},{"$f":"IF(ISNA($A19),\"\",IFERROR(SUMIFS(D_D[BL],D_D[MT],8,D_D[CAT],SMS,D_D[LOC],$A19),0))","v":0},{"$f":"IF(ISNA($A19),\"\",IFERROR(SUMIFS(D_D[ADP],D_D[MT],8,D_D[CAT],SMS,D_D[LOC],$A19),0))","v":0},{"$f":"IF(ISNA($A19),\"\",IFERROR(SUMIFS(D_D[PROD_MTD],D_D[MT],8,D_D[CAT],SMS,D_D[LOC],$A19),0))","v":0},{"$f":"IF(ISNA($A19),\"\",IFERROR(SUMIFS(D_D[PROD_FYTD],D_D[MT],8,D_D[CAT],SMS,D_D[LOC],$A19),0))","v":0},{"$f":"IF(ISNA($A19),\"\",IFERROR(SUMIFS(D_D[ADCM],D_D[MT],8,D_D[CAT],SMS,D_D[LOC],$A19),0))","v":0}]
["343",8,"Oakland",{"$f":"IF(ISNA($A20),\"\",IFERROR(SUMIFS(D_D[INV],D_D[MT],5,D_D[CAT],SMS, D_D[EP],-1,D_D[LOC],$A20),0))","v":2055},{"$f":"IF(ISNA($A20),\"\",IFERROR(SUMIFS(D_D[BL],D_D[MT],5,D_D[CAT],SMS, D_D[EP],-1,D_D[LOC],$A20),0))","v":503},0.24476885644768856,{"$f":"IF(ISNA($A20),\"\",IFERROR(SUMIFS(D_D[ADP],D_D[MT],5,D_D[CAT],SMS, D_D[EP],-1,D_D[LOC],$A20),0))","v":84.13},{"$f":"IF(ISNA($A20),\"\",IFERROR(SUMIFS(D_D[PROD_MTD],D_D[MT],5,D_D[CAT],SMS, D_D[EP],-1,D_D[LOC],$A20),0))","v":359},{"$f":"IF(ISNA($A20),\"\",IFERROR(SUMIFS(D_D[ADCM],D_D[MT],5,D_D[CAT],SMS, D_D[EP],-1,D_D[LOC],$A20),0))","v":107.38},{"$f":"IF(ISNA($A20),\"\",IFERROR(SUMIFS(D_D[PROD_FYTD],D_D[MT],5,D_D[CAT],SMS, D_D[EP],-1,D_D[LOC],$A20),0))","v":22572},{"$f":"IF(ISNA($A20),\"\",IFERROR(SUMIFS(D_D[ADCF],D_D[MT],5,D_D[CAT],SMS, D_D[EP],-1,D_D[LOC],$A20),0))","v":119.47},{"$f":"IF(ISNA($A20),\"\",IFERROR(SUMIFS(D_D[INV],D_D[MT],8,D_D[CAT],SMS,D_D[LOC],$A20),0))","v":0},{"$f":"IF(ISNA($A20),\"\",IFERROR(SUMIFS(D_D[BL],D_D[MT],8,D_D[CAT],SMS,D_D[LOC],$A20),0))","v":0},{"$f":"IF(ISNA($A20),\"\",IFERROR(SUMIFS(D_D[ADP],D_D[MT],8,D_D[CAT],SMS,D_D[LOC],$A20),0))","v":0},{"$f":"IF(ISNA($A20),\"\",IFERROR(SUMIFS(D_D[PROD_MTD],D_D[MT],8,D_D[CAT],SMS,D_D[LOC],$A20),0))","v":0},{"$f":"IF(ISNA($A20),\"\",IFERROR(SUMIFS(D_D[PROD_FYTD],D_D[MT],8,D_D[CAT],SMS,D_D[LOC],$A20),0))","v":0},{"$f":"IF(ISNA($A20),\"\",IFERROR(SUMIFS(D_D[ADCM],D_D[MT],8,D_D[CAT],SMS,D_D[LOC],$A20),0))","v":0}]
["345",9,"Phoenix",{"$f":"IF(ISNA($A21),\"\",IFERROR(SUMIFS(D_D[INV],D_D[MT],5,D_D[CAT],SMS, D_D[EP],-1,D_D[LOC],$A21),0))","v":4699},{"$f":"IF(ISNA($A21),\"\",IFERROR(SUMIFS(D_D[BL],D_D[MT],5,D_D[CAT],SMS, D_D[EP],-1,D_D[LOC],$A21),0))","v":1821},0.38752926154500955,{"$f":"IF(ISNA($A21),\"\",IFERROR(SUMIFS(D_D[ADP],D_D[MT],5,D_D[CAT],SMS, D_D[EP],-1,D_D[LOC],$A21),0))","v":122.92},{"$f":"IF(ISNA($A21),\"\",IFERROR(SUMIFS(D_D[PROD_MTD],D_D[MT],5,D_D[CAT],SMS, D_D[EP],-1,D_D[LOC],$A21),0))","v":677},{"$f":"IF(ISNA($A21),\"\",IFERROR(SUMIFS(D_D[ADCM],D_D[MT],5,D_D[CAT],SMS, D_D[EP],-1,D_D[LOC],$A21),0))","v":162.19999999999999},{"$f":"IF(ISNA($A21),\"\",IFERROR(SUMIFS(D_D[PROD_FYTD],D_D[MT],5,D_D[CAT],SMS, D_D[EP],-1,D_D[LOC],$A21),0))","v":40713},{"$f":"IF(ISNA($A21),\"\",IFERROR(SUMIFS(D_D[ADCF],D_D[MT],5,D_D[CAT],SMS, D_D[EP],-1,D_D[LOC],$A21),0))","v":165.23},{"$f":"IF(ISNA($A21),\"\",IFERROR(SUMIFS(D_D[INV],D_D[MT],8,D_D[CAT],SMS,D_D[LOC],$A21),0))","v":0},{"$f":"IF(ISNA($A21),\"\",IFERROR(SUMIFS(D_D[BL],D_D[MT],8,D_D[CAT],SMS,D_D[LOC],$A21),0))","v":0},{"$f":"IF(ISNA($A21),\"\",IFERROR(SUMIFS(D_D[ADP],D_D[MT],8,D_D[CAT],SMS,D_D[LOC],$A21),0))","v":0},{"$f":"IF(ISNA($A21),\"\",IFERROR(SUMIFS(D_D[PROD_MTD],D_D[MT],8,D_D[CAT],SMS,D_D[LOC],$A21),0))","v":0},{"$f":"IF(ISNA($A21),\"\",IFERROR(SUMIFS(D_D[PROD_FYTD],D_D[MT],8,D_D[CAT],SMS,D_D[LOC],$A21),0))","v":0},{"$f":"IF(ISNA($A21),\"\",IFERROR(SUMIFS(D_D[ADCM],D_D[MT],8,D_D[CAT],SMS,D_D[LOC],$A21),0))","v":0}]
["348",10,"Portland",{"$f":"IF(ISNA($A22),\"\",IFERROR(SUMIFS(D_D[INV],D_D[MT],5,D_D[CAT],SMS, D_D[EP],-1,D_D[LOC],$A22),0))","v":2253},{"$f":"IF(ISNA($A22),\"\",IFERROR(SUMIFS(D_D[BL],D_D[MT],5,D_D[CAT],SMS, D_D[EP],-1,D_D[LOC],$A22),0))","v":739},0.32800710164225477,{"$f":"IF(ISNA($A22),\"\",IFERROR(SUMIFS(D_D[ADP],D_D[MT],5,D_D[CAT],SMS, D_D[EP],-1,D_D[LOC],$A22),0))","v":121.04},{"$f":"IF(ISNA($A22),\"\",IFERROR(SUMIFS(D_D[PROD_MTD],D_D[MT],5,D_D[CAT],SMS, D_D[EP],-1,D_D[LOC],$A22),0))","v":242},{"$f":"IF(ISNA($A22),\"\",IFERROR(SUMIFS(D_D[ADCM],D_D[MT],5,D_D[CAT],SMS, D_D[EP],-1,D_D[LOC],$A22),0))","v":137.59},{"$f":"IF(ISNA($A22),\"\",IFERROR(SUMIFS(D_D[PROD_FYTD],D_D[MT],5,D_D[CAT],SMS, D_D[EP],-1,D_D[LOC],$A22),0))","v":13000},{"$f":"IF(ISNA($A22),\"\",IFERROR(SUMIFS(D_D[ADCF],D_D[MT],5,D_D[CAT],SMS, D_D[EP],-1,D_D[LOC],$A22),0))","v":168.96},{"$f":"IF(ISNA($A22),\"\",IFERROR(SUMIFS(D_D[INV],D_D[MT],8,D_D[CAT],SMS,D_D[LOC],$A22),0))","v":0},{"$f":"IF(ISNA($A22),\"\",IFERROR(SUMIFS(D_D[BL],D_D[MT],8,D_D[CAT],SMS,D_D[LOC],$A22),0))","v":0},{"$f":"IF(ISNA($A22),\"\",IFERROR(SUMIFS(D_D[ADP],D_D[MT],8,D_D[CAT],SMS,D_D[LOC],$A22),0))","v":0},{"$f":"IF(ISNA($A22),\"\",IFERROR(SUMIFS(D_D[PROD_MTD],D_D[MT],8,D_D[CAT],SMS,D_D[LOC],$A22),0))","v":0},{"$f":"IF(ISNA($A22),\"\",IFERROR(SUMIFS(D_D[PROD_FYTD],D_D[MT],8,D_D[CAT],SMS,D_D[LOC],$A22),0))","v":0},{"$f":"IF(ISNA($A22),\"\",IFERROR(SUMIFS(D_D[ADCM],D_D[MT],8,D_D[CAT],SMS,D_D[LOC],$A22),0))","v":0}]
["354",11,"Reno",{"$f":"IF(ISNA($A23),\"\",IFERROR(SUMIFS(D_D[INV],D_D[MT],5,D_D[CAT],SMS, D_D[EP],-1,D_D[LOC],$A23),0))","v":1048},{"$f":"IF(ISNA($A23),\"\",IFERROR(SUMIFS(D_D[BL],D_D[MT],5,D_D[CAT],SMS, D_D[EP],-1,D_D[LOC],$A23),0))","v":291},0.27767175572519082,{"$f":"IF(ISNA($A23),\"\",IFERROR(SUMIFS(D_D[ADP],D_D[MT],5,D_D[CAT],SMS, D_D[EP],-1,D_D[LOC],$A23),0))","v":99.58},{"$f":"IF(ISNA($A23),\"\",IFERROR(SUMIFS(D_D[PROD_MTD],D_D[MT],5,D_D[CAT],SMS, D_D[EP],-1,D_D[LOC],$A23),0))","v":232},{"$f":"IF(ISNA($A23),\"\",IFERROR(SUMIFS(D_D[ADCM],D_D[MT],5,D_D[CAT],SMS, D_D[EP],-1,D_D[LOC],$A23),0))","v":116.47},{"$f":"IF(ISNA($A23),\"\",IFERROR(SUMIFS(D_D[PROD_FYTD],D_D[MT],5,D_D[CAT],SMS, D_D[EP],-1,D_D[LOC],$A23),0))","v":13085},{"$f":"IF(ISNA($A23),\"\",IFERROR(SUMIFS(D_D[ADCF],D_D[MT],5,D_D[CAT],SMS, D_D[EP],-1,D_D[LOC],$A23),0))","v":131.57},{"$f":"IF(ISNA($A23),\"\",IFERROR(SUMIFS(D_D[INV],D_D[MT],8,D_D[CAT],SMS,D_D[LOC],$A23),0))","v":0},{"$f":"IF(ISNA($A23),\"\",IFERROR(SUMIFS(D_D[BL],D_D[MT],8,D_D[CAT],SMS,D_D[LOC],$A23),0))","v":0},{"$f":"IF(ISNA($A23),\"\",IFERROR(SUMIFS(D_D[ADP],D_D[MT],8,D_D[CAT],SMS,D_D[LOC],$A23),0))","v":0},{"$f":"IF(ISNA($A23),\"\",IFERROR(SUMIFS(D_D[PROD_MTD],D_D[MT],8,D_D[CAT],SMS,D_D[LOC],$A23),0))","v":0},{"$f":"IF(ISNA($A23),\"\",IFERROR(SUMIFS(D_D[PROD_FYTD],D_D[MT],8,D_D[CAT],SMS,D_D[LOC],$A23),0))","v":0},{"$f":"IF(ISNA($A23),\"\",IFERROR(SUMIFS(D_D[ADCM],D_D[MT],8,D_D[CAT],SMS,D_D[LOC],$A23),0))","v":0}]
["341",12,"Salt Lake City",{"$f":"IF(ISNA($A24),\"\",IFERROR(SUMIFS(D_D[INV],D_D[MT],5,D_D[CAT],SMS, D_D[EP],-1,D_D[LOC],$A24),0))","v":2977},{"$f":"IF(ISNA($A24),\"\",IFERROR(SUMIFS(D_D[BL],D_D[MT],5,D_D[CAT],SMS, D_D[EP],-1,D_D[LOC],$A24),0))","v":905},0.30399731273093716,{"$f":"IF(ISNA($A24),\"\",IFERROR(SUMIFS(D_D[ADP],D_D[MT],5,D_D[CAT],SMS, D_D[EP],-1,D_D[LOC],$A24),0))","v":101.41},{"$f":"IF(ISNA($A24),\"\",IFERROR(SUMIFS(D_D[PROD_MTD],D_D[MT],5,D_D[CAT],SMS, D_D[EP],-1,D_D[LOC],$A24),0))","v":580},{"$f":"IF(ISNA($A24),\"\",IFERROR(SUMIFS(D_D[ADCM],D_D[MT],5,D_D[CAT],SMS, D_D[EP],-1,D_D[LOC],$A24),0))","v":124.89},{"$f":"IF(ISNA($A24),\"\",IFERROR(SUMIFS(D_D[PROD_FYTD],D_D[MT],5,D_D[CAT],SMS, D_D[EP],-1,D_D[LOC],$A24),0))","v":34499},{"$f":"IF(ISNA($A24),\"\",IFERROR(SUMIFS(D_D[ADCF],D_D[MT],5,D_D[CAT],SMS, D_D[EP],-1,D_D[LOC],$A24),0))","v":132.08000000000001},{"$f":"IF(ISNA($A24),\"\",IFERROR(SUMIFS(D_D[INV],D_D[MT],8,D_D[CAT],SMS,D_D[LOC],$A24),0))","v":0},{"$f":"IF(ISNA($A24),\"\",IFERROR(SUMIFS(D_D[BL],D_D[MT],8,D_D[CAT],SMS,D_D[LOC],$A24),0))","v":0},{"$f":"IF(ISNA($A24),\"\",IFERROR(SUMIFS(D_D[ADP],D_D[MT],8,D_D[CAT],SMS,D_D[LOC],$A24),0))","v":0},{"$f":"IF(ISNA($A24),\"\",IFERROR(SUMIFS(D_D[PROD_MTD],D_D[MT],8,D_D[CAT],SMS,D_D[LOC],$A24),0))","v":0},{"$f":"IF(ISNA($A24),\"\",IFERROR(SUMIFS(D_D[PROD_FYTD],D_D[MT],8,D_D[CAT],SMS,D_D[LOC],$A24),0))","v":0},{"$f":"IF(ISNA($A24),\"\",IFERROR(SUMIFS(D_D[ADCM],D_D[MT],8,D_D[CAT],SMS,D_D[LOC],$A24),0))","v":0}]
["377",13,"San Diego",{"$f":"IF(ISNA($A25),\"\",IFERROR(SUMIFS(D_D[INV],D_D[MT],5,D_D[CAT],SMS, D_D[EP],-1,D_D[LOC],$A25),0))","v":7235},{"$f":"IF(ISNA($A25),\"\",IFERROR(SUMIFS(D_D[BL],D_D[MT],5,D_D[CAT],SMS, D_D[EP],-1,D_D[LOC],$A25),0))","v":2310},0.31928127159640635,{"$f":"IF(ISNA($A25),\"\",IFERROR(SUMIFS(D_D[ADP],D_D[MT],5,D_D[CAT],SMS, D_D[EP],-1,D_D[LOC],$A25),0))","v":94.07},{"$f":"IF(ISNA($A25),\"\",IFERROR(SUMIFS(D_D[PROD_MTD],D_D[MT],5,D_D[CAT],SMS, D_D[EP],-1,D_D[LOC],$A25),0))","v":1139},{"$f":"IF(ISNA($A25),\"\",IFERROR(SUMIFS(D_D[ADCM],D_D[MT],5,D_D[CAT],SMS, D_D[EP],-1,D_D[LOC],$A25),0))","v":122.72},{"$f":"IF(ISNA($A25),\"\",IFERROR(SUMIFS(D_D[PROD_FYTD],D_D[MT],5,D_D[CAT],SMS, D_D[EP],-1,D_D[LOC],$A25),0))","v":64481},{"$f":"IF(ISNA($A25),\"\",IFERROR(SUMIFS(D_D[ADCF],D_D[MT],5,D_D[CAT],SMS, D_D[EP],-1,D_D[LOC],$A25),0))","v":122.66},{"$f":"IF(ISNA($A25),\"\",IFERROR(SUMIFS(D_D[INV],D_D[MT],8,D_D[CAT],SMS,D_D[LOC],$A25),0))","v":0},{"$f":"IF(ISNA($A25),\"\",IFERROR(SUMIFS(D_D[BL],D_D[MT],8,D_D[CAT],SMS,D_D[LOC],$A25),0))","v":0},{"$f":"IF(ISNA($A25),\"\",IFERROR(SUMIFS(D_D[ADP],D_D[MT],8,D_D[CAT],SMS,D_D[LOC],$A25),0))","v":0},{"$f":"IF(ISNA($A25),\"\",IFERROR(SUMIFS(D_D[PROD_MTD],D_D[MT],8,D_D[CAT],SMS,D_D[LOC],$A25),0))","v":0},{"$f":"IF(ISNA($A25),\"\",IFERROR(SUMIFS(D_D[PROD_FYTD],D_D[MT],8,D_D[CAT],SMS,D_D[LOC],$A25),0))","v":0},{"$f":"IF(ISNA($A25),\"\",IFERROR(SUMIFS(D_D[ADCM],D_D[MT],8,D_D[CAT],SMS,D_D[LOC],$A25),0))","v":0}]
["346",14,"Seattle",{"$f":"IF(ISNA($A26),\"\",IFERROR(SUMIFS(D_D[INV],D_D[MT],5,D_D[CAT],SMS, D_D[EP],-1,D_D[LOC],$A26),0))","v":6223},{"$f":"IF(ISNA($A26),\"\",IFERROR(SUMIFS(D_D[BL],D_D[MT],5,D_D[CAT],SMS, D_D[EP],-1,D_D[LOC],$A26),0))","v":2089},0.3356901815844448,{"$f":"IF(ISNA($A26),\"\",IFERROR(SUMIFS(D_D[ADP],D_D[MT],5,D_D[CAT],SMS, D_D[EP],-1,D_D[LOC],$A26),0))","v":113.16},{"$f":"IF(ISNA($A26),\"\",IFERROR(SUMIFS(D_D[PROD_MTD],D_D[MT],5,D_D[CAT],SMS, D_D[EP],-1,D_D[LOC],$A26),0))","v":1236},{"$f":"IF(ISNA($A26),\"\",IFERROR(SUMIFS(D_D[ADCM],D_D[MT],5,D_D[CAT],SMS, D_D[EP],-1,D_D[LOC],$A26),0))","v":98.68},{"$f":"IF(ISNA($A26),\"\",IFERROR(SUMIFS(D_D[PROD_FYTD],D_D[MT],5,D_D[CAT],SMS, D_D[EP],-1,D_D[LOC],$A26),0))","v":71705},{"$f":"IF(ISNA($A26),\"\",IFERROR(SUMIFS(D_D[ADCF],D_D[MT],5,D_D[CAT],SMS, D_D[EP],-1,D_D[LOC],$A26),0))","v":95.79},{"$f":"IF(ISNA($A26),\"\",IFERROR(SUMIFS(D_D[INV],D_D[MT],8,D_D[CAT],SMS,D_D[LOC],$A26),0))","v":0},{"$f":"IF(ISNA($A26),\"\",IFERROR(SUMIFS(D_D[BL],D_D[MT],8,D_D[CAT],SMS,D_D[LOC],$A26),0))","v":0},{"$f":"IF(ISNA($A26),\"\",IFERROR(SUMIFS(D_D[ADP],D_D[MT],8,D_D[CAT],SMS,D_D[LOC],$A26),0))","v":0},{"$f":"IF(ISNA($A26),\"\",IFERROR(SUMIFS(D_D[PROD_MTD],D_D[MT],8,D_D[CAT],SMS,D_D[LOC],$A26),0))","v":0},{"$f":"IF(ISNA($A26),\"\",IFERROR(SUMIFS(D_D[PROD_FYTD],D_D[MT],8,D_D[CAT],SMS,D_D[LOC],$A26),0))","v":0},{"$f":"IF(ISNA($A26),\"\",IFERROR(SUMIFS(D_D[ADCM],D_D[MT],8,D_D[CAT],SMS,D_D[LOC],$A26),0))","v":0}]
[{"$error":"#N/A"},15,"",{"$f":"IF(ISNA($A27),\"\",IFERROR(SUMIFS(D_D[INV],D_D[MT],5,D_D[CAT],SMS, D_D[EP],-1,D_D[LOC],$A27),0))","v":""},{"$f":"IF(ISNA($A27),\"\",IFERROR(SUMIFS(D_D[BL],D_D[MT],5,D_D[CAT],SMS, D_D[EP],-1,D_D[LOC],$A27),0))","v":""},"",{"$f":"IF(ISNA($A27),\"\",IFERROR(SUMIFS(D_D[ADP],D_D[MT],5,D_D[CAT],SMS, D_D[EP],-1,D_D[LOC],$A27),0))","v":""},{"$f":"IF(ISNA($A27),\"\",IFERROR(SUMIFS(D_D[PROD_MTD],D_D[MT],5,D_D[CAT],SMS, D_D[EP],-1,D_D[LOC],$A27),0))","v":""},{"$f":"IF(ISNA($A27),\"\",IFERROR(SUMIFS(D_D[ADCM],D_D[MT],5,D_D[CAT],SMS, D_D[EP],-1,D_D[LOC],$A27),0))","v":""},{"$f":"IF(ISNA($A27),\"\",IFERROR(SUMIFS(D_D[PROD_FYTD],D_D[MT],5,D_D[CAT],SMS, D_D[EP],-1,D_D[LOC],$A27),0))","v":""},{"$f":"IF(ISNA($A27),\"\",IFERROR(SUMIFS(D_D[ADCF],D_D[MT],5,D_D[CAT],SMS, D_D[EP],-1,D_D[LOC],$A27),0))","v":""},{"$f":"IF(ISNA($A27),\"\",IFERROR(SUMIFS(D_D[INV],D_D[MT],8,D_D[CAT],SMS,D_D[LOC],$A27),0))","v":""},{"$f":"IF(ISNA($A27),\"\",IFERROR(SUMIFS(D_D[BL],D_D[MT],8,D_D[CAT],SMS,D_D[LOC],$A27),0))","v":""},{"$f":"IF(ISNA($A27),\"\",IFERROR(SUMIFS(D_D[ADP],D_D[MT],8,D_D[CAT],SMS,D_D[LOC],$A27),0))","v":""},{"$f":"IF(ISNA($A27),\"\",IFERROR(SUMIFS(D_D[PROD_MTD],D_D[MT],8,D_D[CAT],SMS,D_D[LOC],$A27),0))","v":""},{"$f":"IF(ISNA($A27),\"\",IFERROR(SUMIFS(D_D[PROD_FYTD],D_D[MT],8,D_D[CAT],SMS,D_D[LOC],$A27),0))","v":""},{"$f":"IF(ISNA($A27),\"\",IFERROR(SUMIFS(D_D[ADCM],D_D[MT],8,D_D[CAT],SMS,D_D[LOC],$A27),0))","v":""}]
[{"$error":"#N/A"},16,"",{"$f":"IF(ISNA($A28),\"\",IFERROR(SUMIFS(D_D[INV],D_D[MT],5,D_D[CAT],SMS, D_D[EP],-1,D_D[LOC],$A28),0))","v":""},{"$f":"IF(ISNA($A28),\"\",IFERROR(SUMIFS(D_D[BL],D_D[MT],5,D_D[CAT],SMS, D_D[EP],-1,D_D[LOC],$A28),0))","v":""},"",{"$f":"IF(ISNA($A28),\"\",IFERROR(SUMIFS(D_D[ADP],D_D[MT],5,D_D[CAT],SMS, D_D[EP],-1,D_D[LOC],$A28),0))","v":""},{"$f":"IF(ISNA($A28),\"\",IFERROR(SUMIFS(D_D[PROD_MTD],D_D[MT],5,D_D[CAT],SMS, D_D[EP],-1,D_D[LOC],$A28),0))","v":""},{"$f":"IF(ISNA($A28),\"\",IFERROR(SUMIFS(D_D[ADCM],D_D[MT],5,D_D[CAT],SMS, D_D[EP],-1,D_D[LOC],$A28),0))","v":""},{"$f":"IF(ISNA($A28),\"\",IFERROR(SUMIFS(D_D[PROD_FYTD],D_D[MT],5,D_D[CAT],SMS, D_D[EP],-1,D_D[LOC],$A28),0))","v":""},{"$f":"IF(ISNA($A28),\"\",IFERROR(SUMIFS(D_D[ADCF],D_D[MT],5,D_D[CAT],SMS, D_D[EP],-1,D_D[LOC],$A28),0))","v":""},{"$f":"IF(ISNA($A28),\"\",IFERROR(SUMIFS(D_D[INV],D_D[MT],8,D_D[CAT],SMS,D_D[LOC],$A28),0))","v":""},{"$f":"IF(ISNA($A28),\"\",IFERROR(SUMIFS(D_D[BL],D_D[MT],8,D_D[CAT],SMS,D_D[LOC],$A28),0))","v":""},{"$f":"IF(ISNA($A28),\"\",IFERROR(SUMIFS(D_D[ADP],D_D[MT],8,D_D[CAT],SMS,D_D[LOC],$A28),0))","v":""},{"$f":"IF(ISNA($A28),\"\",IFERROR(SUMIFS(D_D[PROD_MTD],D_D[MT],8,D_D[CAT],SMS,D_D[LOC],$A28),0))","v":""},{"$f":"IF(ISNA($A28),\"\",IFERROR(SUMIFS(D_D[PROD_FYTD],D_D[MT],8,D_D[CAT],SMS,D_D[LOC],$A28),0))","v":""},{"$f":"IF(ISNA($A28),\"\",IFERROR(SUMIFS(D_D[ADCM],D_D[MT],8,D_D[CAT],SMS,D_D[LOC],$A28),0))","v":""}]
[{"$error":"#N/A"},17,"",{"$f":"IF(ISNA($A29),\"\",IFERROR(SUMIFS(D_D[INV],D_D[MT],5,D_D[CAT],SMS, D_D[EP],-1,D_D[LOC],$A29),0))","v":""},{"$f":"IF(ISNA($A29),\"\",IFERROR(SUMIFS(D_D[BL],D_D[MT],5,D_D[CAT],SMS, D_D[EP],-1,D_D[LOC],$A29),0))","v":""},"",{"$f":"IF(ISNA($A29),\"\",IFERROR(SUMIFS(D_D[ADP],D_D[MT],5,D_D[CAT],SMS, D_D[EP],-1,D_D[LOC],$A29),0))","v":""},{"$f":"IF(ISNA($A29),\"\",IFERROR(SUMIFS(D_D[PROD_MTD],D_D[MT],5,D_D[CAT],SMS, D_D[EP],-1,D_D[LOC],$A29),0))","v":""},{"$f":"IF(ISNA($A29),\"\",IFERROR(SUMIFS(D_D[ADCM],D_D[MT],5,D_D[CAT],SMS, D_D[EP],-1,D_D[LOC],$A29),0))","v":""},{"$f":"IF(ISNA($A29),\"\",IFERROR(SUMIFS(D_D[PROD_FYTD],D_D[MT],5,D_D[CAT],SMS, D_D[EP],-1,D_D[LOC],$A29),0))","v":""},{"$f":"IF(ISNA($A29),\"\",IFERROR(SUMIFS(D_D[ADCF],D_D[MT],5,D_D[CAT],SMS, D_D[EP],-1,D_D[LOC],$A29),0))","v":""},{"$f":"IF(ISNA($A29),\"\",IFERROR(SUMIFS(D_D[INV],D_D[MT],8,D_D[CAT],SMS,D_D[LOC],$A29),0))","v":""},{"$f":"IF(ISNA($A29),\"\",IFERROR(SUMIFS(D_D[BL],D_D[MT],8,D_D[CAT],SMS,D_D[LOC],$A29),0))","v":""},{"$f":"IF(ISNA($A29),\"\",IFERROR(SUMIFS(D_D[ADP],D_D[MT],8,D_D[CAT],SMS,D_D[LOC],$A29),0))","v":""},{"$f":"IF(ISNA($A29),\"\",IFERROR(SUMIFS(D_D[PROD_MTD],D_D[MT],8,D_D[CAT],SMS,D_D[LOC],$A29),0))","v":""},{"$f":"IF(ISNA($A29),\"\",IFERROR(SUMIFS(D_D[PROD_FYTD],D_D[MT],8,D_D[CAT],SMS,D_D[LOC],$A29),0))","v":""},{"$f":"IF(ISNA($A29),\"\",IFERROR(SUMIFS(D_D[ADCM],D_D[MT],8,D_D[CAT],SMS,D_D[LOC],$A29),0))","v":""}]
[{"$error":"#N/A"},18,"",{"$f":"IF(ISNA($A30),\"\",IFERROR(SUMIFS(D_D[INV],D_D[MT],5,D_D[CAT],SMS, D_D[EP],-1,D_D[LOC],$A30),0))","v":""},{"$f":"IF(ISNA($A30),\"\",IFERROR(SUMIFS(D_D[BL],D_D[MT],5,D_D[CAT],SMS, D_D[EP],-1,D_D[LOC],$A30),0))","v":""},"",{"$f":"IF(ISNA($A30),\"\",IFERROR(SUMIFS(D_D[ADP],D_D[MT],5,D_D[CAT],SMS, D_D[EP],-1,D_D[LOC],$A30),0))","v":""},{"$f":"IF(ISNA($A30),\"\",IFERROR(SUMIFS(D_D[PROD_MTD],D_D[MT],5,D_D[CAT],SMS, D_D[EP],-1,D_D[LOC],$A30),0))","v":""},{"$f":"IF(ISNA($A30),\"\",IFERROR(SUMIFS(D_D[ADCM],D_D[MT],5,D_D[CAT],SMS, D_D[EP],-1,D_D[LOC],$A30),0))","v":""},{"$f":"IF(ISNA($A30),\"\",IFERROR(SUMIFS(D_D[PROD_FYTD],D_D[MT],5,D_D[CAT],SMS, D_D[EP],-1,D_D[LOC],$A30),0))","v":""},{"$f":"IF(ISNA($A30),\"\",IFERROR(SUMIFS(D_D[ADCF],D_D[MT],5,D_D[CAT],SMS, D_D[EP],-1,D_D[LOC],$A30),0))","v":""},{"$f":"IF(ISNA($A30),\"\",IFERROR(SUMIFS(D_D[INV],D_D[MT],8,D_D[CAT],SMS,D_D[LOC],$A30),0))","v":""},{"$f":"IF(ISNA($A30),\"\",IFERROR(SUMIFS(D_D[BL],D_D[MT],8,D_D[CAT],SMS,D_D[LOC],$A30),0))","v":""},{"$f":"IF(ISNA($A30),\"\",IFERROR(SUMIFS(D_D[ADP],D_D[MT],8,D_D[CAT],SMS,D_D[LOC],$A30),0))","v":""},{"$f":"IF(ISNA($A30),\"\",IFERROR(SUMIFS(D_D[PROD_MTD],D_D[MT],8,D_D[CAT],SMS,D_D[LOC],$A30),0))","v":""},{"$f":"IF(ISNA($A30),\"\",IFERROR(SUMIFS(D_D[PROD_FYTD],D_D[MT],8,D_D[CAT],SMS,D_D[LOC],$A30),0))","v":""},{"$f":"IF(ISNA($A30),\"\",IFERROR(SUMIFS(D_D[ADCM],D_D[MT],8,D_D[CAT],SMS,D_D[LOC],$A30),0))","v":""}]
[{"$error":"#N/A"},19,"",{"$f":"IF(ISNA($A31),\"\",IFERROR(SUMIFS(D_D[INV],D_D[MT],5,D_D[CAT],SMS, D_D[EP],-1,D_D[LOC],$A31),0))","v":""},{"$f":"IF(ISNA($A31),\"\",IFERROR(SUMIFS(D_D[BL],D_D[MT],5,D_D[CAT],SMS, D_D[EP],-1,D_D[LOC],$A31),0))","v":""},"",{"$f":"IF(ISNA($A31),\"\",IFERROR(SUMIFS(D_D[ADP],D_D[MT],5,D_D[CAT],SMS, D_D[EP],-1,D_D[LOC],$A31),0))","v":""},{"$f":"IF(ISNA($A31),\"\",IFERROR(SUMIFS(D_D[PROD_MTD],D_D[MT],5,D_D[CAT],SMS, D_D[EP],-1,D_D[LOC],$A31),0))","v":""},{"$f":"IF(ISNA($A31),\"\",IFERROR(SUMIFS(D_D[ADCM],D_D[MT],5,D_D[CAT],SMS, D_D[EP],-1,D_D[LOC],$A31),0))","v":""},{"$f":"IF(ISNA($A31),\"\",IFERROR(SUMIFS(D_D[PROD_FYTD],D_D[MT],5,D_D[CAT],SMS, D_D[EP],-1,D_D[LOC],$A31),0))","v":""},{"$f":"IF(ISNA($A31),\"\",IFERROR(SUMIFS(D_D[ADCF],D_D[MT],5,D_D[CAT],SMS, D_D[EP],-1,D_D[LOC],$A31),0))","v":""},{"$f":"IF(ISNA($A31),\"\",IFERROR(SUMIFS(D_D[INV],D_D[MT],8,D_D[CAT],SMS,D_D[LOC],$A31),0))","v":""},{"$f":"IF(ISNA($A31),\"\",IFERROR(SUMIFS(D_D[BL],D_D[MT],8,D_D[CAT],SMS,D_D[LOC],$A31),0))","v":""},{"$f":"IF(ISNA($A31),\"\",IFERROR(SUMIFS(D_D[ADP],D_D[MT],8,D_D[CAT],SMS,D_D[LOC],$A31),0))","v":""},{"$f":"IF(ISNA($A31),\"\",IFERROR(SUMIFS(D_D[PROD_MTD],D_D[MT],8,D_D[CAT],SMS,D_D[LOC],$A31),0))","v":""},{"$f":"IF(ISNA($A31),\"\",IFERROR(SUMIFS(D_D[PROD_FYTD],D_D[MT],8,D_D[CAT],SMS,D_D[LOC],$A31),0))","v":""},{"$f":"IF(ISNA($A31),\"\",IFERROR(SUMIFS(D_D[ADCM],D_D[MT],8,D_D[CAT],SMS,D_D[LOC],$A31),0))","v":""}]
[{"$error":"#N/A"},20,"",{"$f":"IF(ISNA($A32),\"\",IFERROR(SUMIFS(D_D[INV],D_D[MT],5,D_D[CAT],SMS, D_D[EP],-1,D_D[LOC],$A32),0))","v":""},{"$f":"IF(ISNA($A32),\"\",IFERROR(SUMIFS(D_D[BL],D_D[MT],5,D_D[CAT],SMS, D_D[EP],-1,D_D[LOC],$A32),0))","v":""},"",{"$f":"IF(ISNA($A32),\"\",IFERROR(SUMIFS(D_D[ADP],D_D[MT],5,D_D[CAT],SMS, D_D[EP],-1,D_D[LOC],$A32),0))","v":""},{"$f":"IF(ISNA($A32),\"\",IFERROR(SUMIFS(D_D[PROD_MTD],D_D[MT],5,D_D[CAT],SMS, D_D[EP],-1,D_D[LOC],$A32),0))","v":""},{"$f":"IF(ISNA($A32),\"\",IFERROR(SUMIFS(D_D[ADCM],D_D[MT],5,D_D[CAT],SMS, D_D[EP],-1,D_D[LOC],$A32),0))","v":""},{"$f":"IF(ISNA($A32),\"\",IFERROR(SUMIFS(D_D[PROD_FYTD],D_D[MT],5,D_D[CAT],SMS, D_D[EP],-1,D_D[LOC],$A32),0))","v":""},{"$f":"IF(ISNA($A32),\"\",IFERROR(SUMIFS(D_D[ADCF],D_D[MT],5,D_D[CAT],SMS, D_D[EP],-1,D_D[LOC],$A32),0))","v":""},{"$f":"IF(ISNA($A32),\"\",IFERROR(SUMIFS(D_D[INV],D_D[MT],8,D_D[CAT],SMS,D_D[LOC],$A32),0))","v":""},{"$f":"IF(ISNA($A32),\"\",IFERROR(SUMIFS(D_D[BL],D_D[MT],8,D_D[CAT],SMS,D_D[LOC],$A32),0))","v":""},{"$f":"IF(ISNA($A32),\"\",IFERROR(SUMIFS(D_D[ADP],D_D[MT],8,D_D[CAT],SMS,D_D[LOC],$A32),0))","v":""},{"$f":"IF(ISNA($A32),\"\",IFERROR(SUMIFS(D_D[PROD_MTD],D_D[MT],8,D_D[CAT],SMS,D_D[LOC],$A32),0))","v":""},{"$f":"IF(ISNA($A32),\"\",IFERROR(SUMIFS(D_D[PROD_FYTD],D_D[MT],8,D_D[CAT],SMS,D_D[LOC],$A32),0))","v":""},{"$f":"IF(ISNA($A32),\"\",IFERROR(SUMIFS(D_D[ADCM],D_D[MT],8,D_D[CAT],SMS,D_D[LOC],$A32),0))","v":""}]
[{"$error":"#N/A"},21,"",{"$f":"IF(ISNA($A33),\"\",IFERROR(SUMIFS(D_D[INV],D_D[MT],5,D_D[CAT],SMS, D_D[EP],-1,D_D[LOC],$A33),0))","v":""},{"$f":"IF(ISNA($A33),\"\",IFERROR(SUMIFS(D_D[BL],D_D[MT],5,D_D[CAT],SMS, D_D[EP],-1,D_D[LOC],$A33),0))","v":""},"",{"$f":"IF(ISNA($A33),\"\",IFERROR(SUMIFS(D_D[ADP],D_D[MT],5,D_D[CAT],SMS, D_D[EP],-1,D_D[LOC],$A33),0))","v":""},{"$f":"IF(ISNA($A33),\"\",IFERROR(SUMIFS(D_D[PROD_MTD],D_D[MT],5,D_D[CAT],SMS, D_D[EP],-1,D_D[LOC],$A33),0))","v":""},{"$f":"IF(ISNA($A33),\"\",IFERROR(SUMIFS(D_D[ADCM],D_D[MT],5,D_D[CAT],SMS, D_D[EP],-1,D_D[LOC],$A33),0))","v":""},{"$f":"IF(ISNA($A33),\"\",IFERROR(SUMIFS(D_D[PROD_FYTD],D_D[MT],5,D_D[CAT],SMS, D_D[EP],-1,D_D[LOC],$A33),0))","v":""},{"$f":"IF(ISNA($A33),\"\",IFERROR(SUMIFS(D_D[ADCF],D_D[MT],5,D_D[CAT],SMS, D_D[EP],-1,D_D[LOC],$A33),0))","v":""},{"$f":"IF(ISNA($A33),\"\",IFERROR(SUMIFS(D_D[INV],D_D[MT],8,D_D[CAT],SMS,D_D[LOC],$A33),0))","v":""},{"$f":"IF(ISNA($A33),\"\",IFERROR(SUMIFS(D_D[BL],D_D[MT],8,D_D[CAT],SMS,D_D[LOC],$A33),0))","v":""},{"$f":"IF(ISNA($A33),\"\",IFERROR(SUMIFS(D_D[ADP],D_D[MT],8,D_D[CAT],SMS,D_D[LOC],$A33),0))","v":""},{"$f":"IF(ISNA($A33),\"\",IFERROR(SUMIFS(D_D[PROD_MTD],D_D[MT],8,D_D[CAT],SMS,D_D[LOC],$A33),0))","v":""},{"$f":"IF(ISNA($A33),\"\",IFERROR(SUMIFS(D_D[PROD_FYTD],D_D[MT],8,D_D[CAT],SMS,D_D[LOC],$A33),0))","v":""},{"$f":"IF(ISNA($A33),\"\",IFERROR(SUMIFS(D_D[ADCM],D_D[MT],8,D_D[CAT],SMS,D_D[LOC],$A33),0))","v":""}]
[{"$error":"#N/A"},22,"",{"$f":"IF(ISNA($A34),\"\",IFERROR(SUMIFS(D_D[INV],D_D[MT],5,D_D[CAT],SMS, D_D[EP],-1,D_D[LOC],$A34),0))","v":""},{"$f":"IF(ISNA($A34),\"\",IFERROR(SUMIFS(D_D[BL],D_D[MT],5,D_D[CAT],SMS, D_D[EP],-1,D_D[LOC],$A34),0))","v":""},"",{"$f":"IF(ISNA($A34),\"\",IFERROR(SUMIFS(D_D[ADP],D_D[MT],5,D_D[CAT],SMS, D_D[EP],-1,D_D[LOC],$A34),0))","v":""},{"$f":"IF(ISNA($A34),\"\",IFERROR(SUMIFS(D_D[PROD_MTD],D_D[MT],5,D_D[CAT],SMS, D_D[EP],-1,D_D[LOC],$A34),0))","v":""},{"$f":"IF(ISNA($A34),\"\",IFERROR(SUMIFS(D_D[ADCM],D_D[MT],5,D_D[CAT],SMS, D_D[EP],-1,D_D[LOC],$A34),0))","v":""},{"$f":"IF(ISNA($A34),\"\",IFERROR(SUMIFS(D_D[PROD_FYTD],D_D[MT],5,D_D[CAT],SMS, D_D[EP],-1,D_D[LOC],$A34),0))","v":""},{"$f":"IF(ISNA($A34),\"\",IFERROR(SUMIFS(D_D[ADCF],D_D[MT],5,D_D[CAT],SMS, D_D[EP],-1,D_D[LOC],$A34),0))","v":""},{"$f":"IF(ISNA($A34),\"\",IFERROR(SUMIFS(D_D[INV],D_D[MT],8,D_D[CAT],SMS,D_D[LOC],$A34),0))","v":""},{"$f":"IF(ISNA($A34),\"\",IFERROR(SUMIFS(D_D[BL],D_D[MT],8,D_D[CAT],SMS,D_D[LOC],$A34),0))","v":""},{"$f":"IF(ISNA($A34),\"\",IFERROR(SUMIFS(D_D[ADP],D_D[MT],8,D_D[CAT],SMS,D_D[LOC],$A34),0))","v":""},{"$f":"IF(ISNA($A34),\"\",IFERROR(SUMIFS(D_D[PROD_MTD],D_D[MT],8,D_D[CAT],SMS,D_D[LOC],$A34),0))","v":""},{"$f":"IF(ISNA($A34),\"\",IFERROR(SUMIFS(D_D[PROD_FYTD],D_D[MT],8,D_D[CAT],SMS,D_D[LOC],$A34),0))","v":""},{"$f":"IF(ISNA($A34),\"\",IFERROR(SUMIFS(D_D[ADCM],D_D[MT],8,D_D[CAT],SMS,D_D[LOC],$A34),0))","v":""}]
[{"$error":"#N/A"},23,"",{"$f":"IF(ISNA($A35),\"\",IFERROR(SUMIFS(D_D[INV],D_D[MT],5,D_D[CAT],SMS, D_D[EP],-1,D_D[LOC],$A35),0))","v":""},{"$f":"IF(ISNA($A35),\"\",IFERROR(SUMIFS(D_D[BL],D_D[MT],5,D_D[CAT],SMS, D_D[EP],-1,D_D[LOC],$A35),0))","v":""},"",{"$f":"IF(ISNA($A35),\"\",IFERROR(SUMIFS(D_D[ADP],D_D[MT],5,D_D[CAT],SMS, D_D[EP],-1,D_D[LOC],$A35),0))","v":""},{"$f":"IF(ISNA($A35),\"\",IFERROR(SUMIFS(D_D[PROD_MTD],D_D[MT],5,D_D[CAT],SMS, D_D[EP],-1,D_D[LOC],$A35),0))","v":""},{"$f":"IF(ISNA($A35),\"\",IFERROR(SUMIFS(D_D[ADCM],D_D[MT],5,D_D[CAT],SMS, D_D[EP],-1,D_D[LOC],$A35),0))","v":""},{"$f":"IF(ISNA($A35),\"\",IFERROR(SUMIFS(D_D[PROD_FYTD],D_D[MT],5,D_D[CAT],SMS, D_D[EP],-1,D_D[LOC],$A35),0))","v":""},{"$f":"IF(ISNA($A35),\"\",IFERROR(SUMIFS(D_D[ADCF],D_D[MT],5,D_D[CAT],SMS, D_D[EP],-1,D_D[LOC],$A35),0))","v":""},{"$f":"IF(ISNA($A35),\"\",IFERROR(SUMIFS(D_D[INV],D_D[MT],8,D_D[CAT],SMS,D_D[LOC],$A35),0))","v":""},{"$f":"IF(ISNA($A35),\"\",IFERROR(SUMIFS(D_D[BL],D_D[MT],8,D_D[CAT],SMS,D_D[LOC],$A35),0))","v":""},{"$f":"IF(ISNA($A35),\"\",IFERROR(SUMIFS(D_D[ADP],D_D[MT],8,D_D[CAT],SMS,D_D[LOC],$A35),0))","v":""},{"$f":"IF(ISNA($A35),\"\",IFERROR(SUMIFS(D_D[PROD_MTD],D_D[MT],8,D_D[CAT],SMS,D_D[LOC],$A35),0))","v":""},{"$f":"IF(ISNA($A35),\"\",IFERROR(SUMIFS(D_D[PROD_FYTD],D_D[MT],8,D_D[CAT],SMS,D_D[LOC],$A35),0))","v":""},{"$f":"IF(ISNA($A35),\"\",IFERROR(SUMIFS(D_D[ADCM],D_D[MT],8,D_D[CAT],SMS,D_D[LOC],$A35),0))","v":""}]

{"sheet":"Driver","index":5,"n_rows":226,"n_cols":27,"rows_kept":226,"cut":false,"hidden":true,"merged":[]}
["DIST_ID","DIST_DEF",null,null,null,"ROO","RO","ROI","ROD","RODS",null,"STO","ST","STI","STD","STDS",null,"ROO","RO","ROI","ROD"]
[1,"DIST_NE",null,null,null,1,0,100,"USA","1",null,1,0,100,"USA",100,null,1,0,100,"USA",null,null,null,null,null,"-Total"]
[2,"DIST_SE",null,null,null,2,1,394,"Northeast District","394",null,2,1,"394","Northeast District","394",null,2,1,"310","Philadelphia",null,null,"Northeast District",null," "]
[3,"DIST_CN",null,null,null,3,1,"313","Baltimore","394",null,3,1,"CT","Connecticut","394",null,3,1,"330","Milwaukee",null,null,"Connecticut","CT100",{"$f":"X4&$AA$2","v":"Connecticut-Total"},"-Other RO"]
[4,"DIST_PC",null,null,null,4,1,"301","Boston","394",null,4,1,"DE","Delaware","394",null,4,1,"335","St. Paul",null,null,null,"CT308","Hartford RO","-NWQ"]
[5,"DIST_OT",null,null,null,5,1,"307","Buffalo","394",null,5,1,"DC","District of Columbia","394",null,5,1,"-1","Other",null,null," ","CT-1",{"$f":"X4&$AA$4","v":"Connecticut-Other RO"}]
[null,null,null,null,null,6,1,"328","Chicago","394",null,6,1,"IL","Illinois","394",null,6,2,"318","Winston-Salem",null,null," ","CT499",{"$f":"X4&$AA$5","v":"Connecticut-NWQ"}]
[null,null,null,null,null,7,1,"325","Cleveland","394",null,7,1,"IN","Indiana","394",null,7,2,"341","Salt Lake City",null,null,"Delaware","DE100",{"$f":"X8&$AA$2","v":"Delaware-Total"}]
[null,"CONTROLLER for SOJ District Selection",null,null,null,8,1,"329","Detroit","394",null,8,1,"ME","Maine","394",null,8,2,"-1","Other",null,null,null,"DE460","Wilmington RO"]
[null,"ACTIVE SELECTION",null,4,null,9,1,"308","Hartford","394",null,9,1,"MD","Maryland","394",null,9,3,"318","Winston-Salem",null,null," ","DE-1",{"$f":"X8&$AA$4","v":"Delaware-Other RO"}]
[null,"MODIFIED SELECTION",{"$f":"IF(D20=12,\"DIST_P\",IF(D20=14,\"DIST_Q\",DS_RO_STG))","v":"DIST_PC"},null,null,10,1,"326","Indianapolis","394",null,10,1,"MA","Massachusetts","394",null,10,3,"377","San Diego",null,null," ","DE499",{"$f":"X8&$AA$5","v":"Delaware-NWQ"}]
[null,null,null,null,null,11,1,"373","Manchester","394",null,11,1,"MI","Michigan","394",null,11,3,"-1","Other",null,null,"DC","DC100",{"$f":"X12&$AA$2","v":"DC-Total"}]
[null,"DISTRICT-RO",{"$f":"INDEX(DIST_DEF,(MATCH($D$10,DIST_ID,0)))","v":"DIST_PC"},null,null,12,1,"330","Milwaukee","394",null,12,1,"MO","Missouri","394",null,null,null,null,null,null,null," ","DC372","Washington DC RO"]
[null,"DISTRICT-STATE",{"$f":"INDEX(DIST_DEF,(MATCH($D$10,DIST_ID,0)))&\"_ST\"","v":"DIST_PC_ST"},null,null,13,1,"306","New York","394",null,13,1,"NH","New Hampshire","394",null,null,null,null,null,null,null," ","DC-1",{"$f":"X12&$AA$4","v":"DC-Other RO"}]
[null,"DISTRICT-NWQ",{"$f":"INDEX(DIST_DEF,(MATCH($D$10,DIST_ID,0)))&\"_NWQ\"","v":"DIST_PC_NWQ"},{"$f":"INDEX(DIST_DEF,(MATCH($D$10,DIST_ID,0)))&\"_NWQD\"","v":"DIST_PC_NWQD"},null,14,1,"309","Newark","394",null,14,1,"NJ","New Jersey","394",null,null,null,"ROI","ROD",null,null," ","DC499",{"$f":"X12&$AA$5","v":"DC-NWQ"}]
[null,null,{"$f":"INDEX(DIST_DEF,(MATCH($D$10,DIST_ID,0)))&\"_NWQI\"","v":"DIST_PC_NWQI"},null,null,15,1,"310","Philadelphia","394",null,15,1,"NY","New York","394",null,null,null,100,"USA",null,null,"Illinois","IL100",{"$f":"X16&$AA$2","v":"Illinois-Total"}]
[null,null,null,null,null,16,1,"311","Pittsburgh","394",null,16,1,"OH","Ohio","394",null,null,null,"310","Philadelphia",null,null,null,"IL328","Chicago RO"]
[null,"CONTROLLER for Mission Selection",null,null,null,17,1,"304","Providence","394",null,17,1,"PA","Pennsylvania","394",null,null,null,"330","Milwaukee",null,null," ","IL-1",{"$f":"X16&$AA$4","v":"Illinois-Other RO"}]
[null,"ACTIVE SELECTION",null,1,null,18,1,"376","St. Louis RMC","394",null,18,1,"RI","Rhode Island","394",null,null,null,"335","St. Paul",null,null," ","IL499",{"$f":"X16&$AA$5","v":"Illinois-NWQ"}]
[null,"MODIFIED SELECTION",{"$f":"INDEX(SMD,(MATCH($D$19,DIST_ID,0)))","v":"USA - All Missions"},{"$f":"IF(SMSA=1,0,SMSA+9)","v":0},null,19,1,"331","St. Louis","394",null,19,1,"VT","Vermont","394",null,null,null,499,"NWQ",null,null,"Indiana","IN100",{"$f":"X20&$AA$2","v":"Indiana-Total"}]
[null,"USA - All Missions",null,1,null,20,1,"402","Togus","394",null,20,1,"WI","Wisconsin","394",null,null,null,"-1","Other",null,null,null,"IN326","Indianapolis RO"]
[null,"Compensation",null,11,null,21,1,"372","Washington","394",null,21,2,"393","Southeast District","393",null,null,null,"318","Winston-Salem",null,null," ","IN-1",{"$f":"X20&$AA$4","v":"Indiana-Other RO"}]
[null,"Pension",null,12,null,22,1,"405","White River Junction","394",null,22,2,"AL","Alabama","393",null,null,null,"341","Salt Lake City",null,null," ","IN499",{"$f":"X20&$AA$5","v":"Indiana-NWQ"}]
[null,"BDD",null,13,null,23,1,"460","Wilmington","394",null,23,2,"AR","Arkansas","393",null,null,null,499,"NWQ",null,null,"Maine","ME100",{"$f":"X24&$AA$2","v":"Maine-Total"}]
[null,"Quickstart",null,14,null,24,2,"393","Southeast District","393",null,24,2,"FL","Florida","393",null,null,null,"-1","Other",null,null,null,"ME402","Togus RO"]
[null,null,null,null,null,25,2,"316","Atlanta","393",null,25,2,"GA","Georgia","393",null,null,null,"318","Winston-Salem",null,null,null,"ME-1",{"$f":"X24&$AA$4","v":"Maine-Other RO"}]
[null,"TRADITIONAL AGGREGATE CODES",null,null,null,26,2,"319","Columbia","393",null,26,2,"KY","Kentucky","393",null,null,null,"377","San Diego",null,null,null,"ME499",{"$f":"X24&$AA$5","v":"Maine-NWQ"}]
[null,"ALL",1000,null,null,27,2,315,"Huntington","393",null,27,2,"LA","Louisiana","393",null,null,null,499,"NWQ",null,null,"Maryland","MD100",{"$f":"X28&$AA$2","v":"Maryland-Total"}]
[null,"Non-Rating/Appeals Compensation",2000,null,null,28,2,"323","Jackson","393",null,28,2,"MS","Mississippi","393",null,null,null,"-1","Other",null,null,null,"MD313","Baltimore RO"]
[null,"Non-Rating/Appeals Pension",3000,null,null,29,2,"350","Little Rock","393",null,29,2,"NC","North Carolina","393",null,null,null,null,null,null,null,null,"MD-1",{"$f":"X28&$AA$4","v":"Maryland-Other RO"}]
[null,"Compensation Entitlement",2100,null,null,30,2,"327","Louisville","393",null,30,2,"PR","Puerto Rico","393",null,null,null,null,null,null,null,null,"MD499",{"$f":"X28&$AA$5","v":"Maryland-NWQ"}]
[null,"Compensation Award Adjustment",2200,null,null,31,2,"322","Montgomery","393",null,31,2,"SC","South Carolina","393",null,null,null,null,null,null,null,"Massachusetts","MA100",{"$f":"X32&$AA$2","v":"Massachusetts-Total"}]
[null,"Compensation Program Review",2300,null,null,32,2,"320","Nashville","393",null,32,2,"TN","Tennessee","393",null,null,null,null,null,null,null,null,"MA301","Boston RO"]
[null,"Compensation Other",2400,null,null,33,2,"321","New Orleans","393",null,33,2,"VA","Virginia","393",null,null,null,null,null,null,null,null,"MA-1",{"$f":"X32&$AA$4","v":"Massachusetts-Other RO"}]
[null,"Compensation Burial",2500,null,null,34,2,"314","Roanoke","393",null,34,2,"WV","West Virginia","393",null,null,null,null,null,null,null,null,"MA499",{"$f":"X32&$AA$5","v":"Massachusetts-NWQ"}]
[null,"Compensation Accrued",2600,null,null,35,2,"355","San Juan","393",null,35,3,"384","Continental District","384",null,null,null,null,null,null,null,"Michigan","MI100",{"$f":"X36&$AA$2","v":"Michigan-Total"}]
[null,"Pension Entitlement",3100,null,null,36,2,"317","St. Petersburg","393",null,36,3,"CO","Colorado","384",null,null,null,null,null,null,null,null,"MI329","Detroit RO"]
[null,"Pension Award Adjustment",3200,null,null,37,2,"318","Winston-Salem","393",null,37,3,"IA","Iowa","384",null,null,null,null,null,null,null,null,"MI-1",{"$f":"X36&$AA$4","v":"Michigan-Other RO"}]
[null,"Pension Program Review",3300,null,null,38,3,"384","Continental District","384",null,38,3,"KS","Kansas","384",null,null,null,null,null,null,null,null,"MI499",{"$f":"X36&$AA$5","v":"Michigan-NWQ"}]
[null,"Pension Other",3400,null,null,39,3,"442","Cheyenne ","384",null,39,3,"MN","Minnesota","384",null,null,null,null,null,null,null,"Missouri","MO100",{"$f":"X40&$AA$2","v":"Missouri-Total"}]
[null,"Pension Burial",3500,null,null,40,3,"339","Denver","384",null,40,3,"MT","Montana","384",null,null,null,null,null,null,null,null,"MO331","St. Louis RO"]
[null,"Pension Accrued",3600,null,null,41,3,"333","Des Moines","384",null,41,3,"NE","Nebraska","384",null,null,null,null,null,null,null,null,"MO-1",{"$f":"X40&$AA$4","v":"Missouri-Other RO"}]
[null,null,null,null,null,42,3,"437","Fargo","384",null,42,3,"ND","North Dakota","384",null,null,null,null,null,null,null,null,"MO499",{"$f":"X40&$AA$5","v":"Missouri-NWQ"}]
[null,"CONTROLLER for SOJ District Selection",null,null,null,43,3,"436","Fort Harrison ","384",null,43,3,"OK","Oklahoma","384",null,null,null,null,null,null,null,"New Hampshire","NH100",{"$f":"X44&$AA$2","v":"New Hampshire-Total"}]
[null,"ACTIVE SELECTION",null,6,null,44,3,"362","Houston","384",null,44,3,"SD","South Dakota","384",null,null,null,null,null,null,null,null,"NH373","Manchester RO"]
[null,"MODIFIED SELECTION",{"$f":"IF(D10=6,DS_RO&\"_N\",IF(D20=13,DS_RO,IF(D20>11,DS_RO&\"_N\",DS_RO)))","v":"DIST_PC"},null,null,45,3,"334","Lincoln","384",null,45,3,"TX","Texas","384",null,null,null,null,null,null,null,null,"NH-1",{"$f":"X44&$AA$4","v":"New Hampshire-Other RO"}]
[null,null,null,null,null,46,3,"351","Muskogee","384",null,46,3,"WY","Wyoming","384",null,null,null,null,null,null,null,null,"NH499",{"$f":"X44&$AA$5","v":"New Hampshire-NWQ"}]
[null,null,null,null,null,47,3,"438","Sioux Falls","384",null,47,4,"395","Pacific District","395",null,null,null,null,null,null,null,"New Jersey","NJ100",{"$f":"X48&$AA$2","v":"New Jersey-Total"}]
[null,null,null,null,null,48,3,"335","St. Paul","384",null,48,4,"AK","Alaska","395",null,null,null,null,null,null,null,null,"NJ309","Newark RO"]
[null,null,null,null,null,49,3,"349","Waco","384",null,49,4,"AZ","Arizona","395",null,null,null,null,null,null,null,null,"NJ-1",{"$f":"X48&$AA$4","v":"New Jersey-Other RO"}]
[null,null,null,null,null,50,3,"452","Wichita","384",null,50,4,"CA","California","395",null,null,null,null,null,null,null,null,"NJ499",{"$f":"X48&$AA$5","v":"New Jersey-NWQ"}]
[null,null,null,null,null,51,4,"395","Pacific District","395",null,51,4,"HI","Hawaii","395",null,null,null,null,null,null,null,"New York","NY100",{"$f":"X52&$AA$2","v":"New York-Total"}]
[null,null,null,null,null,52,4,"340","Albuquerque","395",null,52,4,"ID","Idaho","395",null,null,null,null,null,null,null,null,"NY307","Buffalo RO"]
[null,null,null,null,null,53,4,"463","Anchorage","395",null,53,4,"NV","Nevada","395",null,null,null,null,null,null,null,null,"NY306","New York RO"]
[null,null,null,null,null,54,4,"347","Boise","395",null,54,4,"NM","New Mexico","395",null,null,null,null,null,null,null,null,"NY-1",{"$f":"X52&$AA$4","v":"New York-Other RO"}]
[null,null,null,null,null,55,4,"459","Honolulu","395",null,55,4,"OR","Oregon","395",null,null,null,null,null,null,null,null,"NY499",{"$f":"X52&$AA$5","v":"New York-NWQ"}]
[null,null,null,null,null,56,4,"344","Los Angeles","395",null,56,4,"PI","Philippines","395",null,null,null,null,null,null,null,"Ohio","OH100",{"$f":"X57&$AA$2","v":"Ohio-Total"}]
[null,null,null,null,null,57,4,"358","Manila","395",null,57,4,"UT","Utah","395",null,null,null,null,null,null,null,null,"OH325","Cleveland RO"]
[null,null,null,null,null,58,4,"343","Oakland","395",null,58,4,"WA","Washington","395",null,null,null,null,null,null,null,null,"OH-1",{"$f":"X57&$AA$4","v":"Ohio-Other RO"}]
[null,null,null,null,null,59,4,"345","Phoenix","395",null,59,5,"35","Other District","35",null,null,null,null,null,null,null,null,"OH499",{"$f":"X57&$AA$5","v":"Ohio-NWQ"}]
[null,null,null,null,null,60,4,"348","Portland","395",null,60,5,"35","Outside US","35",null,null,null,null,null,null,null,"Pennsylvania","PA100",{"$f":"X61&$AA$2","v":"Pennsylvania-Total"}]
[null,null,null,null,null,61,4,"354","Reno","395",null,null,null,null,null,null,null,null,null,null,null,null,null,null,"PA310","Philadelphia RO"]
[null,null,null,null,null,62,4,"341","Salt Lake City","395",null,null,null,null,null,null,null,null,null,null,null,null,null,null,"PA311","Pittsburgh RO"]
[null,null,null,null,null,63,4,"377","San Diego","395",null,null,null,null,null,null,null,null,null,null,null,null,null,null,"PA-1",{"$f":"X61&$AA$4","v":"Pennsylvania-Other RO"}]
[null,null,null,null,null,64,4,"346","Seattle","395",null,null,null,null,null,null,null,null,null,null,null,null,null,null,"PA499",{"$f":"X61&$AA$5","v":"Pennsylvania-NWQ"}]
[null,null,null,null,null,65,5,"35","Other District","35",null,null,null,null,null,null,null,null,null,null,null,null,null,"Rhode Island","RI100",{"$f":"X66&$AA$2","v":"Rhode Island-Total"}]
[null,null,null,null,null,66,5,"499","NWQ","35",null,null,null,null,null,null,null,null,null,null,null,null,null,null,"RI304","Providence RO"]
[null,null,null,null,null,67,5,"-1","Other","35",null,null,null,null,null,null,null,null,null,null,null,null,null,null,"RI-1",{"$f":"X66&$AA$4","v":"Rhode Island-Other RO"}]
[null,null,null,null,null,null,null,null,null,null,null,null,null,null,null,null,null,null,null,null,null,null,null,null,"RI499",{"$f":"X66&$AA$5","v":"Rhode Island-NWQ"}]
[null,null,null,null,null,null,null,null,null,null,null,null,null,null,null,null,null,null,null,null,null,null,null,"Vermont","VT100",{"$f":"X70&$AA$2","v":"Vermont-Total"}]
[null,null,null,null,null,null,null,null,null,null,null,null,null,null,null,null,null,null,null,null,null,null,null,null,"VT405","White River RO"]
[null,null,null,null,null,null,null,null,null,null,null,null,null,null,null,null,null,null,null,null,null,null,null,null,"VT-1",{"$f":"X70&$AA$4","v":"Vermont-Other RO"}]
[null,null,null,null,null,null,null,null,null,null,null,null,null,null,null,null,null,null,null,null,null,null,null,null,"VT499",{"$f":"X70&$AA$5","v":"Vermont-NWQ"}]
[null,null,null,null,null,null,null,null,null,null,null,null,null,null,null,null,null,null,null,null,null,null,null,"Wisconsin","WI100",{"$f":"X74&$AA$2","v":"Wisconsin-Total"}]
[null,null,null,null,null,null,null,null,null,null,null,null,null,null,null,null,null,null,null,null,null,null,null,null,"WI330","Milwaukee RO"]
[null,null,null,null,null,null,null,null,null,null,null,null,null,null,null,null,null,null,null,null,null,null,null,null,"WI-1",{"$f":"X74&$AA$4","v":"Wisconsin-Other RO"}]
[null,null,null,null,null,null,null,null,null,null,null,null,null,null,null,null,null,null,null,null,null,null,null,null,"WI499",{"$f":"X74&$AA$5","v":"Wisconsin-NWQ"}]
[null,null,null,null,null,null,null,null,null,null,null,null,null,null,null,null,null,null,null,null,null,null,null,"Southeast District",null," "]
[null,null,null,null,null,null,null,null,null,null,null,null,null,null,null,null,null,null,null,null,null,null,null,"Alabama","AL100",{"$f":"X79&$AA$2","v":"Alabama-Total"}]
[null,null,null,null,null,null,null,null,null,null,null,null,null,null,null,null,null,null,null,null,null,null,null,null,"AL322","Montgomery RO"]
[null,null,null,null,null,null,null,null,null,null,null,null,null,null,null,null,null,null,null,null,null,null,null," ","AL-1",{"$f":"X79&$AA$4","v":"Alabama-Other RO"}]
[null,null,null,null,null,null,null,null,null,null,null,null,null,null,null,null,null,null,null,null,null,null,null," ","AL499",{"$f":"X79&$AA$5","v":"Alabama-NWQ"}]
[null,null,null,null,null,null,null,null,null,null,null,null,null,null,null,null,null,null,null,null,null,null,null,"Arkansas","AR100",{"$f":"X83&$AA$2","v":"Arkansas-Total"}]
[null,null,null,null,null,null,null,null,null,null,null,null,null,null,null,null,null,null,null,null,null,null,null,null,"AR350","Little Rock RO"]
[null,null,null,null,null,null,null,null,null,null,null,null,null,null,null,null,null,null,null,null,null,null,null," ","AR-1",{"$f":"X83&$AA$4","v":"Arkansas-Other RO"}]
[null,null,null,null,null,null,null,null,null,null,null,null,null,null,null,null,null,null,null,null,null,null,null," ","AR499",{"$f":"X83&$AA$5","v":"Arkansas-NWQ"}]
[null,null,null,null,null,null,null,null,null,null,null,null,null,null,null,null,null,null,null,null,null,null,null,"Florida","FL100",{"$f":"X87&$AA$2","v":"Florida-Total"}]
[null,null,null,null,null,null,null,null,null,null,null,null,null,null,null,null,null,null,null,null,null,null,null,null,"FL317","St. Petersburg RO"]
[null,null,null,null,null,null,null,null,null,null,null,null,null,null,null,null,null,null,null,null,null,null,null," ","FL-1",{"$f":"X87&$AA$4","v":"Florida-Other RO"}]
[null,null,null,null,null,null,null,null,null,null,null,null,null,null,null,null,null,null,null,null,null,null,null," ","FL499",{"$f":"X87&$AA$5","v":"Florida-NWQ"}]
[null,null,null,null,null,null,null,null,null,null,null,null,null,null,null,null,null,null,null,null,null,null,null,"Georgia","GA100",{"$f":"X91&$AA$2","v":"Georgia-Total"}]
[null,null,null,null,null,null,null,null,null,null,null,null,null,null,null,null,null,null,null,null,null,null,null," ","GA316","Atlanta RO"]
[null,null,null,null,null,null,null,null,null,null,null,null,null,null,null,null,null,null,null,null,null,null,null," ","GA-1",{"$f":"X91&$AA$4","v":"Georgia-Other RO"}]
[null,null,null,null,null,null,null,null,null,null,null,null,null,null,null,null,null,null,null,null,null,null,null," ","GA499",{"$f":"X91&$AA$5","v":"Georgia-NWQ"}]
[null,null,null,null,null,null,null,null,null,null,null,null,null,null,null,null,null,null,null,null,null,null,null,"Kentucky","KY100",{"$f":"X95&$AA$2","v":"Kentucky-Total"}]
[null,null,null,null,null,null,null,null,null,null,null,null,null,null,null,null,null,null,null,null,null,null,null,null,"KY327","Louisville RO"]
[null,null,null,null,null,null,null,null,null,null,null,null,null,null,null,null,null,null,null,null,null,null,null,null,"KY-1",{"$f":"X95&$AA$4","v":"Kentucky-Other RO"}]
[null,null,null,null,null,null,null,null,null,null,null,null,null,null,null,null,null,null,null,null,null,null,null,null,"KY499",{"$f":"X95&$AA$5","v":"Kentucky-NWQ"}]
[null,null,null,null,null,null,null,null,null,null,null,null,null,null,null,null,null,null,null,null,null,null,null,"Louisiana","LA100",{"$f":"X99&$AA$2","v":"Louisiana-Total"}]
[null,null,null,null,null,null,null,null,null,null,null,null,null,null,null,null,null,null,null,null,null,null,null," ","LA321","New Orleans RO"]
[null,null,null,null,null,null,null,null,null,null,null,null,null,null,null,null,null,null,null,null,null,null,null," ","LA-1",{"$f":"X99&$AA$4","v":"Louisiana-Other RO"}]
[null,null,null,null,null,null,null,null,null,null,null,null,null,null,null,null,null,null,null,null,null,null,null," ","LA499",{"$f":"X99&$AA$5","v":"Louisiana-NWQ"}]
[null,null,null,null,null,null,null,null,null,null,null,null,null,null,null,null,null,null,null,null,null,null,null,"Mississippi","MS100",{"$f":"X103&$AA$2","v":"Mississippi-Total"}]
[null,null,null,null,null,null,null,null,null,null,null,null,null,null,null,null,null,null,null,null,null,null,null,null,"MS323","Jackson RO"]
[null,null,null,null,null,null,null,null,null,null,null,null,null,null,null,null,null,null,null,null,null,null,null,null,"MS-1",{"$f":"X103&$AA$4","v":"Mississippi-Other RO"}]
[null,null,null,null,null,null,null,null,null,null,null,null,null,null,null,null,null,null,null,null,null,null,null,null,"MS499",{"$f":"X103&$AA$5","v":"Mississippi-NWQ"}]
[null,null,null,null,null,null,null,null,null,null,null,null,null,null,null,null,null,null,null,null,null,null,null,"North Carolina","NC100",{"$f":"X107&$AA$2","v":"North Carolina-Total"}]
[null,null,null,null,null,null,null,null,null,null,null,null,null,null,null,null,null,null,null,null,null,null,null,null,"NC318","Winston-Salem RO"]
[null,null,null,null,null,null,null,null,null,null,null,null,null,null,null,null,null,null,null,null,null,null,null,null,"NC-1",{"$f":"X107&$AA$4","v":"North Carolina-Other RO"}]
[null,null,null,null,null,null,null,null,null,null,null,null,null,null,null,null,null,null,null,null,null,null,null,null,"NC499",{"$f":"X107&$AA$5","v":"North Carolina-NWQ"}]
[null,null,null,null,null,null,null,null,null,null,null,null,null,null,null,null,null,null,null,null,null,null,null,"Puerto Rico","PR100",{"$f":"X111&$AA$2","v":"Puerto Rico-Total"}]
[null,null,null,null,null,null,null,null,null,null,null,null,null,null,null,null,null,null,null,null,null,null,null,null,"PR355","San Juan RO"]
[null,null,null,null,null,null,null,null,null,null,null,null,null,null,null,null,null,null,null,null,null,null,null,null,"PR-1",{"$f":"X111&$AA$4","v":"Puerto Rico-Other RO"}]
[null,null,null,null,null,null,null,null,null,null,null,null,null,null,null,null,null,null,null,null,null,null,null,null,"PR499",{"$f":"X111&$AA$5","v":"Puerto Rico-NWQ"}]
[null,null,null,null,null,null,null,null,null,null,null,null,null,null,null,null,null,null,null,null,null,null,null,"South Carolina","SC100",{"$f":"X115&$AA$2","v":"South Carolina-Total"}]
[null,null,null,null,null,null,null,null,null,null,null,null,null,null,null,null,null,null,null,null,null,null,null,null,"SC319","Columbia RO"]
[null,null,null,null,null,null,null,null,null,null,null,null,null,null,null,null,null,null,null,null,null,null,null,null,"SC-1",{"$f":"X115&$AA$4","v":"South Carolina-Other RO"}]
[null,null,null,null,null,null,null,null,null,null,null,null,null,null,null,null,null,null,null,null,null,null,null,null,"SC499",{"$f":"X115&$AA$5","v":"South Carolina-NWQ"}]
[null,null,null,null,null,null,null,null,null,null,null,null,null,null,null,null,null,null,null,null,null,null,null,"Tennessee","TN100",{"$f":"X119&$AA$2","v":"Tennessee-Total"}]
[null,null,null,null,null,null,null,null,null,null,null,null,null,null,null,null,null,null,null,null,null,null,null,null,"TN320","Nashville RO"]
[null,null,null,null,null,null,null,null,null,null,null,null,null,null,null,null,null,null,null,null,null,null,null,null,"TN-1",{"$f":"X119&$AA$4","v":"Tennessee-Other RO"}]
[null,null,null,null,null,null,null,null,null,null,null,null,null,null,null,null,null,null,null,null,null,null,null,null,"TN499",{"$f":"X119&$AA$5","v":"Tennessee-NWQ"}]
[null,null,null,null,null,null,null,null,null,null,null,null,null,null,null,null,null,null,null,null,null,null,null,"Virginia","VA100",{"$f":"X123&$AA$2","v":"Virginia-Total"}]
[null,null,null,null,null,null,null,null,null,null,null,null,null,null,null,null,null,null,null,null,null,null,null,null,"VA314","Roanoke RO"]
[null,null,null,null,null,null,null,null,null,null,null,null,null,null,null,null,null,null,null,null,null,null,null,null,"VA-1",{"$f":"X123&$AA$4","v":"Virginia-Other RO"}]
[null,null,null,null,null,null,null,null,null,null,null,null,null,null,null,null,null,null,null,null,null,null,null,null,"VA499",{"$f":"X123&$AA$5","v":"Virginia-NWQ"}]
[null,null,null,null,null,null,null,null,null,null,null,null,null,null,null,null,null,null,null,null,null,null,null,"West Virginia","WV100",{"$f":"X127&$AA$2","v":"West Virginia-Total"}]
[null,null,null,null,null,null,null,null,null,null,null,null,null,null,null,null,null,null,null,null,null,null,null,null,"WV315","Huntington RO"]
[null,null,null,null,null,null,null,null,null,null,null,null,null,null,null,null,null,null,null,null,null,null,null,null,"WV-1",{"$f":"X127&$AA$4","v":"West Virginia-Other RO"}]
[null,null,null,null,null,null,null,null,null,null,null,null,null,null,null,null,null,null,null,null,null,null,null,null,"WV499",{"$f":"X127&$AA$5","v":"West Virginia-NWQ"}]
[null,null,null,null,null,null,null,null,null,null,null,null,null,null,null,null,null,null,null,null,null,null,null,"Continental District",null," "]
[null,null,null,null,null,null,null,null,null,null,null,null,null,null,null,null,null,null,null,null,null,null,null,"Colorado","CO100",{"$f":"X132&$AA$2","v":"Colorado-Total"}]
[null,null,null,null,null,null,null,null,null,null,null,null,null,null,null,null,null,null,null,null,null,null,null,null,"CO339","Denver RO"]
[null,null,null,null,null,null,null,null,null,null,null,null,null,null,null,null,null,null,null,null,null,null,null," ","CO-1",{"$f":"X132&$AA$4","v":"Colorado-Other RO"}]
[null,null,null,null,null,null,null,null,null,null,null,null,null,null,null,null,null,null,null,null,null,null,null," ","CO499",{"$f":"X132&$AA$5","v":"Colorado-NWQ"}]
[null,null,null,null,null,null,null,null,null,null,null,null,null,null,null,null,null,null,null,null,null,null,null,"Iowa","IA100",{"$f":"X136&$AA$2","v":"Iowa-Total"}]
[null,null,null,null,null,null,null,null,null,null,null,null,null,null,null,null,null,null,null,null,null,null,null," ","IA333","Des Moines RO"]
[null,null,null,null,null,null,null,null,null,null,null,null,null,null,null,null,null,null,null,null,null,null,null," ","IA-1",{"$f":"X136&$AA$4","v":"Iowa-Other RO"}]
[null,null,null,null,null,null,null,null,null,null,null,null,null,null,null,null,null,null,null,null,null,null,null," ","IA499",{"$f":"X136&$AA$5","v":"Iowa-NWQ"}]
[null,null,null,null,null,null,null,null,null,null,null,null,null,null,null,null,null,null,null,null,null,null,null,"Kansas","KS100",{"$f":"X140&$AA$2","v":"Kansas-Total"}]
[null,null,null,null,null,null,null,null,null,null,null,null,null,null,null,null,null,null,null,null,null,null,null,null,"KS452","Wichita RO"]
[null,null,null,null,null,null,null,null,null,null,null,null,null,null,null,null,null,null,null,null,null,null,null,null,"KS-1",{"$f":"X140&$AA$4","v":"Kansas-Other RO"}]
[null,null,null,null,null,null,null,null,null,null,null,null,null,null,null,null,null,null,null,null,null,null,null,null,"KS499",{"$f":"X140&$AA$5","v":"Kansas-NWQ"}]
[null,null,null,null,null,null,null,null,null,null,null,null,null,null,null,null,null,null,null,null,null,null,null,"Minnesota","MN100",{"$f":"X144&$AA$2","v":"Minnesota-Total"}]
[null,null,null,null,null,null,null,null,null,null,null,null,null,null,null,null,null,null,null,null,null,null,null,null,"MN335","St. Paul RO"]
[null,null,null,null,null,null,null,null,null,null,null,null,null,null,null,null,null,null,null,null,null,null,null,null,"MN-1",{"$f":"X144&$AA$4","v":"Minnesota-Other RO"}]
[null,null,null,null,null,null,null,null,null,null,null,null,null,null,null,null,null,null,null,null,null,null,null,null,"MN499",{"$f":"X144&$AA$5","v":"Minnesota-NWQ"}]
[null,null,null,null,null,null,null,null,null,null,null,null,null,null,null,null,null,null,null,null,null,null,null,"Montana","MT100",{"$f":"X148&$AA$2","v":"Montana-Total"}]
[null,null,null,null,null,null,null,null,null,null,null,null,null,null,null,null,null,null,null,null,null,null,null,null,"MT436","Fort Harrison RO"]
[null,null,null,null,null,null,null,null,null,null,null,null,null,null,null,null,null,null,null,null,null,null,null,null,"MT-1",{"$f":"X148&$AA$4","v":"Montana-Other RO"}]
[null,null,null,null,null,null,null,null,null,null,null,null,null,null,null,null,null,null,null,null,null,null,null,null,"MT499",{"$f":"X148&$AA$5","v":"Montana-NWQ"}]
[null,null,null,null,null,null,null,null,null,null,null,null,null,null,null,null,null,null,null,null,null,null,null,"Nebraska","NE100",{"$f":"X152&$AA$2","v":"Nebraska-Total"}]
[null,null,null,null,null,null,null,null,null,null,null,null,null,null,null,null,null,null,null,null,null,null,null,null,"NE334","Lincoln RO"]
[null,null,null,null,null,null,null,null,null,null,null,null,null,null,null,null,null,null,null,null,null,null,null,null,"NE-1",{"$f":"X152&$AA$4","v":"Nebraska-Other RO"}]
[null,null,null,null,null,null,null,null,null,null,null,null,null,null,null,null,null,null,null,null,null,null,null,null,"NE499",{"$f":"X152&$AA$5","v":"Nebraska-NWQ"}]
[null,null,null,null,null,null,null,null,null,null,null,null,null,null,null,null,null,null,null,null,null,null,null,"North Dakota","ND100",{"$f":"X156&$AA$2","v":"North Dakota-Total"}]
[null,null,null,null,null,null,null,null,null,null,null,null,null,null,null,null,null,null,null,null,null,null,null,null,"ND437","Fargo RO"]
[null,null,null,null,null,null,null,null,null,null,null,null,null,null,null,null,null,null,null,null,null,null,null,null,"ND-1",{"$f":"X156&$AA$4","v":"North Dakota-Other RO"}]
[null,null,null,null,null,null,null,null,null,null,null,null,null,null,null,null,null,null,null,null,null,null,null,null,"ND499",{"$f":"X156&$AA$5","v":"North Dakota-NWQ"}]
[null,null,null,null,null,null,null,null,null,null,null,null,null,null,null,null,null,null,null,null,null,null,null,"Oklahoma","OK100",{"$f":"X160&$AA$2","v":"Oklahoma-Total"}]
[null,null,null,null,null,null,null,null,null,null,null,null,null,null,null,null,null,null,null,null,null,null,null,null,"OK351","Muskogee RO"]
[null,null,null,null,null,null,null,null,null,null,null,null,null,null,null,null,null,null,null,null,null,null,null,null,"OK-1",{"$f":"X160&$AA$4","v":"Oklahoma-Other RO"}]
[null,null,null,null,null,null,null,null,null,null,null,null,null,null,null,null,null,null,null,null,null,null,null,null,"OK499",{"$f":"X160&$AA$5","v":"Oklahoma-NWQ"}]
[null,null,null,null,null,null,null,null,null,null,null,null,null,null,null,null,null,null,null,null,null,null,null,"South Dakota","SD100",{"$f":"X164&$AA$2","v":"South Dakota-Total"}]
[null,null,null,null,null,null,null,null,null,null,null,null,null,null,null,null,null,null,null,null,null,null,null,null,"SD438","Sioux Falls RO"]
[null,null,null,null,null,null,null,null,null,null,null,null,null,null,null,null,null,null,null,null,null,null,null,null,"SD-1",{"$f":"X164&$AA$4","v":"South Dakota-Other RO"}]
[null,null,null,null,null,null,null,null,null,null,null,null,null,null,null,null,null,null,null,null,null,null,null,null,"SD499",{"$f":"X164&$AA$5","v":"South Dakota-NWQ"}]
[null,null,null,null,null,null,null,null,null,null,null,null,null,null,null,null,null,null,null,null,null,null,null,"Texas","TX100",{"$f":"X168&$AA$2","v":"Texas-Total"}]
[null,null,null,null,null,null,null,null,null,null,null,null,null,null,null,null,null,null,null,null,null,null,null,null,"TX362","Houston RO"]
[null,null,null,null,null,null,null,null,null,null,null,null,null,null,null,null,null,null,null,null,null,null,null,null,"TX349","Waco RO"]
[null,null,null,null,null,null,null,null,null,null,null,null,null,null,null,null,null,null,null,null,null,null,null,null,"TX-1",{"$f":"X168&$AA$4","v":"Texas-Other RO"}]
[null,null,null,null,null,null,null,null,null,null,null,null,null,null,null,null,null,null,null,null,null,null,null,null,"TX499",{"$f":"X168&$AA$5","v":"Texas-NWQ"}]
[null,null,null,null,null,null,null,null,null,null,null,null,null,null,null,null,null,null,null,null,null,null,null,"Wyoming","WY100",{"$f":"X173&$AA$2","v":"Wyoming-Total"}]
[null,null,null,null,null,null,null,null,null,null,null,null,null,null,null,null,null,null,null,null,null,null,null,null,"WY442","Cheyenne RO"]
[null,null,null,null,null,null,null,null,null,null,null,null,null,null,null,null,null,null,null,null,null,null,null,null,"WY-1",{"$f":"X173&$AA$4","v":"Wyoming-Other RO"}]
[null,null,null,null,null,null,null,null,null,null,null,null,null,null,null,null,null,null,null,null,null,null,null,null,"WY499",{"$f":"X173&$AA$5","v":"Wyoming-NWQ"}]
[null,null,null,null,null,null,null,null,null,null,null,null,null,null,null,null,null,null,null,null,null,null,null,"Pacific District",null," "]
[null,null,null,null,null,null,null,null,null,null,null,null,null,null,null,null,null,null,null,null,null,null,null,"Alaska","AK100",{"$f":"X178&$AA$2","v":"Alaska-Total"}]
[null,null,null,null,null,null,null,null,null,null,null,null,null,null,null,null,null,null,null,null,null,null,null,null,"AK463","Anchorage RO"]
[null,null,null,null,null,null,null,null,null,null,null,null,null,null,null,null,null,null,null,null,null,null,null," ","AK-1",{"$f":"X178&$AA$4","v":"Alaska-Other RO"}]
[null,null,null,null,null,null,null,null,null,null,null,null,null,null,null,null,null,null,null,null,null,null,null," ","AK499",{"$f":"X178&$AA$5","v":"Alaska-NWQ"}]
[null,null,null,null,null,null,null,null,null,null,null,null,null,null,null,null,null,null,null,null,null,null,null,"Arizona","AZ100",{"$f":"X182&$AA$2","v":"Arizona-Total"}]
[null,null,null,null,null,null,null,null,null,null,null,null,null,null,null,null,null,null,null,null,null,null,null,null,"AZ345","Phoenix RO"]
[null,null,null,null,null,null,null,null,null,null,null,null,null,null,null,null,null,null,null,null,null,null,null," ","AZ-1",{"$f":"X182&$AA$4","v":"Arizona-Other RO"}]
[null,null,null,null,null,null,null,null,null,null,null,null,null,null,null,null,null,null,null,null,null,null,null," ","AZ499",{"$f":"X182&$AA$5","v":"Arizona-NWQ"}]
[null,null,null,null,null,null,null,null,null,null,null,null,null,null,null,null,null,null,null,null,null,null,null,"California","CA100",{"$f":"X186&$AA$2","v":"California-Total"}]
[null,null,null,null,null,null,null,null,null,null,null,null,null,null,null,null,null,null,null,null,null,null,null,null,"CA344","Los Angeles RO"]
[null,null,null,null,null,null,null,null,null,null,null,null,null,null,null,null,null,null,null,null,null,null,null,null,"CA343","Oakland RO"]
[null,null,null,null,null,null,null,null,null,null,null,null,null,null,null,null,null,null,null,null,null,null,null," ","CA377","San Diego RO"]
[null,null,null,null,null,null,null,null,null,null,null,null,null,null,null,null,null,null,null,null,null,null,null," ","CA-1",{"$f":"X186&$AA$4","v":"California-Other RO"}]
[null,null,null,null,null,null,null,null,null,null,null,null,null,null,null,null,null,null,null,null,null,null,null," ","CA499",{"$f":"X186&$AA$5","v":"California-NWQ"}]
[null,null,null,null,null,null,null,null,null,null,null,null,null,null,null,null,null,null,null,null,null,null,null,"Hawaii","HI100",{"$f":"X192&$AA$2","v":"Hawaii-Total"}]
[null,null,null,null,null,null,null,null,null,null,null,null,null,null,null,null,null,null,null,null,null,null,null,null,"HI459","Honolulu RO"]
[null,null,null,null,null,null,null,null,null,null,null,null,null,null,null,null,null,null,null,null,null,null,null,null,"HI-1",{"$f":"X192&$AA$4","v":"Hawaii-Other RO"}]
[null,null,null,null,null,null,null,null,null,null,null,null,null,null,null,null,null,null,null,null,null,null,null,null,"HI499",{"$f":"X192&$AA$5","v":"Hawaii-NWQ"}]
[null,null,null,null,null,null,null,null,null,null,null,null,null,null,null,null,null,null,null,null,null,null,null,"Idaho","ID100",{"$f":"X196&$AA$2","v":"Idaho-Total"}]
[null,null,null,null,null,null,null,null,null,null,null,null,null,null,null,null,null,null,null,null,null,null,null,null,"ID347","Boise RO"]
[null,null,null,null,null,null,null,null,null,null,null,null,null,null,null,null,null,null,null,null,null,null,null,null,"ID-1",{"$f":"X196&$AA$4","v":"Idaho-Other RO"}]
[null,null,null,null,null,null,null,null,null,null,null,null,null,null,null,null,null,null,null,null,null,null,null,null,"ID499",{"$f":"X196&$AA$5","v":"Idaho-NWQ"}]
[null,null,null,null,null,null,null,null,null,null,null,null,null,null,null,null,null,null,null,null,null,null,null,"Nevada","NV100",{"$f":"X200&$AA$2","v":"Nevada-Total"}]
[null,null,null,null,null,null,null,null,null,null,null,null,null,null,null,null,null,null,null,null,null,null,null,null,"NV354","Reno RO"]
[null,null,null,null,null,null,null,null,null,null,null,null,null,null,null,null,null,null,null,null,null,null,null,null,"NV-1",{"$f":"X200&$AA$4","v":"Nevada-Other RO"}]
[null,null,null,null,null,null,null,null,null,null,null,null,null,null,null,null,null,null,null,null,null,null,null,null,"NV499",{"$f":"X200&$AA$5","v":"Nevada-NWQ"}]
[null,null,null,null,null,null,null,null,null,null,null,null,null,null,null,null,null,null,null,null,null,null,null,"New Mexico","NM100",{"$f":"X204&$AA$2","v":"New Mexico-Total"}]
[null,null,null,null,null,null,null,null,null,null,null,null,null,null,null,null,null,null,null,null,null,null,null,null,"NM340","Albuquerque RO"]
[null,null,null,null,null,null,null,null,null,null,null,null,null,null,null,null,null,null,null,null,null,null,null,null,"NM-1",{"$f":"X204&$AA$4","v":"New Mexico-Other RO"}]
[null,null,null,null,null,null,null,null,null,null,null,null,null,null,null,null,null,null,null,null,null,null,null,null,"NM499",{"$f":"X204&$AA$5","v":"New Mexico-NWQ"}]
[null,null,null,null,null,null,null,null,null,null,null,null,null,null,null,null,null,null,null,null,null,null,null,"Oregon","OR100",{"$f":"X208&$AA$2","v":"Oregon-Total"}]
[null,null,null,null,null,null,null,null,null,null,null,null,null,null,null,null,null,null,null,null,null,null,null,null,"OR348","Portland RO"]
[null,null,null,null,null,null,null,null,null,null,null,null,null,null,null,null,null,null,null,null,null,null,null,null,"OR-1",{"$f":"X208&$AA$4","v":"Oregon-Other RO"}]
[null,null,null,null,null,null,null,null,null,null,null,null,null,null,null,null,null,null,null,null,null,null,null,null,"OR499",{"$f":"X208&$AA$5","v":"Oregon-NWQ"}]
[null,null,null,null,null,null,null,null,null,null,null,null,null,null,null,null,null,null,null,null,null,null,null,"Philippines","PI100",{"$f":"X212&$AA$2","v":"Philippines-Total"}]
[null,null,null,null,null,null,null,null,null,null,null,null,null,null,null,null,null,null,null,null,null,null,null,null,"PI358","Manila RO"]
[null,null,null,null,null,null,null,null,null,null,null,null,null,null,null,null,null,null,null,null,null,null,null,null,"PI-1",{"$f":"X212&$AA$4","v":"Philippines-Other RO"}]
[null,null,null,null,null,null,null,null,null,null,null,null,null,null,null,null,null,null,null,null,null,null,null,null,"PI499",{"$f":"X212&$AA$5","v":"Philippines-NWQ"}]
[null,null,null,null,null,null,null,null,null,null,null,null,null,null,null,null,null,null,null,null,null,null,null,"Utah","UT100",{"$f":"X216&$AA$2","v":"Utah-Total"}]
[null,null,null,null,null,null,null,null,null,null,null,null,null,null,null,null,null,null,null,null,null,null,null,null,"UT341","Salt Lake City RO"]
[null,null,null,null,null,null,null,null,null,null,null,null,null,null,null,null,null,null,null,null,null,null,null,null,"UT-1",{"$f":"X216&$AA$4","v":"Utah-Other RO"}]
[null,null,null,null,null,null,null,null,null,null,null,null,null,null,null,null,null,null,null,null,null,null,null,null,"UT499",{"$f":"X216&$AA$5","v":"Utah-NWQ"}]
[null,null,null,null,null,null,null,null,null,null,null,null,null,null,null,null,null,null,null,null,null,null,null,"Washington","WA100",{"$f":"X220&$AA$2","v":"Washington-Total"}]
[null,null,null,null,null,null,null,null,null,null,null,null,null,null,null,null,null,null,null,null,null,null,null,null,"WA346","Seattle RO"]
[null,null,null,null,null,null,null,null,null,null,null,null,null,null,null,null,null,null,null,null,null,null,null,null,"WA-1",{"$f":"X220&$AA$4","v":"Washington-Other RO"}]
[null,null,null,null,null,null,null,null,null,null,null,null,null,null,null,null,null,null,null,null,null,null,null,null,"WA499",{"$f":"X220&$AA$5","v":"Washington-NWQ"}]
[null,null,null,null,null,null,null,null,null,null,null,null,null,null,null,null,null,null,null,null,null,null,null,"Other District",null," "]
[null,null,null,null,null,null,null,null,null,null,null,null,null,null,null,null,null,null,null,null,null,null,null,"Outside US","OT-1",{"$f":"X225&$AA$4","v":"Outside US-Other RO"}]
[null,null,null,null,null,null,null,null,null,null,null,null,null,null,null,null,null,null,null,null,null,null,null," ","OT499",{"$f":"X225&$AA$5","v":"Outside US-NWQ"}]

{"sheet":"Rating Bundle - SOO","index":6,"n_rows":35,"n_cols":15,"rows_kept":35,"cut":false,"hidden":false,"merged":[[1,3,1,10],[1,11,1,16],[2,3,2,10],[2,11,2,16],[8,3,10,3],[8,4,10,4],[8,5,10,5],[8,6,10,6],[8,7,10,7],[8,8,10,8],[8,9,10,9],[8,10,10,10],[8,11,10,16],[7,3,7,10],[7,11,7,16],[6,11,6,16]]}
[]
[null,null,"DISTRICT SELECTOR","Compensation and Pension Rating Bundle Metrics",null,null,null,null,null,null,null,"Report through"]
[null,null,null,"Station of Origin View",null,null,null,null,null,null,null,{"$f":"D_DT[]","v":"2023-08-05"}]
[null,null,null,"The Station of Origination (SOO) primarily represents pending claims based on geographic boundaries",null,null,null,null,null,null,null,"ADP = Average Days Pending",null,null,"MTD = Month to Date"]
[null,null,null,"Each Special Mission has distinct claim counts",null,null,null,null,null,null,null,"ADC = Average Days to Complete",null,null,"FYTD = Fiscal Year to Date"]
[null,null,null,"When Special Mission is set to Pension, BDD, or Quickstart, the District Selector has no impact."]
[null,null,null,null,null,null,null,null,null,null,null,"Accuracy metrics are available on Rating Bundle - SOJ tab"]
[null,null,null,"CLAIM METRICS",null,null,null,null,null,null,null,"ACCURACY METRICS"]
[null,null,"SPECIAL MISSION SELECTOR","#\nPending","#\nPending\n> 125 Days","%\nPending\n> 125 Days","ADP","#\nCompleted\nMTD","ADC\nMTD","#\nCompleted\nFYTD","ADC\nFYTD","Accuracy measurement is available on the Rating Bundle SOJ tab"]
[]
[]
[100,null,{"$f":"Driver!$C$20& \" Total\"","v":"USA - All Missions Total"},{"$f":"IF(ISNA($A12),\"\",IFERROR(SUMIFS(D_D[INV],D_D[MT],4,D_D[CAT],SMS,D_D[LOC],$A12),0))","v":944142},{"$f":"IF(ISNA($A12),\"\",IFERROR(SUMIFS(D_D[BL],D_D[MT],4,D_D[CAT],SMS,D_D[LOC],$A12),0))","v":272525},{"$f":"IF(ISNA($A12),\"\",IFERROR(E12/D12,0))","v":0.28864831773186661},{"$f":"IF(ISNA($A12),\"\",IFERROR(SUMIFS(D_D[ADP],D_D[MT],4,D_D[CAT],SMS,D_D[LOC],$A12),0))","v":101.95},{"$f":"IF(ISNA($A12),\"\",IFERROR(SUMIFS(D_D[PROD_MTD],D_D[MT],4,D_D[CAT],SMS,D_D[LOC],$A12),0))","v":29266},{"$f":"IF(ISNA($A12),\"\",IFERROR(SUMIFS(D_D[ADCM],D_D[MT],4,D_D[CAT],SMS,D_D[LOC],$A12),0))","v":134.41999999999999},{"$f":"IF(ISNA($A12),\"\",IFERROR(SUMIFS(D_D[PROD_FYTD],D_D[MT],4,D_D[CAT],SMS,D_D[LOC],$A12),0))","v":1651604},{"$f":"IF(ISNA($A12),\"\",IFERROR(SUMIFS(D_D[ADCF],D_D[MT],4,D_D[CAT],SMS,D_D[LOC],$A12),0))","v":129.33000000000001}]
[{"$f":"INDEX(RO,(MATCH($C13,RO_D,0)))","v":"395"},1,{"$f":"IFERROR(INDEX(INDIRECT(DS_RO),B13),\"\")","v":"Pacific District"},{"$f":"IF(ISNA($A13),\"\",IFERROR(SUMIFS(D_D[INV],D_D[MT],4,D_D[CAT],SMS,D_D[LOC],$A13),0))","v":152927},{"$f":"IF(ISNA($A13),\"\",IFERROR(SUMIFS(D_D[BL],D_D[MT],4,D_D[CAT],SMS,D_D[LOC],$A13),0))","v":43762},{"$f":"IF(ISNA($A13),\"\",IFERROR(E13/D13,0))","v":0.28616267892523883},{"$f":"IF(ISNA($A13),\"\",IFERROR(SUMIFS(D_D[ADP],D_D[MT],4,D_D[CAT],SMS,D_D[LOC],$A13),0))","v":100.21},{"$f":"IF(ISNA($A13),\"\",IFERROR(SUMIFS(D_D[PROD_MTD],D_D[MT],4,D_D[CAT],SMS,D_D[LOC],$A13),0))","v":4966},{"$f":"IF(ISNA($A13),\"\",IFERROR(SUMIFS(D_D[ADCM],D_D[MT],4,D_D[CAT],SMS,D_D[LOC],$A13),0))","v":120.56},{"$f":"IF(ISNA($A13),\"\",IFERROR(SUMIFS(D_D[PROD_FYTD],D_D[MT],4,D_D[CAT],SMS,D_D[LOC],$A13),0))","v":262088},{"$f":"IF(ISNA($A13),\"\",IFERROR(SUMIFS(D_D[ADCF],D_D[MT],4,D_D[CAT],SMS,D_D[LOC],$A13),0))","v":121.16}]
["340",2,"Albuquerque",{"$f":"IF(ISNA($A14),\"\",IFERROR(SUMIFS(D_D[INV],D_D[MT],4,D_D[CAT],SMS,D_D[LOC],$A14),0))","v":5968},{"$f":"IF(ISNA($A14),\"\",IFERROR(SUMIFS(D_D[BL],D_D[MT],4,D_D[CAT],SMS,D_D[LOC],$A14),0))","v":1780},{"$f":"IF(ISNA($A14),\"\",IFERROR(E14/D14,0))","v":0.29825737265415547},{"$f":"IF(ISNA($A14),\"\",IFERROR(SUMIFS(D_D[ADP],D_D[MT],4,D_D[CAT],SMS,D_D[LOC],$A14),0))","v":100.28},{"$f":"IF(ISNA($A14),\"\",IFERROR(SUMIFS(D_D[PROD_MTD],D_D[MT],4,D_D[CAT],SMS,D_D[LOC],$A14),0))","v":152},{"$f":"IF(ISNA($A14),\"\",IFERROR(SUMIFS(D_D[ADCM],D_D[MT],4,D_D[CAT],SMS,D_D[LOC],$A14),0))","v":130.02000000000001},{"$f":"IF(ISNA($A14),\"\",IFERROR(SUMIFS(D_D[PROD_FYTD],D_D[MT],4,D_D[CAT],SMS,D_D[LOC],$A14),0))","v":8209},{"$f":"IF(ISNA($A14),\"\",IFERROR(SUMIFS(D_D[ADCF],D_D[MT],4,D_D[CAT],SMS,D_D[LOC],$A14),0))","v":130.35}]
["463",3,{"$f":"IFERROR(INDEX(INDIRECT(DS_RO),B15),\"\")","v":"Anchorage"},{"$f":"IF(ISNA($A15),\"\",IFERROR(SUMIFS(D_D[INV],D_D[MT],4,D_D[CAT],SMS,D_D[LOC],$A15),0))","v":2651},{"$f":"IF(ISNA($A15),\"\",IFERROR(SUMIFS(D_D[BL],D_D[MT],4,D_D[CAT],SMS,D_D[LOC],$A15),0))","v":786},{"$f":"IF(ISNA($A15),\"\",IFERROR(E15/D15,0))","v":0.29649188985288571},{"$f":"IF(ISNA($A15),\"\",IFERROR(SUMIFS(D_D[ADP],D_D[MT],4,D_D[CAT],SMS,D_D[LOC],$A15),0))","v":102.26},{"$f":"IF(ISNA($A15),\"\",IFERROR(SUMIFS(D_D[PROD_MTD],D_D[MT],4,D_D[CAT],SMS,D_D[LOC],$A15),0))","v":62},{"$f":"IF(ISNA($A15),\"\",IFERROR(SUMIFS(D_D[ADCM],D_D[MT],4,D_D[CAT],SMS,D_D[LOC],$A15),0))","v":134.26},{"$f":"IF(ISNA($A15),\"\",IFERROR(SUMIFS(D_D[PROD_FYTD],D_D[MT],4,D_D[CAT],SMS,D_D[LOC],$A15),0))","v":3973},{"$f":"IF(ISNA($A15),\"\",IFERROR(SUMIFS(D_D[ADCF],D_D[MT],4,D_D[CAT],SMS,D_D[LOC],$A15),0))","v":135.01}]
["347",4,"Boise",{"$f":"IF(ISNA($A16),\"\",IFERROR(SUMIFS(D_D[INV],D_D[MT],4,D_D[CAT],SMS,D_D[LOC],$A16),0))","v":4485},{"$f":"IF(ISNA($A16),\"\",IFERROR(SUMIFS(D_D[BL],D_D[MT],4,D_D[CAT],SMS,D_D[LOC],$A16),0))","v":1226},0.273355629877369,{"$f":"IF(ISNA($A16),\"\",IFERROR(SUMIFS(D_D[ADP],D_D[MT],4,D_D[CAT],SMS,D_D[LOC],$A16),0))","v":98.99},{"$f":"IF(ISNA($A16),\"\",IFERROR(SUMIFS(D_D[PROD_MTD],D_D[MT],4,D_D[CAT],SMS,D_D[LOC],$A16),0))","v":158},{"$f":"IF(ISNA($A16),\"\",IFERROR(SUMIFS(D_D[ADCM],D_D[MT],4,D_D[CAT],SMS,D_D[LOC],$A16),0))","v":139.87},{"$f":"IF(ISNA($A16),\"\",IFERROR(SUMIFS(D_D[PROD_FYTD],D_D[MT],4,D_D[CAT],SMS,D_D[LOC],$A16),0))","v":7414},{"$f":"IF(ISNA($A16),\"\",IFERROR(SUMIFS(D_D[ADCF],D_D[MT],4,D_D[CAT],SMS,D_D[LOC],$A16),0))","v":126.72}]
["459",5,"Honolulu",{"$f":"IF(ISNA($A17),\"\",IFERROR(SUMIFS(D_D[INV],D_D[MT],4,D_D[CAT],SMS,D_D[LOC],$A17),0))","v":7381},{"$f":"IF(ISNA($A17),\"\",IFERROR(SUMIFS(D_D[BL],D_D[MT],4,D_D[CAT],SMS,D_D[LOC],$A17),0))","v":2265},0.30686898794201328,{"$f":"IF(ISNA($A17),\"\",IFERROR(SUMIFS(D_D[ADP],D_D[MT],4,D_D[CAT],SMS,D_D[LOC],$A17),0))","v":103.76},{"$f":"IF(ISNA($A17),\"\",IFERROR(SUMIFS(D_D[PROD_MTD],D_D[MT],4,D_D[CAT],SMS,D_D[LOC],$A17),0))","v":220},{"$f":"IF(ISNA($A17),\"\",IFERROR(SUMIFS(D_D[ADCM],D_D[MT],4,D_D[CAT],SMS,D_D[LOC],$A17),0))","v":142.87},{"$f":"IF(ISNA($A17),\"\",IFERROR(SUMIFS(D_D[PROD_FYTD],D_D[MT],4,D_D[CAT],SMS,D_D[LOC],$A17),0))","v":10270},{"$f":"IF(ISNA($A17),\"\",IFERROR(SUMIFS(D_D[ADCF],D_D[MT],4,D_D[CAT],SMS,D_D[LOC],$A17),0))","v":127.88}]
["344",6,"Los Angeles",{"$f":"IF(ISNA($A18),\"\",IFERROR(SUMIFS(D_D[INV],D_D[MT],4,D_D[CAT],SMS,D_D[LOC],$A18),0))","v":21960},{"$f":"IF(ISNA($A18),\"\",IFERROR(SUMIFS(D_D[BL],D_D[MT],4,D_D[CAT],SMS,D_D[LOC],$A18),0))","v":6200},0.28233151183970856,{"$f":"IF(ISNA($A18),\"\",IFERROR(SUMIFS(D_D[ADP],D_D[MT],4,D_D[CAT],SMS,D_D[LOC],$A18),0))","v":98.2},{"$f":"IF(ISNA($A18),\"\",IFERROR(SUMIFS(D_D[PROD_MTD],D_D[MT],4,D_D[CAT],SMS,D_D[LOC],$A18),0))","v":646},{"$f":"IF(ISNA($A18),\"\",IFERROR(SUMIFS(D_D[ADCM],D_D[MT],4,D_D[CAT],SMS,D_D[LOC],$A18),0))","v":127.97},{"$f":"IF(ISNA($A18),\"\",IFERROR(SUMIFS(D_D[PROD_FYTD],D_D[MT],4,D_D[CAT],SMS,D_D[LOC],$A18),0))","v":33981},{"$f":"IF(ISNA($A18),\"\",IFERROR(SUMIFS(D_D[ADCF],D_D[MT],4,D_D[CAT],SMS,D_D[LOC],$A18),0))","v":123.33}]
["358",7,"Manila",{"$f":"IF(ISNA($A19),\"\",IFERROR(SUMIFS(D_D[INV],D_D[MT],4,D_D[CAT],SMS,D_D[LOC],$A19),0))","v":994},{"$f":"IF(ISNA($A19),\"\",IFERROR(SUMIFS(D_D[BL],D_D[MT],4,D_D[CAT],SMS,D_D[LOC],$A19),0))","v":385},0.38732394366197181,{"$f":"IF(ISNA($A19),\"\",IFERROR(SUMIFS(D_D[ADP],D_D[MT],4,D_D[CAT],SMS,D_D[LOC],$A19),0))","v":122.42},{"$f":"IF(ISNA($A19),\"\",IFERROR(SUMIFS(D_D[PROD_MTD],D_D[MT],4,D_D[CAT],SMS,D_D[LOC],$A19),0))","v":34},{"$f":"IF(ISNA($A19),\"\",IFERROR(SUMIFS(D_D[ADCM],D_D[MT],4,D_D[CAT],SMS,D_D[LOC],$A19),0))","v":134.62},{"$f":"IF(ISNA($A19),\"\",IFERROR(SUMIFS(D_D[PROD_FYTD],D_D[MT],4,D_D[CAT],SMS,D_D[LOC],$A19),0))","v":1544},{"$f":"IF(ISNA($A19),\"\",IFERROR(SUMIFS(D_D[ADCF],D_D[MT],4,D_D[CAT],SMS,D_D[LOC],$A19),0))","v":127.78}]
["343",8,"Oakland",{"$f":"IF(ISNA($A20),\"\",IFERROR(SUMIFS(D_D[INV],D_D[MT],4,D_D[CAT],SMS,D_D[LOC],$A20),0))","v":22302},{"$f":"IF(ISNA($A20),\"\",IFERROR(SUMIFS(D_D[BL],D_D[MT],4,D_D[CAT],SMS,D_D[LOC],$A20),0))","v":6360},0.28517621737960719,{"$f":"IF(ISNA($A20),\"\",IFERROR(SUMIFS(D_D[ADP],D_D[MT],4,D_D[CAT],SMS,D_D[LOC],$A20),0))","v":99.93},{"$f":"IF(ISNA($A20),\"\",IFERROR(SUMIFS(D_D[PROD_MTD],D_D[MT],4,D_D[CAT],SMS,D_D[LOC],$A20),0))","v":636},{"$f":"IF(ISNA($A20),\"\",IFERROR(SUMIFS(D_D[ADCM],D_D[MT],4,D_D[CAT],SMS,D_D[LOC],$A20),0))","v":130.69},{"$f":"IF(ISNA($A20),\"\",IFERROR(SUMIFS(D_D[PROD_FYTD],D_D[MT],4,D_D[CAT],SMS,D_D[LOC],$A20),0))","v":34327},{"$f":"IF(ISNA($A20),\"\",IFERROR(SUMIFS(D_D[ADCF],D_D[MT],4,D_D[CAT],SMS,D_D[LOC],$A20),0))","v":128.18}]
["345",9,"Phoenix",{"$f":"IF(ISNA($A21),\"\",IFERROR(SUMIFS(D_D[INV],D_D[MT],4,D_D[CAT],SMS,D_D[LOC],$A21),0))","v":18782},{"$f":"IF(ISNA($A21),\"\",IFERROR(SUMIFS(D_D[BL],D_D[MT],4,D_D[CAT],SMS,D_D[LOC],$A21),0))","v":5396},0.28729634756681932,{"$f":"IF(ISNA($A21),\"\",IFERROR(SUMIFS(D_D[ADP],D_D[MT],4,D_D[CAT],SMS,D_D[LOC],$A21),0))","v":98.96},{"$f":"IF(ISNA($A21),\"\",IFERROR(SUMIFS(D_D[PROD_MTD],D_D[MT],4,D_D[CAT],SMS,D_D[LOC],$A21),0))","v":532},{"$f":"IF(ISNA($A21),\"\",IFERROR(SUMIFS(D_D[ADCM],D_D[MT],4,D_D[CAT],SMS,D_D[LOC],$A21),0))","v":127.62},{"$f":"IF(ISNA($A21),\"\",IFERROR(SUMIFS(D_D[PROD_FYTD],D_D[MT],4,D_D[CAT],SMS,D_D[LOC],$A21),0))","v":26646},{"$f":"IF(ISNA($A21),\"\",IFERROR(SUMIFS(D_D[ADCF],D_D[MT],4,D_D[CAT],SMS,D_D[LOC],$A21),0))","v":130.72999999999999}]
["348",10,"Portland",{"$f":"IF(ISNA($A22),\"\",IFERROR(SUMIFS(D_D[INV],D_D[MT],4,D_D[CAT],SMS,D_D[LOC],$A22),0))","v":8058},{"$f":"IF(ISNA($A22),\"\",IFERROR(SUMIFS(D_D[BL],D_D[MT],4,D_D[CAT],SMS,D_D[LOC],$A22),0))","v":2335},0.28977413750310249,{"$f":"IF(ISNA($A22),\"\",IFERROR(SUMIFS(D_D[ADP],D_D[MT],4,D_D[CAT],SMS,D_D[LOC],$A22),0))","v":100.79},{"$f":"IF(ISNA($A22),\"\",IFERROR(SUMIFS(D_D[PROD_MTD],D_D[MT],4,D_D[CAT],SMS,D_D[LOC],$A22),0))","v":211},{"$f":"IF(ISNA($A22),\"\",IFERROR(SUMIFS(D_D[ADCM],D_D[MT],4,D_D[CAT],SMS,D_D[LOC],$A22),0))","v":129.15},{"$f":"IF(ISNA($A22),\"\",IFERROR(SUMIFS(D_D[PROD_FYTD],D_D[MT],4,D_D[CAT],SMS,D_D[LOC],$A22),0))","v":13442},{"$f":"IF(ISNA($A22),\"\",IFERROR(SUMIFS(D_D[ADCF],D_D[MT],4,D_D[CAT],SMS,D_D[LOC],$A22),0))","v":130.19}]
["354",11,"Reno",{"$f":"IF(ISNA($A23),\"\",IFERROR(SUMIFS(D_D[INV],D_D[MT],4,D_D[CAT],SMS,D_D[LOC],$A23),0))","v":10321},{"$f":"IF(ISNA($A23),\"\",IFERROR(SUMIFS(D_D[BL],D_D[MT],4,D_D[CAT],SMS,D_D[LOC],$A23),0))","v":3048},0.29532022090882665,{"$f":"IF(ISNA($A23),\"\",IFERROR(SUMIFS(D_D[ADP],D_D[MT],4,D_D[CAT],SMS,D_D[LOC],$A23),0))","v":101.51},{"$f":"IF(ISNA($A23),\"\",IFERROR(SUMIFS(D_D[PROD_MTD],D_D[MT],4,D_D[CAT],SMS,D_D[LOC],$A23),0))","v":315},{"$f":"IF(ISNA($A23),\"\",IFERROR(SUMIFS(D_D[ADCM],D_D[MT],4,D_D[CAT],SMS,D_D[LOC],$A23),0))","v":136.53},{"$f":"IF(ISNA($A23),\"\",IFERROR(SUMIFS(D_D[PROD_FYTD],D_D[MT],4,D_D[CAT],SMS,D_D[LOC],$A23),0))","v":15711},{"$f":"IF(ISNA($A23),\"\",IFERROR(SUMIFS(D_D[ADCF],D_D[MT],4,D_D[CAT],SMS,D_D[LOC],$A23),0))","v":135.25}]
["341",12,"Salt Lake City",{"$f":"IF(ISNA($A24),\"\",IFERROR(SUMIFS(D_D[INV],D_D[MT],4,D_D[CAT],SMS,D_D[LOC],$A24),0))","v":6125},{"$f":"IF(ISNA($A24),\"\",IFERROR(SUMIFS(D_D[BL],D_D[MT],4,D_D[CAT],SMS,D_D[LOC],$A24),0))","v":1825},0.29795918367346941,{"$f":"IF(ISNA($A24),\"\",IFERROR(SUMIFS(D_D[ADP],D_D[MT],4,D_D[CAT],SMS,D_D[LOC],$A24),0))","v":104.97},{"$f":"IF(ISNA($A24),\"\",IFERROR(SUMIFS(D_D[PROD_MTD],D_D[MT],4,D_D[CAT],SMS,D_D[LOC],$A24),0))","v":177},{"$f":"IF(ISNA($A24),\"\",IFERROR(SUMIFS(D_D[ADCM],D_D[MT],4,D_D[CAT],SMS,D_D[LOC],$A24),0))","v":122.47},{"$f":"IF(ISNA($A24),\"\",IFERROR(SUMIFS(D_D[PROD_FYTD],D_D[MT],4,D_D[CAT],SMS,D_D[LOC],$A24),0))","v":11014},{"$f":"IF(ISNA($A24),\"\",IFERROR(SUMIFS(D_D[ADCF],D_D[MT],4,D_D[CAT],SMS,D_D[LOC],$A24),0))","v":171.12}]
["377",13,"San Diego",{"$f":"IF(ISNA($A25),\"\",IFERROR(SUMIFS(D_D[INV],D_D[MT],4,D_D[CAT],SMS,D_D[LOC],$A25),0))","v":23483},{"$f":"IF(ISNA($A25),\"\",IFERROR(SUMIFS(D_D[BL],D_D[MT],4,D_D[CAT],SMS,D_D[LOC],$A25),0))","v":6390},0.27211174040795472,{"$f":"IF(ISNA($A25),\"\",IFERROR(SUMIFS(D_D[ADP],D_D[MT],4,D_D[CAT],SMS,D_D[LOC],$A25),0))","v":97.49},{"$f":"IF(ISNA($A25),\"\",IFERROR(SUMIFS(D_D[PROD_MTD],D_D[MT],4,D_D[CAT],SMS,D_D[LOC],$A25),0))","v":757},{"$f":"IF(ISNA($A25),\"\",IFERROR(SUMIFS(D_D[ADCM],D_D[MT],4,D_D[CAT],SMS,D_D[LOC],$A25),0))","v":120.44},{"$f":"IF(ISNA($A25),\"\",IFERROR(SUMIFS(D_D[PROD_FYTD],D_D[MT],4,D_D[CAT],SMS,D_D[LOC],$A25),0))","v":39490},{"$f":"IF(ISNA($A25),\"\",IFERROR(SUMIFS(D_D[ADCF],D_D[MT],4,D_D[CAT],SMS,D_D[LOC],$A25),0))","v":123.16}]
["346",14,"Seattle",{"$f":"IF(ISNA($A26),\"\",IFERROR(SUMIFS(D_D[INV],D_D[MT],4,D_D[CAT],SMS,D_D[LOC],$A26),0))","v":20417},{"$f":"IF(ISNA($A26),\"\",IFERROR(SUMIFS(D_D[BL],D_D[MT],4,D_D[CAT],SMS,D_D[LOC],$A26),0))","v":5766},0.28241171572709017,{"$f":"IF(ISNA($A26),\"\",IFERROR(SUMIFS(D_D[ADP],D_D[MT],4,D_D[CAT],SMS,D_D[LOC],$A26),0))","v":102.26},{"$f":"IF(ISNA($A26),\"\",IFERROR(SUMIFS(D_D[PROD_MTD],D_D[MT],4,D_D[CAT],SMS,D_D[LOC],$A26),0))","v":1066},{"$f":"IF(ISNA($A26),\"\",IFERROR(SUMIFS(D_D[ADCM],D_D[MT],4,D_D[CAT],SMS,D_D[LOC],$A26),0))","v":89.79},{"$f":"IF(ISNA($A26),\"\",IFERROR(SUMIFS(D_D[PROD_FYTD],D_D[MT],4,D_D[CAT],SMS,D_D[LOC],$A26),0))","v":56067},{"$f":"IF(ISNA($A26),\"\",IFERROR(SUMIFS(D_D[ADCF],D_D[MT],4,D_D[CAT],SMS,D_D[LOC],$A26),0))","v":89.18}]
[{"$error":"#N/A"},15,"",{"$f":"IF(ISNA($A27),\"\",IFERROR(SUMIFS(D_D[INV],D_D[MT],4,D_D[CAT],SMS,D_D[LOC],$A27),0))","v":""},{"$f":"IF(ISNA($A27),\"\",IFERROR(SUMIFS(D_D[BL],D_D[MT],4,D_D[CAT],SMS,D_D[LOC],$A27),0))","v":""},"",{"$f":"IF(ISNA($A27),\"\",IFERROR(SUMIFS(D_D[ADP],D_D[MT],4,D_D[CAT],SMS,D_D[LOC],$A27),0))","v":""},{"$f":"IF(ISNA($A27),\"\",IFERROR(SUMIFS(D_D[PROD_MTD],D_D[MT],4,D_D[CAT],SMS,D_D[LOC],$A27),0))","v":""},{"$f":"IF(ISNA($A27),\"\",IFERROR(SUMIFS(D_D[ADCM],D_D[MT],4,D_D[CAT],SMS,D_D[LOC],$A27),0))","v":""},{"$f":"IF(ISNA($A27),\"\",IFERROR(SUMIFS(D_D[PROD_FYTD],D_D[MT],4,D_D[CAT],SMS,D_D[LOC],$A27),0))","v":""},{"$f":"IF(ISNA($A27),\"\",IFERROR(SUMIFS(D_D[ADCF],D_D[MT],4,D_D[CAT],SMS,D_D[LOC],$A27),0))","v":""}]
[{"$error":"#N/A"},16,"",{"$f":"IF(ISNA($A28),\"\",IFERROR(SUMIFS(D_D[INV],D_D[MT],4,D_D[CAT],SMS,D_D[LOC],$A28),0))","v":""},{"$f":"IF(ISNA($A28),\"\",IFERROR(SUMIFS(D_D[BL],D_D[MT],4,D_D[CAT],SMS,D_D[LOC],$A28),0))","v":""},"",{"$f":"IF(ISNA($A28),\"\",IFERROR(SUMIFS(D_D[ADP],D_D[MT],4,D_D[CAT],SMS,D_D[LOC],$A28),0))","v":""},{"$f":"IF(ISNA($A28),\"\",IFERROR(SUMIFS(D_D[PROD_MTD],D_D[MT],4,D_D[CAT],SMS,D_D[LOC],$A28),0))","v":""},{"$f":"IF(ISNA($A28),\"\",IFERROR(SUMIFS(D_D[ADCM],D_D[MT],4,D_D[CAT],SMS,D_D[LOC],$A28),0))","v":""},{"$f":"IF(ISNA($A28),\"\",IFERROR(SUMIFS(D_D[PROD_FYTD],D_D[MT],4,D_D[CAT],SMS,D_D[LOC],$A28),0))","v":""},{"$f":"IF(ISNA($A28),\"\",IFERROR(SUMIFS(D_D[ADCF],D_D[MT],4,D_D[CAT],SMS,D_D[LOC],$A28),0))","v":""}]
[{"$error":"#N/A"},17,"",{"$f":"IF(ISNA($A29),\"\",IFERROR(SUMIFS(D_D[INV],D_D[MT],4,D_D[CAT],SMS,D_D[LOC],$A29),0))","v":""},{"$f":"IF(ISNA($A29),\"\",IFERROR(SUMIFS(D_D[BL],D_D[MT],4,D_D[CAT],SMS,D_D[LOC],$A29),0))","v":""},"",{"$f":"IF(ISNA($A29),\"\",IFERROR(SUMIFS(D_D[ADP],D_D[MT],4,D_D[CAT],SMS,D_D[LOC],$A29),0))","v":""},{"$f":"IF(ISNA($A29),\"\",IFERROR(SUMIFS(D_D[PROD_MTD],D_D[MT],4,D_D[CAT],SMS,D_D[LOC],$A29),0))","v":""},{"$f":"IF(ISNA($A29),\"\",IFERROR(SUMIFS(D_D[ADCM],D_D[MT],4,D_D[CAT],SMS,D_D[LOC],$A29),0))","v":""},{"$f":"IF(ISNA($A29),\"\",IFERROR(SUMIFS(D_D[PROD_FYTD],D_D[MT],4,D_D[CAT],SMS,D_D[LOC],$A29),0))","v":""},{"$f":"IF(ISNA($A29),\"\",IFERROR(SUMIFS(D_D[ADCF],D_D[MT],4,D_D[CAT],SMS,D_D[LOC],$A29),0))","v":""}]
[{"$error":"#N/A"},18,"",{"$f":"IF(ISNA($A30),\"\",IFERROR(SUMIFS(D_D[INV],D_D[MT],4,D_D[CAT],SMS,D_D[LOC],$A30),0))","v":""},{"$f":"IF(ISNA($A30),\"\",IFERROR(SUMIFS(D_D[BL],D_D[MT],4,D_D[CAT],SMS,D_D[LOC],$A30),0))","v":""},"",{"$f":"IF(ISNA($A30),\"\",IFERROR(SUMIFS(D_D[ADP],D_D[MT],4,D_D[CAT],SMS,D_D[LOC],$A30),0))","v":""},{"$f":"IF(ISNA($A30),\"\",IFERROR(SUMIFS(D_D[PROD_MTD],D_D[MT],4,D_D[CAT],SMS,D_D[LOC],$A30),0))","v":""},{"$f":"IF(ISNA($A30),\"\",IFERROR(SUMIFS(D_D[ADCM],D_D[MT],4,D_D[CAT],SMS,D_D[LOC],$A30),0))","v":""},{"$f":"IF(ISNA($A30),\"\",IFERROR(SUMIFS(D_D[PROD_FYTD],D_D[MT],4,D_D[CAT],SMS,D_D[LOC],$A30),0))","v":""},{"$f":"IF(ISNA($A30),\"\",IFERROR(SUMIFS(D_D[ADCF],D_D[MT],4,D_D[CAT],SMS,D_D[LOC],$A30),0))","v":""}]
[{"$error":"#N/A"},19,"",{"$f":"IF(ISNA($A31),\"\",IFERROR(SUMIFS(D_D[INV],D_D[MT],4,D_D[CAT],SMS,D_D[LOC],$A31),0))","v":""},{"$f":"IF(ISNA($A31),\"\",IFERROR(SUMIFS(D_D[BL],D_D[MT],4,D_D[CAT],SMS,D_D[LOC],$A31),0))","v":""},"",{"$f":"IF(ISNA($A31),\"\",IFERROR(SUMIFS(D_D[ADP],D_D[MT],4,D_D[CAT],SMS,D_D[LOC],$A31),0))","v":""},{"$f":"IF(ISNA($A31),\"\",IFERROR(SUMIFS(D_D[PROD_MTD],D_D[MT],4,D_D[CAT],SMS,D_D[LOC],$A31),0))","v":""},{"$f":"IF(ISNA($A31),\"\",IFERROR(SUMIFS(D_D[ADCM],D_D[MT],4,D_D[CAT],SMS,D_D[LOC],$A31),0))","v":""},{"$f":"IF(ISNA($A31),\"\",IFERROR(SUMIFS(D_D[PROD_FYTD],D_D[MT],4,D_D[CAT],SMS,D_D[LOC],$A31),0))","v":""},{"$f":"IF(ISNA($A31),\"\",IFERROR(SUMIFS(D_D[ADCF],D_D[MT],4,D_D[CAT],SMS,D_D[LOC],$A31),0))","v":""}]
[{"$error":"#N/A"},20,"",{"$f":"IF(ISNA($A32),\"\",IFERROR(SUMIFS(D_D[INV],D_D[MT],4,D_D[CAT],SMS,D_D[LOC],$A32),0))","v":""},{"$f":"IF(ISNA($A32),\"\",IFERROR(SUMIFS(D_D[BL],D_D[MT],4,D_D[CAT],SMS,D_D[LOC],$A32),0))","v":""},"",{"$f":"IF(ISNA($A32),\"\",IFERROR(SUMIFS(D_D[ADP],D_D[MT],4,D_D[CAT],SMS,D_D[LOC],$A32),0))","v":""},{"$f":"IF(ISNA($A32),\"\",IFERROR(SUMIFS(D_D[PROD_MTD],D_D[MT],4,D_D[CAT],SMS,D_D[LOC],$A32),0))","v":""},{"$f":"IF(ISNA($A32),\"\",IFERROR(SUMIFS(D_D[ADCM],D_D[MT],4,D_D[CAT],SMS,D_D[LOC],$A32),0))","v":""},{"$f":"IF(ISNA($A32),\"\",IFERROR(SUMIFS(D_D[PROD_FYTD],D_D[MT],4,D_D[CAT],SMS,D_D[LOC],$A32),0))","v":""},{"$f":"IF(ISNA($A32),\"\",IFERROR(SUMIFS(D_D[ADCF],D_D[MT],4,D_D[CAT],SMS,D_D[LOC],$A32),0))","v":""}]
[{"$error":"#N/A"},21,"",{"$f":"IF(ISNA($A33),\"\",IFERROR(SUMIFS(D_D[INV],D_D[MT],4,D_D[CAT],SMS,D_D[LOC],$A33),0))","v":""},{"$f":"IF(ISNA($A33),\"\",IFERROR(SUMIFS(D_D[BL],D_D[MT],4,D_D[CAT],SMS,D_D[LOC],$A33),0))","v":""},"",{"$f":"IF(ISNA($A33),\"\",IFERROR(SUMIFS(D_D[ADP],D_D[MT],4,D_D[CAT],SMS,D_D[LOC],$A33),0))","v":""},{"$f":"IF(ISNA($A33),\"\",IFERROR(SUMIFS(D_D[PROD_MTD],D_D[MT],4,D_D[CAT],SMS,D_D[LOC],$A33),0))","v":""},{"$f":"IF(ISNA($A33),\"\",IFERROR(SUMIFS(D_D[ADCM],D_D[MT],4,D_D[CAT],SMS,D_D[LOC],$A33),0))","v":""},{"$f":"IF(ISNA($A33),\"\",IFERROR(SUMIFS(D_D[PROD_FYTD],D_D[MT],4,D_D[CAT],SMS,D_D[LOC],$A33),0))","v":""},{"$f":"IF(ISNA($A33),\"\",IFERROR(SUMIFS(D_D[ADCF],D_D[MT],4,D_D[CAT],SMS,D_D[LOC],$A33),0))","v":""}]
[{"$error":"#N/A"},22,"",{"$f":"IF(ISNA($A34),\"\",IFERROR(SUMIFS(D_D[INV],D_D[MT],4,D_D[CAT],SMS,D_D[LOC],$A34),0))","v":""},{"$f":"IF(ISNA($A34),\"\",IFERROR(SUMIFS(D_D[BL],D_D[MT],4,D_D[CAT],SMS,D_D[LOC],$A34),0))","v":""},"",{"$f":"IF(ISNA($A34),\"\",IFERROR(SUMIFS(D_D[ADP],D_D[MT],4,D_D[CAT],SMS,D_D[LOC],$A34),0))","v":""},{"$f":"IF(ISNA($A34),\"\",IFERROR(SUMIFS(D_D[PROD_MTD],D_D[MT],4,D_D[CAT],SMS,D_D[LOC],$A34),0))","v":""},{"$f":"IF(ISNA($A34),\"\",IFERROR(SUMIFS(D_D[ADCM],D_D[MT],4,D_D[CAT],SMS,D_D[LOC],$A34),0))","v":""},{"$f":"IF(ISNA($A34),\"\",IFERROR(SUMIFS(D_D[PROD_FYTD],D_D[MT],4,D_D[CAT],SMS,D_D[LOC],$A34),0))","v":""},{"$f":"IF(ISNA($A34),\"\",IFERROR(SUMIFS(D_D[ADCF],D_D[MT],4,D_D[CAT],SMS,D_D[LOC],$A34),0))","v":""}]
[{"$error":"#N/A"},23,"",{"$f":"IF(ISNA($A35),\"\",IFERROR(SUMIFS(D_D[INV],D_D[MT],4,D_D[CAT],SMS,D_D[LOC],$A35),0))","v":""},{"$f":"IF(ISNA($A35),\"\",IFERROR(SUMIFS(D_D[BL],D_D[MT],4,D_D[CAT],SMS,D_D[LOC],$A35),0))","v":""},"",{"$f":"IF(ISNA($A35),\"\",IFERROR(SUMIFS(D_D[ADP],D_D[MT],4,D_D[CAT],SMS,D_D[LOC],$A35),0))","v":""},{"$f":"IF(ISNA($A35),\"\",IFERROR(SUMIFS(D_D[PROD_MTD],D_D[MT],4,D_D[CAT],SMS,D_D[LOC],$A35),0))","v":""},{"$f":"IF(ISNA($A35),\"\",IFERROR(SUMIFS(D_D[ADCM],D_D[MT],4,D_D[CAT],SMS,D_D[LOC],$A35),0))","v":""},{"$f":"IF(ISNA($A35),\"\",IFERROR(SUMIFS(D_D[PROD_FYTD],D_D[MT],4,D_D[CAT],SMS,D_D[LOC],$A35),0))","v":""},{"$f":"IF(ISNA($A35),\"\",IFERROR(SUMIFS(D_D[ADCF],D_D[MT],4,D_D[CAT],SMS,D_D[LOC],$A35),0))","v":""}]

{"sheet":"Rating Bundle - State","index":7,"n_rows":35,"n_cols":15,"rows_kept":35,"cut":false,"hidden":false,"merged":[[8,9,10,9],[8,10,10,10],[8,11,10,16],[8,6,10,6],[1,11,1,16],[2,11,2,16],[1,3,1,10],[2,3,2,10],[7,3,7,10],[7,11,7,16],[8,3,10,3],[8,4,10,4],[8,5,10,5],[8,7,10,7],[8,8,10,8],[6,11,6,16]]}
[]
[null,null,"DISTRICT SELECTOR","Compensation and Pension Rating Bundle Metrics",null,null,null,null,null,null,null,"Report through"]
[null,null,null,"State View",null,null,null,null,null,null,null,{"$f":"D_DT[]","v":"2023-08-05"}]
[null,null,null,"The State listed is based on the address associated with the claim, not payment address",null,null,null,null,null,null,null,"ADP = Average Days Pending",null,null,"MTD = Month to Date"]
[null,null,null,"Each Special Mission has distinct claim counts",null,null,null,null,null,null,null,"ADC = Average Days to Complete",null,null,"FYTD = Fiscal Year to Date"]
[null,null,null,"When Special Mission is set to Pension, BDD, or Quickstart, the District Selector has no impact."]
[null,null,null,null,null,null,null,null,null,null,null,"Accuracy metrics are available on Rating Bundle - SOJ tab"]
[null,null,null,"CLAIM METRICS",null,null,null,null,null,null,null,"ACCURACY METRICS"]
[null,null,"SPECIAL MISSION SELECTOR","#\nPending","#\nPending\n> 125 Days","%\nPending\n> 125 Days","ADP","#\nCompleted\nMTD","ADC\nMTD","#\nCompleted\nFYTD","ADC\nFYTD","Accuracy measurement is available on the Rating Bundle SOJ tab"]
[]
[]
[100,null,{"$f":"Driver!$C$20& \" Total\"","v":"USA - All Missions Total"},{"$f":"IF(ISNA($A12),\"\",IFERROR(SUMIFS(D_D[INV],D_D[MT],6,D_D[CAT],SMS,D_D[LOC],$A12),0))","v":944142},{"$f":"IF(ISNA($A12),\"\",IFERROR(SUMIFS(D_D[BL],D_D[MT],6,D_D[CAT],SMS,D_D[LOC],$A12),0))","v":272525},{"$f":"IF(ISNA($A12),\"\",IFERROR(E12/D12,0))","v":0.28864831773186661},{"$f":"IF(ISNA($A12),\"\",IFERROR(SUMIFS(D_D[ADP],D_D[MT],6,D_D[CAT],SMS,D_D[LOC],$A12),0))","v":101.95},{"$f":"IF(ISNA($A12),\"\",IFERROR(SUMIFS(D_D[PROD_MTD],D_D[MT],6,D_D[CAT],SMS,D_D[LOC],$A12),0))","v":29266},{"$f":"IF(ISNA($A12),\"\",IFERROR(SUMIFS(D_D[ADCM],D_D[MT],6,D_D[CAT],SMS,D_D[LOC],$A12),0))","v":134.41999999999999},{"$f":"IF(ISNA($A12),\"\",IFERROR(SUMIFS(D_D[PROD_FYTD],D_D[MT],6,D_D[CAT],SMS,D_D[LOC],$A12),0))","v":1651604},{"$f":"IF(ISNA($A12),\"\",IFERROR(SUMIFS(D_D[ADCF],D_D[MT],6,D_D[CAT],SMS,D_D[LOC],$A12),0))","v":129.33000000000001}]
[{"$f":"INDEX(STATE,(MATCH($C13,STATE_D,0)))","v":"395"},1,{"$f":"IFERROR(INDEX(INDIRECT(DS_ST),B13),\"\")","v":"Pacific District"},{"$f":"IF(ISNA($A13),\"\",IFERROR(SUMIFS(D_D[INV],D_D[MT],6,D_D[CAT],SMS,D_D[LOC],$A13),0))","v":169660},{"$f":"IF(ISNA($A13),\"\",IFERROR(SUMIFS(D_D[BL],D_D[MT],6,D_D[CAT],SMS,D_D[LOC],$A13),0))","v":51387},{"$f":"IF(ISNA($A13),\"\",IFERROR(E13/D13,0))","v":0.30288223505835199},{"$f":"IF(ISNA($A13),\"\",IFERROR(SUMIFS(D_D[ADP],D_D[MT],6,D_D[CAT],SMS,D_D[LOC],$A13),0))","v":106.05},{"$f":"IF(ISNA($A13),\"\",IFERROR(SUMIFS(D_D[PROD_MTD],D_D[MT],6,D_D[CAT],SMS,D_D[LOC],$A13),0))","v":5150},{"$f":"IF(ISNA($A13),\"\",IFERROR(SUMIFS(D_D[ADCM],D_D[MT],6,D_D[CAT],SMS,D_D[LOC],$A13),0))","v":130.88999999999999},{"$f":"IF(ISNA($A13),\"\",IFERROR(SUMIFS(D_D[PROD_FYTD],D_D[MT],6,D_D[CAT],SMS,D_D[LOC],$A13),0))","v":284864},{"$f":"IF(ISNA($A13),\"\",IFERROR(SUMIFS(D_D[ADCF],D_D[MT],6,D_D[CAT],SMS,D_D[LOC],$A13),0))","v":130.09}]
["AK",2,"Alaska",{"$f":"IF(ISNA($A14),\"\",IFERROR(SUMIFS(D_D[INV],D_D[MT],6,D_D[CAT],SMS,D_D[LOC],$A14),0))","v":2996},{"$f":"IF(ISNA($A14),\"\",IFERROR(SUMIFS(D_D[BL],D_D[MT],6,D_D[CAT],SMS,D_D[LOC],$A14),0))","v":936},{"$f":"IF(ISNA($A14),\"\",IFERROR(E14/D14,0))","v":0.31241655540720964},{"$f":"IF(ISNA($A14),\"\",IFERROR(SUMIFS(D_D[ADP],D_D[MT],6,D_D[CAT],SMS,D_D[LOC],$A14),0))","v":108.92},{"$f":"IF(ISNA($A14),\"\",IFERROR(SUMIFS(D_D[PROD_MTD],D_D[MT],6,D_D[CAT],SMS,D_D[LOC],$A14),0))","v":93},{"$f":"IF(ISNA($A14),\"\",IFERROR(SUMIFS(D_D[ADCM],D_D[MT],6,D_D[CAT],SMS,D_D[LOC],$A14),0))","v":118.19},{"$f":"IF(ISNA($A14),\"\",IFERROR(SUMIFS(D_D[PROD_FYTD],D_D[MT],6,D_D[CAT],SMS,D_D[LOC],$A14),0))","v":5099},{"$f":"IF(ISNA($A14),\"\",IFERROR(SUMIFS(D_D[ADCF],D_D[MT],6,D_D[CAT],SMS,D_D[LOC],$A14),0))","v":132.94}]
["AZ",3,{"$f":"IFERROR(INDEX(INDIRECT(DS_ST),B15),\"\")","v":"Arizona"},{"$f":"IF(ISNA($A15),\"\",IFERROR(SUMIFS(D_D[INV],D_D[MT],6,D_D[CAT],SMS,D_D[LOC],$A15),0))","v":23516},{"$f":"IF(ISNA($A15),\"\",IFERROR(SUMIFS(D_D[BL],D_D[MT],6,D_D[CAT],SMS,D_D[LOC],$A15),0))","v":7097},{"$f":"IF(ISNA($A15),\"\",IFERROR(E15/D15,0))","v":0.30179452287804048},{"$f":"IF(ISNA($A15),\"\",IFERROR(SUMIFS(D_D[ADP],D_D[MT],6,D_D[CAT],SMS,D_D[LOC],$A15),0))","v":104.84},{"$f":"IF(ISNA($A15),\"\",IFERROR(SUMIFS(D_D[PROD_MTD],D_D[MT],6,D_D[CAT],SMS,D_D[LOC],$A15),0))","v":712},{"$f":"IF(ISNA($A15),\"\",IFERROR(SUMIFS(D_D[ADCM],D_D[MT],6,D_D[CAT],SMS,D_D[LOC],$A15),0))","v":129.09},{"$f":"IF(ISNA($A15),\"\",IFERROR(SUMIFS(D_D[PROD_FYTD],D_D[MT],6,D_D[CAT],SMS,D_D[LOC],$A15),0))","v":36807},{"$f":"IF(ISNA($A15),\"\",IFERROR(SUMIFS(D_D[ADCF],D_D[MT],6,D_D[CAT],SMS,D_D[LOC],$A15),0))","v":130.84}]
["CA",4,"California",{"$f":"IF(ISNA($A16),\"\",IFERROR(SUMIFS(D_D[INV],D_D[MT],6,D_D[CAT],SMS,D_D[LOC],$A16),0))","v":75390},{"$f":"IF(ISNA($A16),\"\",IFERROR(SUMIFS(D_D[BL],D_D[MT],6,D_D[CAT],SMS,D_D[LOC],$A16),0))","v":22404},0.29717469160366095,{"$f":"IF(ISNA($A16),\"\",IFERROR(SUMIFS(D_D[ADP],D_D[MT],6,D_D[CAT],SMS,D_D[LOC],$A16),0))","v":105.25},{"$f":"IF(ISNA($A16),\"\",IFERROR(SUMIFS(D_D[PROD_MTD],D_D[MT],6,D_D[CAT],SMS,D_D[LOC],$A16),0))","v":2335},{"$f":"IF(ISNA($A16),\"\",IFERROR(SUMIFS(D_D[ADCM],D_D[MT],6,D_D[CAT],SMS,D_D[LOC],$A16),0))","v":128.84},{"$f":"IF(ISNA($A16),\"\",IFERROR(SUMIFS(D_D[PROD_FYTD],D_D[MT],6,D_D[CAT],SMS,D_D[LOC],$A16),0))","v":129546},{"$f":"IF(ISNA($A16),\"\",IFERROR(SUMIFS(D_D[ADCF],D_D[MT],6,D_D[CAT],SMS,D_D[LOC],$A16),0))","v":127.67}]
["HI",5,"Hawaii",{"$f":"IF(ISNA($A17),\"\",IFERROR(SUMIFS(D_D[INV],D_D[MT],6,D_D[CAT],SMS,D_D[LOC],$A17),0))","v":6130},{"$f":"IF(ISNA($A17),\"\",IFERROR(SUMIFS(D_D[BL],D_D[MT],6,D_D[CAT],SMS,D_D[LOC],$A17),0))","v":1874},0.30570962479608482,{"$f":"IF(ISNA($A17),\"\",IFERROR(SUMIFS(D_D[ADP],D_D[MT],6,D_D[CAT],SMS,D_D[LOC],$A17),0))","v":106.89},{"$f":"IF(ISNA($A17),\"\",IFERROR(SUMIFS(D_D[PROD_MTD],D_D[MT],6,D_D[CAT],SMS,D_D[LOC],$A17),0))","v":189},{"$f":"IF(ISNA($A17),\"\",IFERROR(SUMIFS(D_D[ADCM],D_D[MT],6,D_D[CAT],SMS,D_D[LOC],$A17),0))","v":126.14},{"$f":"IF(ISNA($A17),\"\",IFERROR(SUMIFS(D_D[PROD_FYTD],D_D[MT],6,D_D[CAT],SMS,D_D[LOC],$A17),0))","v":10166},{"$f":"IF(ISNA($A17),\"\",IFERROR(SUMIFS(D_D[ADCF],D_D[MT],6,D_D[CAT],SMS,D_D[LOC],$A17),0))","v":122.77}]
["ID",6,"Idaho",{"$f":"IF(ISNA($A18),\"\",IFERROR(SUMIFS(D_D[INV],D_D[MT],6,D_D[CAT],SMS,D_D[LOC],$A18),0))","v":5329},{"$f":"IF(ISNA($A18),\"\",IFERROR(SUMIFS(D_D[BL],D_D[MT],6,D_D[CAT],SMS,D_D[LOC],$A18),0))","v":1565},0.29367611184087072,{"$f":"IF(ISNA($A18),\"\",IFERROR(SUMIFS(D_D[ADP],D_D[MT],6,D_D[CAT],SMS,D_D[LOC],$A18),0))","v":105.36},{"$f":"IF(ISNA($A18),\"\",IFERROR(SUMIFS(D_D[PROD_MTD],D_D[MT],6,D_D[CAT],SMS,D_D[LOC],$A18),0))","v":174},{"$f":"IF(ISNA($A18),\"\",IFERROR(SUMIFS(D_D[ADCM],D_D[MT],6,D_D[CAT],SMS,D_D[LOC],$A18),0))","v":142.43},{"$f":"IF(ISNA($A18),\"\",IFERROR(SUMIFS(D_D[PROD_FYTD],D_D[MT],6,D_D[CAT],SMS,D_D[LOC],$A18),0))","v":9530},{"$f":"IF(ISNA($A18),\"\",IFERROR(SUMIFS(D_D[ADCF],D_D[MT],6,D_D[CAT],SMS,D_D[LOC],$A18),0))","v":133.24}]
["NV",7,"Nevada",{"$f":"IF(ISNA($A19),\"\",IFERROR(SUMIFS(D_D[INV],D_D[MT],6,D_D[CAT],SMS,D_D[LOC],$A19),0))","v":12937},{"$f":"IF(ISNA($A19),\"\",IFERROR(SUMIFS(D_D[BL],D_D[MT],6,D_D[CAT],SMS,D_D[LOC],$A19),0))","v":4044},0.31259179098709128,{"$f":"IF(ISNA($A19),\"\",IFERROR(SUMIFS(D_D[ADP],D_D[MT],6,D_D[CAT],SMS,D_D[LOC],$A19),0))","v":107.96},{"$f":"IF(ISNA($A19),\"\",IFERROR(SUMIFS(D_D[PROD_MTD],D_D[MT],6,D_D[CAT],SMS,D_D[LOC],$A19),0))","v":404},{"$f":"IF(ISNA($A19),\"\",IFERROR(SUMIFS(D_D[ADCM],D_D[MT],6,D_D[CAT],SMS,D_D[LOC],$A19),0))","v":136.68},{"$f":"IF(ISNA($A19),\"\",IFERROR(SUMIFS(D_D[PROD_FYTD],D_D[MT],6,D_D[CAT],SMS,D_D[LOC],$A19),0))","v":20846},{"$f":"IF(ISNA($A19),\"\",IFERROR(SUMIFS(D_D[ADCF],D_D[MT],6,D_D[CAT],SMS,D_D[LOC],$A19),0))","v":137.15}]
["NM",8,"New Mexico",{"$f":"IF(ISNA($A20),\"\",IFERROR(SUMIFS(D_D[INV],D_D[MT],6,D_D[CAT],SMS,D_D[LOC],$A20),0))","v":7122},{"$f":"IF(ISNA($A20),\"\",IFERROR(SUMIFS(D_D[BL],D_D[MT],6,D_D[CAT],SMS,D_D[LOC],$A20),0))","v":2347},0.32954226340915471,{"$f":"IF(ISNA($A20),\"\",IFERROR(SUMIFS(D_D[ADP],D_D[MT],6,D_D[CAT],SMS,D_D[LOC],$A20),0))","v":108.81},{"$f":"IF(ISNA($A20),\"\",IFERROR(SUMIFS(D_D[PROD_MTD],D_D[MT],6,D_D[CAT],SMS,D_D[LOC],$A20),0))","v":184},{"$f":"IF(ISNA($A20),\"\",IFERROR(SUMIFS(D_D[ADCM],D_D[MT],6,D_D[CAT],SMS,D_D[LOC],$A20),0))","v":135.51},{"$f":"IF(ISNA($A20),\"\",IFERROR(SUMIFS(D_D[PROD_FYTD],D_D[MT],6,D_D[CAT],SMS,D_D[LOC],$A20),0))","v":10775},{"$f":"IF(ISNA($A20),\"\",IFERROR(SUMIFS(D_D[ADCF],D_D[MT],6,D_D[CAT],SMS,D_D[LOC],$A20),0))","v":137.94999999999999}]
["OR",9,"Oregon",{"$f":"IF(ISNA($A21),\"\",IFERROR(SUMIFS(D_D[INV],D_D[MT],6,D_D[CAT],SMS,D_D[LOC],$A21),0))","v":9706},{"$f":"IF(ISNA($A21),\"\",IFERROR(SUMIFS(D_D[BL],D_D[MT],6,D_D[CAT],SMS,D_D[LOC],$A21),0))","v":3014},0.31052956933855347,{"$f":"IF(ISNA($A21),\"\",IFERROR(SUMIFS(D_D[ADP],D_D[MT],6,D_D[CAT],SMS,D_D[LOC],$A21),0))","v":108.74},{"$f":"IF(ISNA($A21),\"\",IFERROR(SUMIFS(D_D[PROD_MTD],D_D[MT],6,D_D[CAT],SMS,D_D[LOC],$A21),0))","v":269},{"$f":"IF(ISNA($A21),\"\",IFERROR(SUMIFS(D_D[ADCM],D_D[MT],6,D_D[CAT],SMS,D_D[LOC],$A21),0))","v":137.15},{"$f":"IF(ISNA($A21),\"\",IFERROR(SUMIFS(D_D[PROD_FYTD],D_D[MT],6,D_D[CAT],SMS,D_D[LOC],$A21),0))","v":17838},{"$f":"IF(ISNA($A21),\"\",IFERROR(SUMIFS(D_D[ADCF],D_D[MT],6,D_D[CAT],SMS,D_D[LOC],$A21),0))","v":137.82}]
["PI",10,"Philippines",{"$f":"IF(ISNA($A22),\"\",IFERROR(SUMIFS(D_D[INV],D_D[MT],6,D_D[CAT],SMS,D_D[LOC],$A22),0))","v":2},{"$f":"IF(ISNA($A22),\"\",IFERROR(SUMIFS(D_D[BL],D_D[MT],6,D_D[CAT],SMS,D_D[LOC],$A22),0))","v":0},0,{"$f":"IF(ISNA($A22),\"\",IFERROR(SUMIFS(D_D[ADP],D_D[MT],6,D_D[CAT],SMS,D_D[LOC],$A22),0))","v":110},{"$f":"IF(ISNA($A22),\"\",IFERROR(SUMIFS(D_D[PROD_MTD],D_D[MT],6,D_D[CAT],SMS,D_D[LOC],$A22),0))","v":0},{"$f":"IF(ISNA($A22),\"\",IFERROR(SUMIFS(D_D[ADCM],D_D[MT],6,D_D[CAT],SMS,D_D[LOC],$A22),0))","v":0},{"$f":"IF(ISNA($A22),\"\",IFERROR(SUMIFS(D_D[PROD_FYTD],D_D[MT],6,D_D[CAT],SMS,D_D[LOC],$A22),0))","v":0},{"$f":"IF(ISNA($A22),\"\",IFERROR(SUMIFS(D_D[ADCF],D_D[MT],6,D_D[CAT],SMS,D_D[LOC],$A22),0))","v":0}]
["UT",11,"Utah",{"$f":"IF(ISNA($A23),\"\",IFERROR(SUMIFS(D_D[INV],D_D[MT],6,D_D[CAT],SMS,D_D[LOC],$A23),0))","v":6021},{"$f":"IF(ISNA($A23),\"\",IFERROR(SUMIFS(D_D[BL],D_D[MT],6,D_D[CAT],SMS,D_D[LOC],$A23),0))","v":1840},0.30559707689752535,{"$f":"IF(ISNA($A23),\"\",IFERROR(SUMIFS(D_D[ADP],D_D[MT],6,D_D[CAT],SMS,D_D[LOC],$A23),0))","v":104.53},{"$f":"IF(ISNA($A23),\"\",IFERROR(SUMIFS(D_D[PROD_MTD],D_D[MT],6,D_D[CAT],SMS,D_D[LOC],$A23),0))","v":166},{"$f":"IF(ISNA($A23),\"\",IFERROR(SUMIFS(D_D[ADCM],D_D[MT],6,D_D[CAT],SMS,D_D[LOC],$A23),0))","v":135.54},{"$f":"IF(ISNA($A23),\"\",IFERROR(SUMIFS(D_D[PROD_FYTD],D_D[MT],6,D_D[CAT],SMS,D_D[LOC],$A23),0))","v":9232},{"$f":"IF(ISNA($A23),\"\",IFERROR(SUMIFS(D_D[ADCF],D_D[MT],6,D_D[CAT],SMS,D_D[LOC],$A23),0))","v":131.41}]
["WA",12,"Washington",{"$f":"IF(ISNA($A24),\"\",IFERROR(SUMIFS(D_D[INV],D_D[MT],6,D_D[CAT],SMS,D_D[LOC],$A24),0))","v":20511},{"$f":"IF(ISNA($A24),\"\",IFERROR(SUMIFS(D_D[BL],D_D[MT],6,D_D[CAT],SMS,D_D[LOC],$A24),0))","v":6266},0.30549461264687239,{"$f":"IF(ISNA($A24),\"\",IFERROR(SUMIFS(D_D[ADP],D_D[MT],6,D_D[CAT],SMS,D_D[LOC],$A24),0))","v":106.87},{"$f":"IF(ISNA($A24),\"\",IFERROR(SUMIFS(D_D[PROD_MTD],D_D[MT],6,D_D[CAT],SMS,D_D[LOC],$A24),0))","v":624},{"$f":"IF(ISNA($A24),\"\",IFERROR(SUMIFS(D_D[ADCM],D_D[MT],6,D_D[CAT],SMS,D_D[LOC],$A24),0))","v":131.66999999999999},{"$f":"IF(ISNA($A24),\"\",IFERROR(SUMIFS(D_D[PROD_FYTD],D_D[MT],6,D_D[CAT],SMS,D_D[LOC],$A24),0))","v":35025},{"$f":"IF(ISNA($A24),\"\",IFERROR(SUMIFS(D_D[ADCF],D_D[MT],6,D_D[CAT],SMS,D_D[LOC],$A24),0))","v":128.19}]
[{"$error":"#N/A"},13,"",{"$f":"IF(ISNA($A25),\"\",IFERROR(SUMIFS(D_D[INV],D_D[MT],6,D_D[CAT],SMS,D_D[LOC],$A25),0))","v":""},{"$f":"IF(ISNA($A25),\"\",IFERROR(SUMIFS(D_D[BL],D_D[MT],6,D_D[CAT],SMS,D_D[LOC],$A25),0))","v":""},"",{"$f":"IF(ISNA($A25),\"\",IFERROR(SUMIFS(D_D[ADP],D_D[MT],6,D_D[CAT],SMS,D_D[LOC],$A25),0))","v":""},{"$f":"IF(ISNA($A25),\"\",IFERROR(SUMIFS(D_D[PROD_MTD],D_D[MT],6,D_D[CAT],SMS,D_D[LOC],$A25),0))","v":""},{"$f":"IF(ISNA($A25),\"\",IFERROR(SUMIFS(D_D[ADCM],D_D[MT],6,D_D[CAT],SMS,D_D[LOC],$A25),0))","v":""},{"$f":"IF(ISNA($A25),\"\",IFERROR(SUMIFS(D_D[PROD_FYTD],D_D[MT],6,D_D[CAT],SMS,D_D[LOC],$A25),0))","v":""},{"$f":"IF(ISNA($A25),\"\",IFERROR(SUMIFS(D_D[ADCF],D_D[MT],6,D_D[CAT],SMS,D_D[LOC],$A25),0))","v":""}]
[{"$error":"#N/A"},14,"",{"$f":"IF(ISNA($A26),\"\",IFERROR(SUMIFS(D_D[INV],D_D[MT],6,D_D[CAT],SMS,D_D[LOC],$A26),0))","v":""},{"$f":"IF(ISNA($A26),\"\",IFERROR(SUMIFS(D_D[BL],D_D[MT],6,D_D[CAT],SMS,D_D[LOC],$A26),0))","v":""},"",{"$f":"IF(ISNA($A26),\"\",IFERROR(SUMIFS(D_D[ADP],D_D[MT],6,D_D[CAT],SMS,D_D[LOC],$A26),0))","v":""},{"$f":"IF(ISNA($A26),\"\",IFERROR(SUMIFS(D_D[PROD_MTD],D_D[MT],6,D_D[CAT],SMS,D_D[LOC],$A26),0))","v":""},{"$f":"IF(ISNA($A26),\"\",IFERROR(SUMIFS(D_D[ADCM],D_D[MT],6,D_D[CAT],SMS,D_D[LOC],$A26),0))","v":""},{"$f":"IF(ISNA($A26),\"\",IFERROR(SUMIFS(D_D[PROD_FYTD],D_D[MT],6,D_D[CAT],SMS,D_D[LOC],$A26),0))","v":""},{"$f":"IF(ISNA($A26),\"\",IFERROR(SUMIFS(D_D[ADCF],D_D[MT],6,D_D[CAT],SMS,D_D[LOC],$A26),0))","v":""}]
[{"$error":"#N/A"},15,"",{"$f":"IF(ISNA($A27),\"\",IFERROR(SUMIFS(D_D[INV],D_D[MT],6,D_D[CAT],SMS,D_D[LOC],$A27),0))","v":""},{"$f":"IF(ISNA($A27),\"\",IFERROR(SUMIFS(D_D[BL],D_D[MT],6,D_D[CAT],SMS,D_D[LOC],$A27),0))","v":""},"",{"$f":"IF(ISNA($A27),\"\",IFERROR(SUMIFS(D_D[ADP],D_D[MT],6,D_D[CAT],SMS,D_D[LOC],$A27),0))","v":""},{"$f":"IF(ISNA($A27),\"\",IFERROR(SUMIFS(D_D[PROD_MTD],D_D[MT],6,D_D[CAT],SMS,D_D[LOC],$A27),0))","v":""},{"$f":"IF(ISNA($A27),\"\",IFERROR(SUMIFS(D_D[ADCM],D_D[MT],6,D_D[CAT],SMS,D_D[LOC],$A27),0))","v":""},{"$f":"IF(ISNA($A27),\"\",IFERROR(SUMIFS(D_D[PROD_FYTD],D_D[MT],6,D_D[CAT],SMS,D_D[LOC],$A27),0))","v":""},{"$f":"IF(ISNA($A27),\"\",IFERROR(SUMIFS(D_D[ADCF],D_D[MT],6,D_D[CAT],SMS,D_D[LOC],$A27),0))","v":""}]
[{"$error":"#N/A"},16,"",{"$f":"IF(ISNA($A28),\"\",IFERROR(SUMIFS(D_D[INV],D_D[MT],6,D_D[CAT],SMS,D_D[LOC],$A28),0))","v":""},{"$f":"IF(ISNA($A28),\"\",IFERROR(SUMIFS(D_D[BL],D_D[MT],6,D_D[CAT],SMS,D_D[LOC],$A28),0))","v":""},"",{"$f":"IF(ISNA($A28),\"\",IFERROR(SUMIFS(D_D[ADP],D_D[MT],6,D_D[CAT],SMS,D_D[LOC],$A28),0))","v":""},{"$f":"IF(ISNA($A28),\"\",IFERROR(SUMIFS(D_D[PROD_MTD],D_D[MT],6,D_D[CAT],SMS,D_D[LOC],$A28),0))","v":""},{"$f":"IF(ISNA($A28),\"\",IFERROR(SUMIFS(D_D[ADCM],D_D[MT],6,D_D[CAT],SMS,D_D[LOC],$A28),0))","v":""},{"$f":"IF(ISNA($A28),\"\",IFERROR(SUMIFS(D_D[PROD_FYTD],D_D[MT],6,D_D[CAT],SMS,D_D[LOC],$A28),0))","v":""},{"$f":"IF(ISNA($A28),\"\",IFERROR(SUMIFS(D_D[ADCF],D_D[MT],6,D_D[CAT],SMS,D_D[LOC],$A28),0))","v":""}]
[{"$error":"#N/A"},17,"",{"$f":"IF(ISNA($A29),\"\",IFERROR(SUMIFS(D_D[INV],D_D[MT],6,D_D[CAT],SMS,D_D[LOC],$A29),0))","v":""},{"$f":"IF(ISNA($A29),\"\",IFERROR(SUMIFS(D_D[BL],D_D[MT],6,D_D[CAT],SMS,D_D[LOC],$A29),0))","v":""},"",{"$f":"IF(ISNA($A29),\"\",IFERROR(SUMIFS(D_D[ADP],D_D[MT],6,D_D[CAT],SMS,D_D[LOC],$A29),0))","v":""},{"$f":"IF(ISNA($A29),\"\",IFERROR(SUMIFS(D_D[PROD_MTD],D_D[MT],6,D_D[CAT],SMS,D_D[LOC],$A29),0))","v":""},{"$f":"IF(ISNA($A29),\"\",IFERROR(SUMIFS(D_D[ADCM],D_D[MT],6,D_D[CAT],SMS,D_D[LOC],$A29),0))","v":""},{"$f":"IF(ISNA($A29),\"\",IFERROR(SUMIFS(D_D[PROD_FYTD],D_D[MT],6,D_D[CAT],SMS,D_D[LOC],$A29),0))","v":""},{"$f":"IF(ISNA($A29),\"\",IFERROR(SUMIFS(D_D[ADCF],D_D[MT],6,D_D[CAT],SMS,D_D[LOC],$A29),0))","v":""}]
[{"$error":"#N/A"},18,"",{"$f":"IF(ISNA($A30),\"\",IFERROR(SUMIFS(D_D[INV],D_D[MT],6,D_D[CAT],SMS,D_D[LOC],$A30),0))","v":""},{"$f":"IF(ISNA($A30),\"\",IFERROR(SUMIFS(D_D[BL],D_D[MT],6,D_D[CAT],SMS,D_D[LOC],$A30),0))","v":""},"",{"$f":"IF(ISNA($A30),\"\",IFERROR(SUMIFS(D_D[ADP],D_D[MT],6,D_D[CAT],SMS,D_D[LOC],$A30),0))","v":""},{"$f":"IF(ISNA($A30),\"\",IFERROR(SUMIFS(D_D[PROD_MTD],D_D[MT],6,D_D[CAT],SMS,D_D[LOC],$A30),0))","v":""},{"$f":"IF(ISNA($A30),\"\",IFERROR(SUMIFS(D_D[ADCM],D_D[MT],6,D_D[CAT],SMS,D_D[LOC],$A30),0))","v":""},{"$f":"IF(ISNA($A30),\"\",IFERROR(SUMIFS(D_D[PROD_FYTD],D_D[MT],6,D_D[CAT],SMS,D_D[LOC],$A30),0))","v":""},{"$f":"IF(ISNA($A30),\"\",IFERROR(SUMIFS(D_D[ADCF],D_D[MT],6,D_D[CAT],SMS,D_D[LOC],$A30),0))","v":""}]
[{"$error":"#N/A"},19,"",{"$f":"IF(ISNA($A31),\"\",IFERROR(SUMIFS(D_D[INV],D_D[MT],6,D_D[CAT],SMS,D_D[LOC],$A31),0))","v":""},{"$f":"IF(ISNA($A31),\"\",IFERROR(SUMIFS(D_D[BL],D_D[MT],6,D_D[CAT],SMS,D_D[LOC],$A31),0))","v":""},"",{"$f":"IF(ISNA($A31),\"\",IFERROR(SUMIFS(D_D[ADP],D_D[MT],6,D_D[CAT],SMS,D_D[LOC],$A31),0))","v":""},{"$f":"IF(ISNA($A31),\"\",IFERROR(SUMIFS(D_D[PROD_MTD],D_D[MT],6,D_D[CAT],SMS,D_D[LOC],$A31),0))","v":""},{"$f":"IF(ISNA($A31),\"\",IFERROR(SUMIFS(D_D[ADCM],D_D[MT],6,D_D[CAT],SMS,D_D[LOC],$A31),0))","v":""},{"$f":"IF(ISNA($A31),\"\",IFERROR(SUMIFS(D_D[PROD_FYTD],D_D[MT],6,D_D[CAT],SMS,D_D[LOC],$A31),0))","v":""},{"$f":"IF(ISNA($A31),\"\",IFERROR(SUMIFS(D_D[ADCF],D_D[MT],6,D_D[CAT],SMS,D_D[LOC],$A31),0))","v":""}]
[{"$error":"#N/A"},20,"",{"$f":"IF(ISNA($A32),\"\",IFERROR(SUMIFS(D_D[INV],D_D[MT],6,D_D[CAT],SMS,D_D[LOC],$A32),0))","v":""},{"$f":"IF(ISNA($A32),\"\",IFERROR(SUMIFS(D_D[BL],D_D[MT],6,D_D[CAT],SMS,D_D[LOC],$A32),0))","v":""},"",{"$f":"IF(ISNA($A32),\"\",IFERROR(SUMIFS(D_D[ADP],D_D[MT],6,D_D[CAT],SMS,D_D[LOC],$A32),0))","v":""},{"$f":"IF(ISNA($A32),\"\",IFERROR(SUMIFS(D_D[PROD_MTD],D_D[MT],6,D_D[CAT],SMS,D_D[LOC],$A32),0))","v":""},{"$f":"IF(ISNA($A32),\"\",IFERROR(SUMIFS(D_D[ADCM],D_D[MT],6,D_D[CAT],SMS,D_D[LOC],$A32),0))","v":""},{"$f":"IF(ISNA($A32),\"\",IFERROR(SUMIFS(D_D[PROD_FYTD],D_D[MT],6,D_D[CAT],SMS,D_D[LOC],$A32),0))","v":""},{"$f":"IF(ISNA($A32),\"\",IFERROR(SUMIFS(D_D[ADCF],D_D[MT],6,D_D[CAT],SMS,D_D[LOC],$A32),0))","v":""}]
[{"$error":"#N/A"},21,"",{"$f":"IF(ISNA($A33),\"\",IFERROR(SUMIFS(D_D[INV],D_D[MT],6,D_D[CAT],SMS,D_D[LOC],$A33),0))","v":""},{"$f":"IF(ISNA($A33),\"\",IFERROR(SUMIFS(D_D[BL],D_D[MT],6,D_D[CAT],SMS,D_D[LOC],$A33),0))","v":""},"",{"$f":"IF(ISNA($A33),\"\",IFERROR(SUMIFS(D_D[ADP],D_D[MT],6,D_D[CAT],SMS,D_D[LOC],$A33),0))","v":""},{"$f":"IF(ISNA($A33),\"\",IFERROR(SUMIFS(D_D[PROD_MTD],D_D[MT],6,D_D[CAT],SMS,D_D[LOC],$A33),0))","v":""},{"$f":"IF(ISNA($A33),\"\",IFERROR(SUMIFS(D_D[ADCM],D_D[MT],6,D_D[CAT],SMS,D_D[LOC],$A33),0))","v":""},{"$f":"IF(ISNA($A33),\"\",IFERROR(SUMIFS(D_D[PROD_FYTD],D_D[MT],6,D_D[CAT],SMS,D_D[LOC],$A33),0))","v":""},{"$f":"IF(ISNA($A33),\"\",IFERROR(SUMIFS(D_D[ADCF],D_D[MT],6,D_D[CAT],SMS,D_D[LOC],$A33),0))","v":""}]
[{"$error":"#N/A"},22,"",{"$f":"IF(ISNA($A34),\"\",IFERROR(SUMIFS(D_D[INV],D_D[MT],6,D_D[CAT],SMS,D_D[LOC],$A34),0))","v":""},{"$f":"IF(ISNA($A34),\"\",IFERROR(SUMIFS(D_D[BL],D_D[MT],6,D_D[CAT],SMS,D_D[LOC],$A34),0))","v":""},"",{"$f":"IF(ISNA($A34),\"\",IFERROR(SUMIFS(D_D[ADP],D_D[MT],6,D_D[CAT],SMS,D_D[LOC],$A34),0))","v":""},{"$f":"IF(ISNA($A34),\"\",IFERROR(SUMIFS(D_D[PROD_MTD],D_D[MT],6,D_D[CAT],SMS,D_D[LOC],$A34),0))","v":""},{"$f":"IF(ISNA($A34),\"\",IFERROR(SUMIFS(D_D[ADCM],D_D[MT],6,D_D[CAT],SMS,D_D[LOC],$A34),0))","v":""},{"$f":"IF(ISNA($A34),\"\",IFERROR(SUMIFS(D_D[PROD_FYTD],D_D[MT],6,D_D[CAT],SMS,D_D[LOC],$A34),0))","v":""},{"$f":"IF(ISNA($A34),\"\",IFERROR(SUMIFS(D_D[ADCF],D_D[MT],6,D_D[CAT],SMS,D_D[LOC],$A34),0))","v":""}]
[{"$error":"#N/A"},23,"",{"$f":"IF(ISNA($A35),\"\",IFERROR(SUMIFS(D_D[INV],D_D[MT],6,D_D[CAT],SMS,D_D[LOC],$A35),0))","v":""},{"$f":"IF(ISNA($A35),\"\",IFERROR(SUMIFS(D_D[BL],D_D[MT],6,D_D[CAT],SMS,D_D[LOC],$A35),0))","v":""},"",{"$f":"IF(ISNA($A35),\"\",IFERROR(SUMIFS(D_D[ADP],D_D[MT],6,D_D[CAT],SMS,D_D[LOC],$A35),0))","v":""},{"$f":"IF(ISNA($A35),\"\",IFERROR(SUMIFS(D_D[PROD_MTD],D_D[MT],6,D_D[CAT],SMS,D_D[LOC],$A35),0))","v":""},{"$f":"IF(ISNA($A35),\"\",IFERROR(SUMIFS(D_D[ADCM],D_D[MT],6,D_D[CAT],SMS,D_D[LOC],$A35),0))","v":""},{"$f":"IF(ISNA($A35),\"\",IFERROR(SUMIFS(D_D[PROD_FYTD],D_D[MT],6,D_D[CAT],SMS,D_D[LOC],$A35),0))","v":""},{"$f":"IF(ISNA($A35),\"\",IFERROR(SUMIFS(D_D[ADCF],D_D[MT],6,D_D[CAT],SMS,D_D[LOC],$A35),0))","v":""}]

{"sheet":"Rating Bundle - SOJ - NWQ","index":8,"n_rows":36,"n_cols":12,"rows_kept":36,"cut":false,"hidden":false,"merged":[[5,9,5,11],[8,3,10,3],[8,4,10,4],[8,5,10,5],[8,6,10,6],[7,3,7,6],[7,7,7,11],[6,3,6,8],[1,9,1,11],[2,9,2,11],[8,11,10,11],[8,7,10,7],[8,8,10,8],[1,3,1,8],[2,3,2,8],[5,3,5,8],[3,3,3,8],[4,3,4,8],[8,9,10,9],[8,10,10,10]]}
[]
[null,null,"DISTRICT SELECTOR","Compensation and Pension Rating Bundle Metrics",null,null,null,null,null,"Report through"]
[null,null,null,"NWQ-Station of Jurisdiction View",null,null,null,null,null,{"$f":"D_DT[]","v":"2023-08-05"}]
[null,null,null,"The Station of Jurisdiction (SOJ)  is the regional office assigned to work the claim",null,null,null,null,null,"ADP = Average Days Pending"]
[null,null,null,"Each Special Mission has distinct claim counts"]
[null,null,null,"When Special Mission is set to Pension, BDD, or Quickstart, the District Selector has",null,null,null,null,null,"Life Cycle Metrics defined on Legend tab"]
[null,null,null,"no impact"]
[null,null,null,"CLAIM METRICS",null,null,null,"LIFE CYCLE METRICS (as Percent of # Pending)"]
[null,null,"SPECIAL MISSION SELECTOR","#\nPending","#\nPending\n> 125 Days","%\nPending\n> 125 Days","ADP","Pending Development","Pending Evidence","Pending Decision","Pending Award","Pending Authorization"]
[]
[]
[100,null,{"$f":"Driver!$C$20& \" Total\"","v":"USA - All Missions Total"},{"$f":"IF(ISNA($A12),\"\",IFERROR(SUMIFS(D_D[INV],D_D[MT],5,D_D[CAT],SMS, D_D[EP],-1,D_D[LOC],$A12),0))","v":944142},{"$f":"IF(ISNA($A12),\"\",IFERROR(SUMIFS(D_D[BL],D_D[MT],5,D_D[CAT],SMS, D_D[EP],-1,D_D[LOC],$A12),0))","v":272525},{"$f":"IF(ISNA($A12),\"\",IFERROR(E12/D12,0))","v":0.28864831773186661},{"$f":"IF(ISNA($A12),\"\",IFERROR(SUMIFS(D_D[ADP],D_D[MT],5,D_D[CAT],SMS, D_D[EP],-1,D_D[LOC],$A12),0))","v":101.95},{"$f":"IF(ISNA($A12),\"\",IFERROR(SUMIFS(D_D[DEV],D_D[MT],5,D_D[CAT],SMS, D_D[EP],-1,D_D[LOC],$A12)/$D12,0))","v":0.16810183213965696},{"$f":"IF(ISNA($A12),\"\",IFERROR(SUMIFS(D_D[EVD],D_D[MT],5,D_D[CAT],SMS, D_D[EP],-1,D_D[LOC],$A12)/$D12,0))","v":0.72276098298772851},{"$f":"IF(ISNA($A12),\"\",IFERROR(SUMIFS(D_D[DEC],D_D[MT],5,D_D[CAT],SMS, D_D[EP],-1,D_D[LOC],$A12)/$D12,0))","v":9.9081494097286213E-2},{"$f":"IF(ISNA($A12),\"\",IFERROR(SUMIFS(D_D[AWD],D_D[MT],5,D_D[CAT],SMS, D_D[EP],-1,D_D[LOC],$A12)/$D12,0))","v":7.1281650429702312E-3},{"$f":"IF(ISNA($A12),\"\",IFERROR(SUMIFS(D_D[AUT],D_D[MT],5,D_D[CAT],SMS, D_D[EP],-1,D_D[LOC],$A12)/$D12,0))","v":2.9275257323580564E-3}]
[499,null,{"$f":"\"NWQ-\"&Driver!$C$20& \" Total\"","v":"NWQ-USA - All Missions Total"},{"$f":"IF(ISNA($A13),\"\",IFERROR(SUMIFS(D_D[INV],D_D[MT],5,D_D[CAT],SMS, D_D[EP],-1,D_D[LOC],$A13),0))","v":763629},{"$f":"IF(ISNA($A13),\"\",IFERROR(SUMIFS(D_D[BL],D_D[MT],5,D_D[CAT],SMS, D_D[EP],-1,D_D[LOC],$A13),0))","v":215081},{"$f":"IF(ISNA($A13),\"\",IFERROR(E13/D13,0))","v":0.28165640644868123},{"$f":"IF(ISNA($A13),\"\",IFERROR(SUMIFS(D_D[ADP],D_D[MT],5,D_D[CAT],SMS, D_D[EP],-1,D_D[LOC],$A13),0))","v":101.43},{"$f":"IF(ISNA($A13),\"\",IFERROR(SUMIFS(D_D[DEV],D_D[MT],5,D_D[CAT],SMS, D_D[EP],-1,D_D[LOC],$A13)/$D13,0))","v":0.13743584908378284},{"$f":"IF(ISNA($A13),\"\",IFERROR(SUMIFS(D_D[EVD],D_D[MT],5,D_D[CAT],SMS, D_D[EP],-1,D_D[LOC],$A13)/$D13,0))","v":0.79152834688048779},{"$f":"IF(ISNA($A13),\"\",IFERROR(SUMIFS(D_D[DEC],D_D[MT],5,D_D[CAT],SMS, D_D[EP],-1,D_D[LOC],$A13)/$D13,0))","v":7.0564370918338615E-2},{"$f":"IF(ISNA($A13),\"\",IFERROR(SUMIFS(D_D[AWD],D_D[MT],5,D_D[CAT],SMS, D_D[EP],-1,D_D[LOC],$A13)/$D13,0))","v":4.7012358095357824E-4},{"$f":"IF(ISNA($A13),\"\",IFERROR(SUMIFS(D_D[AUT],D_D[MT],5,D_D[CAT],SMS, D_D[EP],-1,D_D[LOC],$A13)/$D13,0))","v":1.3095364371965968E-6}]
[{"$f":"INDEX(RO,(MATCH($C14,RO_D,0)))","v":"395"},1,{"$f":"IFERROR(INDEX(INDIRECT(DS_RO),B14),\"\")","v":"Pacific District"},{"$f":"IF(ISNA($A14),\"\",IFERROR(SUMIFS(D_D[INV],D_D[MT],5,D_D[CAT],SMS, D_D[EP],-1,D_D[LOC],$A14),0))","v":34382},{"$f":"IF(ISNA($A14),\"\",IFERROR(SUMIFS(D_D[BL],D_D[MT],5,D_D[CAT],SMS, D_D[EP],-1,D_D[LOC],$A14),0))","v":10802},{"$f":"IF(ISNA($A14),\"\",IFERROR(E14/D14,0))","v":0.31417602233726949},{"$f":"IF(ISNA($A14),\"\",IFERROR(SUMIFS(D_D[ADP],D_D[MT],5,D_D[CAT],SMS, D_D[EP],-1,D_D[LOC],$A14),0))","v":104.51},{"$f":"IF(ISNA($A14),\"\",IFERROR(SUMIFS(D_D[DEV],D_D[MT],5,D_D[CAT],SMS, D_D[EP],-1,D_D[LOC],$A14)/$D14,0))","v":0.27889593391891104},{"$f":"IF(ISNA($A14),\"\",IFERROR(SUMIFS(D_D[EVD],D_D[MT],5,D_D[CAT],SMS, D_D[EP],-1,D_D[LOC],$A14)/$D14,0))","v":0.433511721249491},{"$f":"IF(ISNA($A14),\"\",IFERROR(SUMIFS(D_D[DEC],D_D[MT],5,D_D[CAT],SMS, D_D[EP],-1,D_D[LOC],$A14)/$D14,0))","v":0.23076028154266767},{"$f":"IF(ISNA($A14),\"\",IFERROR(SUMIFS(D_D[AWD],D_D[MT],5,D_D[CAT],SMS, D_D[EP],-1,D_D[LOC],$A14)/$D14,0))","v":4.3074864754813563E-2},{"$f":"IF(ISNA($A14),\"\",IFERROR(SUMIFS(D_D[AUT],D_D[MT],5,D_D[CAT],SMS, D_D[EP],-1,D_D[LOC],$A14)/$D14,0))","v":1.3757198534116688E-2}]
["340",2,{"$f":"IFERROR(INDEX(INDIRECT(DS_RO),B15),\"\")","v":"Albuquerque"},{"$f":"IF(ISNA($A15),\"\",IFERROR(SUMIFS(D_D[INV],D_D[MT],5,D_D[CAT],SMS, D_D[EP],-1,D_D[LOC],$A15),0))","v":1330},{"$f":"IF(ISNA($A15),\"\",IFERROR(SUMIFS(D_D[BL],D_D[MT],5,D_D[CAT],SMS, D_D[EP],-1,D_D[LOC],$A15),0))","v":350},{"$f":"IF(ISNA($A15),\"\",IFERROR(E15/D15,0))","v":0.26315789473684209},{"$f":"IF(ISNA($A15),\"\",IFERROR(SUMIFS(D_D[ADP],D_D[MT],5,D_D[CAT],SMS, D_D[EP],-1,D_D[LOC],$A15),0))","v":84.79},{"$f":"IF(ISNA($A15),\"\",IFERROR(SUMIFS(D_D[DEV],D_D[MT],5,D_D[CAT],SMS, D_D[EP],-1,D_D[LOC],$A15)/$D15,0))","v":0.3398496240601504},{"$f":"IF(ISNA($A15),\"\",IFERROR(SUMIFS(D_D[EVD],D_D[MT],5,D_D[CAT],SMS, D_D[EP],-1,D_D[LOC],$A15)/$D15,0))","v":0.48571428571428571},{"$f":"IF(ISNA($A15),\"\",IFERROR(SUMIFS(D_D[DEC],D_D[MT],5,D_D[CAT],SMS, D_D[EP],-1,D_D[LOC],$A15)/$D15,0))","v":0.1368421052631579},{"$f":"IF(ISNA($A15),\"\",IFERROR(SUMIFS(D_D[AWD],D_D[MT],5,D_D[CAT],SMS, D_D[EP],-1,D_D[LOC],$A15)/$D15,0))","v":3.308270676691729E-2},{"$f":"IF(ISNA($A15),\"\",IFERROR(SUMIFS(D_D[AUT],D_D[MT],5,D_D[CAT],SMS, D_D[EP],-1,D_D[LOC],$A15)/$D15,0))","v":4.5112781954887221E-3}]
["463",3,"Anchorage",{"$f":"IF(ISNA($A16),\"\",IFERROR(SUMIFS(D_D[INV],D_D[MT],5,D_D[CAT],SMS, D_D[EP],-1,D_D[LOC],$A16),0))","v":451},{"$f":"IF(ISNA($A16),\"\",IFERROR(SUMIFS(D_D[BL],D_D[MT],5,D_D[CAT],SMS, D_D[EP],-1,D_D[LOC],$A16),0))","v":131},0.29046563192904656,{"$f":"IF(ISNA($A16),\"\",IFERROR(SUMIFS(D_D[ADP],D_D[MT],5,D_D[CAT],SMS, D_D[EP],-1,D_D[LOC],$A16),0))","v":93.55},{"$f":"IF(ISNA($A16),\"\",IFERROR(SUMIFS(D_D[DEV],D_D[MT],5,D_D[CAT],SMS, D_D[EP],-1,D_D[LOC],$A16)/$D16,0))","v":0.27716186252771619},{"$f":"IF(ISNA($A16),\"\",IFERROR(SUMIFS(D_D[EVD],D_D[MT],5,D_D[CAT],SMS, D_D[EP],-1,D_D[LOC],$A16)/$D16,0))","v":0.49667405764966743},{"$f":"IF(ISNA($A16),\"\",IFERROR(SUMIFS(D_D[DEC],D_D[MT],5,D_D[CAT],SMS, D_D[EP],-1,D_D[LOC],$A16)/$D16,0))","v":0.18625277161862527},{"$f":"IF(ISNA($A16),\"\",IFERROR(SUMIFS(D_D[AWD],D_D[MT],5,D_D[CAT],SMS, D_D[EP],-1,D_D[LOC],$A16)/$D16,0))","v":3.325942350332594E-2},{"$f":"IF(ISNA($A16),\"\",IFERROR(SUMIFS(D_D[AUT],D_D[MT],5,D_D[CAT],SMS, D_D[EP],-1,D_D[LOC],$A16)/$D16,0))","v":6.6518847006651885E-3}]
["347",4,"Boise",{"$f":"IF(ISNA($A17),\"\",IFERROR(SUMIFS(D_D[INV],D_D[MT],5,D_D[CAT],SMS, D_D[EP],-1,D_D[LOC],$A17),0))","v":1108},{"$f":"IF(ISNA($A17),\"\",IFERROR(SUMIFS(D_D[BL],D_D[MT],5,D_D[CAT],SMS, D_D[EP],-1,D_D[LOC],$A17),0))","v":467},0.42148014440433212,{"$f":"IF(ISNA($A17),\"\",IFERROR(SUMIFS(D_D[ADP],D_D[MT],5,D_D[CAT],SMS, D_D[EP],-1,D_D[LOC],$A17),0))","v":108.79},{"$f":"IF(ISNA($A17),\"\",IFERROR(SUMIFS(D_D[DEV],D_D[MT],5,D_D[CAT],SMS, D_D[EP],-1,D_D[LOC],$A17)/$D17,0))","v":0.13628158844765342},{"$f":"IF(ISNA($A17),\"\",IFERROR(SUMIFS(D_D[EVD],D_D[MT],5,D_D[CAT],SMS, D_D[EP],-1,D_D[LOC],$A17)/$D17,0))","v":0.28790613718411551},{"$f":"IF(ISNA($A17),\"\",IFERROR(SUMIFS(D_D[DEC],D_D[MT],5,D_D[CAT],SMS, D_D[EP],-1,D_D[LOC],$A17)/$D17,0))","v":0.36281588447653429},{"$f":"IF(ISNA($A17),\"\",IFERROR(SUMIFS(D_D[AWD],D_D[MT],5,D_D[CAT],SMS, D_D[EP],-1,D_D[LOC],$A17)/$D17,0))","v":0.1164259927797834},{"$f":"IF(ISNA($A17),\"\",IFERROR(SUMIFS(D_D[AUT],D_D[MT],5,D_D[CAT],SMS, D_D[EP],-1,D_D[LOC],$A17)/$D17,0))","v":9.6570397111913356E-2}]
["459",5,"Honolulu",{"$f":"IF(ISNA($A18),\"\",IFERROR(SUMIFS(D_D[INV],D_D[MT],5,D_D[CAT],SMS, D_D[EP],-1,D_D[LOC],$A18),0))","v":848},{"$f":"IF(ISNA($A18),\"\",IFERROR(SUMIFS(D_D[BL],D_D[MT],5,D_D[CAT],SMS, D_D[EP],-1,D_D[LOC],$A18),0))","v":250},0.294811320754717,{"$f":"IF(ISNA($A18),\"\",IFERROR(SUMIFS(D_D[ADP],D_D[MT],5,D_D[CAT],SMS, D_D[EP],-1,D_D[LOC],$A18),0))","v":95.19},{"$f":"IF(ISNA($A18),\"\",IFERROR(SUMIFS(D_D[DEV],D_D[MT],5,D_D[CAT],SMS, D_D[EP],-1,D_D[LOC],$A18)/$D18,0))","v":0.30188679245283018},{"$f":"IF(ISNA($A18),\"\",IFERROR(SUMIFS(D_D[EVD],D_D[MT],5,D_D[CAT],SMS, D_D[EP],-1,D_D[LOC],$A18)/$D18,0))","v":0.42806603773584906},{"$f":"IF(ISNA($A18),\"\",IFERROR(SUMIFS(D_D[DEC],D_D[MT],5,D_D[CAT],SMS, D_D[EP],-1,D_D[LOC],$A18)/$D18,0))","v":0.24174528301886791},{"$f":"IF(ISNA($A18),\"\",IFERROR(SUMIFS(D_D[AWD],D_D[MT],5,D_D[CAT],SMS, D_D[EP],-1,D_D[LOC],$A18)/$D18,0))","v":2.8301886792452831E-2},{"$f":"IF(ISNA($A18),\"\",IFERROR(SUMIFS(D_D[AUT],D_D[MT],5,D_D[CAT],SMS, D_D[EP],-1,D_D[LOC],$A18)/$D18,0))","v":0}]
["344",6,"Los Angeles",{"$f":"IF(ISNA($A19),\"\",IFERROR(SUMIFS(D_D[INV],D_D[MT],5,D_D[CAT],SMS, D_D[EP],-1,D_D[LOC],$A19),0))","v":3643},{"$f":"IF(ISNA($A19),\"\",IFERROR(SUMIFS(D_D[BL],D_D[MT],5,D_D[CAT],SMS, D_D[EP],-1,D_D[LOC],$A19),0))","v":773},0.21218775734284931,{"$f":"IF(ISNA($A19),\"\",IFERROR(SUMIFS(D_D[ADP],D_D[MT],5,D_D[CAT],SMS, D_D[EP],-1,D_D[LOC],$A19),0))","v":99.95},{"$f":"IF(ISNA($A19),\"\",IFERROR(SUMIFS(D_D[DEV],D_D[MT],5,D_D[CAT],SMS, D_D[EP],-1,D_D[LOC],$A19)/$D19,0))","v":0.33982981059566292},{"$f":"IF(ISNA($A19),\"\",IFERROR(SUMIFS(D_D[EVD],D_D[MT],5,D_D[CAT],SMS, D_D[EP],-1,D_D[LOC],$A19)/$D19,0))","v":0.45429590996431513},{"$f":"IF(ISNA($A19),\"\",IFERROR(SUMIFS(D_D[DEC],D_D[MT],5,D_D[CAT],SMS, D_D[EP],-1,D_D[LOC],$A19)/$D19,0))","v":0.19544331594839418},{"$f":"IF(ISNA($A19),\"\",IFERROR(SUMIFS(D_D[AWD],D_D[MT],5,D_D[CAT],SMS, D_D[EP],-1,D_D[LOC],$A19)/$D19,0))","v":3.8429865495470767E-3},{"$f":"IF(ISNA($A19),\"\",IFERROR(SUMIFS(D_D[AUT],D_D[MT],5,D_D[CAT],SMS, D_D[EP],-1,D_D[LOC],$A19)/$D19,0))","v":6.5879769420807031E-3}]
["358",7,"Manila",{"$f":"IF(ISNA($A20),\"\",IFERROR(SUMIFS(D_D[INV],D_D[MT],5,D_D[CAT],SMS, D_D[EP],-1,D_D[LOC],$A20),0))","v":512},{"$f":"IF(ISNA($A20),\"\",IFERROR(SUMIFS(D_D[BL],D_D[MT],5,D_D[CAT],SMS, D_D[EP],-1,D_D[LOC],$A20),0))","v":173},0.337890625,{"$f":"IF(ISNA($A20),\"\",IFERROR(SUMIFS(D_D[ADP],D_D[MT],5,D_D[CAT],SMS, D_D[EP],-1,D_D[LOC],$A20),0))","v":114.54},{"$f":"IF(ISNA($A20),\"\",IFERROR(SUMIFS(D_D[DEV],D_D[MT],5,D_D[CAT],SMS, D_D[EP],-1,D_D[LOC],$A20)/$D20,0))","v":0.287109375},{"$f":"IF(ISNA($A20),\"\",IFERROR(SUMIFS(D_D[EVD],D_D[MT],5,D_D[CAT],SMS, D_D[EP],-1,D_D[LOC],$A20)/$D20,0))","v":0.33203125},{"$f":"IF(ISNA($A20),\"\",IFERROR(SUMIFS(D_D[DEC],D_D[MT],5,D_D[CAT],SMS, D_D[EP],-1,D_D[LOC],$A20)/$D20,0))","v":0.322265625},{"$f":"IF(ISNA($A20),\"\",IFERROR(SUMIFS(D_D[AWD],D_D[MT],5,D_D[CAT],SMS, D_D[EP],-1,D_D[LOC],$A20)/$D20,0))","v":5.2734375E-2},{"$f":"IF(ISNA($A20),\"\",IFERROR(SUMIFS(D_D[AUT],D_D[MT],5,D_D[CAT],SMS, D_D[EP],-1,D_D[LOC],$A20)/$D20,0))","v":5.859375E-3}]
["343",8,"Oakland",{"$f":"IF(ISNA($A21),\"\",IFERROR(SUMIFS(D_D[INV],D_D[MT],5,D_D[CAT],SMS, D_D[EP],-1,D_D[LOC],$A21),0))","v":2055},{"$f":"IF(ISNA($A21),\"\",IFERROR(SUMIFS(D_D[BL],D_D[MT],5,D_D[CAT],SMS, D_D[EP],-1,D_D[LOC],$A21),0))","v":503},0.24476885644768856,{"$f":"IF(ISNA($A21),\"\",IFERROR(SUMIFS(D_D[ADP],D_D[MT],5,D_D[CAT],SMS, D_D[EP],-1,D_D[LOC],$A21),0))","v":84.13},{"$f":"IF(ISNA($A21),\"\",IFERROR(SUMIFS(D_D[DEV],D_D[MT],5,D_D[CAT],SMS, D_D[EP],-1,D_D[LOC],$A21)/$D21,0))","v":0.37226277372262773},{"$f":"IF(ISNA($A21),\"\",IFERROR(SUMIFS(D_D[EVD],D_D[MT],5,D_D[CAT],SMS, D_D[EP],-1,D_D[LOC],$A21)/$D21,0))","v":0.4043795620437956},{"$f":"IF(ISNA($A21),\"\",IFERROR(SUMIFS(D_D[DEC],D_D[MT],5,D_D[CAT],SMS, D_D[EP],-1,D_D[LOC],$A21)/$D21,0))","v":0.19854014598540146},{"$f":"IF(ISNA($A21),\"\",IFERROR(SUMIFS(D_D[AWD],D_D[MT],5,D_D[CAT],SMS, D_D[EP],-1,D_D[LOC],$A21)/$D21,0))","v":1.8491484184914843E-2},{"$f":"IF(ISNA($A21),\"\",IFERROR(SUMIFS(D_D[AUT],D_D[MT],5,D_D[CAT],SMS, D_D[EP],-1,D_D[LOC],$A21)/$D21,0))","v":6.3260340632603409E-3}]
["345",9,"Phoenix",{"$f":"IF(ISNA($A22),\"\",IFERROR(SUMIFS(D_D[INV],D_D[MT],5,D_D[CAT],SMS, D_D[EP],-1,D_D[LOC],$A22),0))","v":4699},{"$f":"IF(ISNA($A22),\"\",IFERROR(SUMIFS(D_D[BL],D_D[MT],5,D_D[CAT],SMS, D_D[EP],-1,D_D[LOC],$A22),0))","v":1821},0.38752926154500955,{"$f":"IF(ISNA($A22),\"\",IFERROR(SUMIFS(D_D[ADP],D_D[MT],5,D_D[CAT],SMS, D_D[EP],-1,D_D[LOC],$A22),0))","v":122.92},{"$f":"IF(ISNA($A22),\"\",IFERROR(SUMIFS(D_D[DEV],D_D[MT],5,D_D[CAT],SMS, D_D[EP],-1,D_D[LOC],$A22)/$D22,0))","v":0.2907001489678655},{"$f":"IF(ISNA($A22),\"\",IFERROR(SUMIFS(D_D[EVD],D_D[MT],5,D_D[CAT],SMS, D_D[EP],-1,D_D[LOC],$A22)/$D22,0))","v":0.48563524154075333},{"$f":"IF(ISNA($A22),\"\",IFERROR(SUMIFS(D_D[DEC],D_D[MT],5,D_D[CAT],SMS, D_D[EP],-1,D_D[LOC],$A22)/$D22,0))","v":0.18663545435198978},{"$f":"IF(ISNA($A22),\"\",IFERROR(SUMIFS(D_D[AWD],D_D[MT],5,D_D[CAT],SMS, D_D[EP],-1,D_D[LOC],$A22)/$D22,0))","v":2.9155139391359865E-2},{"$f":"IF(ISNA($A22),\"\",IFERROR(SUMIFS(D_D[AUT],D_D[MT],5,D_D[CAT],SMS, D_D[EP],-1,D_D[LOC],$A22)/$D22,0))","v":7.874015748031496E-3}]
["348",10,"Portland",{"$f":"IF(ISNA($A23),\"\",IFERROR(SUMIFS(D_D[INV],D_D[MT],5,D_D[CAT],SMS, D_D[EP],-1,D_D[LOC],$A23),0))","v":2253},{"$f":"IF(ISNA($A23),\"\",IFERROR(SUMIFS(D_D[BL],D_D[MT],5,D_D[CAT],SMS, D_D[EP],-1,D_D[LOC],$A23),0))","v":739},0.32800710164225477,{"$f":"IF(ISNA($A23),\"\",IFERROR(SUMIFS(D_D[ADP],D_D[MT],5,D_D[CAT],SMS, D_D[EP],-1,D_D[LOC],$A23),0))","v":121.04},{"$f":"IF(ISNA($A23),\"\",IFERROR(SUMIFS(D_D[DEV],D_D[MT],5,D_D[CAT],SMS, D_D[EP],-1,D_D[LOC],$A23)/$D23,0))","v":0.32001775410563693},{"$f":"IF(ISNA($A23),\"\",IFERROR(SUMIFS(D_D[EVD],D_D[MT],5,D_D[CAT],SMS, D_D[EP],-1,D_D[LOC],$A23)/$D23,0))","v":0.45894363071460276},{"$f":"IF(ISNA($A23),\"\",IFERROR(SUMIFS(D_D[DEC],D_D[MT],5,D_D[CAT],SMS, D_D[EP],-1,D_D[LOC],$A23)/$D23,0))","v":0.20461606746560143},{"$f":"IF(ISNA($A23),\"\",IFERROR(SUMIFS(D_D[AWD],D_D[MT],5,D_D[CAT],SMS, D_D[EP],-1,D_D[LOC],$A23)/$D23,0))","v":1.4203284509542832E-2},{"$f":"IF(ISNA($A23),\"\",IFERROR(SUMIFS(D_D[AUT],D_D[MT],5,D_D[CAT],SMS, D_D[EP],-1,D_D[LOC],$A23)/$D23,0))","v":2.2192632046160675E-3}]
["354",11,"Reno",{"$f":"IF(ISNA($A24),\"\",IFERROR(SUMIFS(D_D[INV],D_D[MT],5,D_D[CAT],SMS, D_D[EP],-1,D_D[LOC],$A24),0))","v":1048},{"$f":"IF(ISNA($A24),\"\",IFERROR(SUMIFS(D_D[BL],D_D[MT],5,D_D[CAT],SMS, D_D[EP],-1,D_D[LOC],$A24),0))","v":291},0.27767175572519082,{"$f":"IF(ISNA($A24),\"\",IFERROR(SUMIFS(D_D[ADP],D_D[MT],5,D_D[CAT],SMS, D_D[EP],-1,D_D[LOC],$A24),0))","v":99.58},{"$f":"IF(ISNA($A24),\"\",IFERROR(SUMIFS(D_D[DEV],D_D[MT],5,D_D[CAT],SMS, D_D[EP],-1,D_D[LOC],$A24)/$D24,0))","v":0.27576335877862596},{"$f":"IF(ISNA($A24),\"\",IFERROR(SUMIFS(D_D[EVD],D_D[MT],5,D_D[CAT],SMS, D_D[EP],-1,D_D[LOC],$A24)/$D24,0))","v":0.40458015267175573},{"$f":"IF(ISNA($A24),\"\",IFERROR(SUMIFS(D_D[DEC],D_D[MT],5,D_D[CAT],SMS, D_D[EP],-1,D_D[LOC],$A24)/$D24,0))","v":0.27576335877862596},{"$f":"IF(ISNA($A24),\"\",IFERROR(SUMIFS(D_D[AWD],D_D[MT],5,D_D[CAT],SMS, D_D[EP],-1,D_D[LOC],$A24)/$D24,0))","v":2.385496183206107E-2},{"$f":"IF(ISNA($A24),\"\",IFERROR(SUMIFS(D_D[AUT],D_D[MT],5,D_D[CAT],SMS, D_D[EP],-1,D_D[LOC],$A24)/$D24,0))","v":2.0038167938931296E-2}]
["341",12,"Salt Lake City",{"$f":"IF(ISNA($A25),\"\",IFERROR(SUMIFS(D_D[INV],D_D[MT],5,D_D[CAT],SMS, D_D[EP],-1,D_D[LOC],$A25),0))","v":2977},{"$f":"IF(ISNA($A25),\"\",IFERROR(SUMIFS(D_D[BL],D_D[MT],5,D_D[CAT],SMS, D_D[EP],-1,D_D[LOC],$A25),0))","v":905},0.30399731273093716,{"$f":"IF(ISNA($A25),\"\",IFERROR(SUMIFS(D_D[ADP],D_D[MT],5,D_D[CAT],SMS, D_D[EP],-1,D_D[LOC],$A25),0))","v":101.41},{"$f":"IF(ISNA($A25),\"\",IFERROR(SUMIFS(D_D[DEV],D_D[MT],5,D_D[CAT],SMS, D_D[EP],-1,D_D[LOC],$A25)/$D25,0))","v":0.24286194155189789},{"$f":"IF(ISNA($A25),\"\",IFERROR(SUMIFS(D_D[EVD],D_D[MT],5,D_D[CAT],SMS, D_D[EP],-1,D_D[LOC],$A25)/$D25,0))","v":0.49848841115216663},{"$f":"IF(ISNA($A25),\"\",IFERROR(SUMIFS(D_D[DEC],D_D[MT],5,D_D[CAT],SMS, D_D[EP],-1,D_D[LOC],$A25)/$D25,0))","v":0.20591199193819282},{"$f":"IF(ISNA($A25),\"\",IFERROR(SUMIFS(D_D[AWD],D_D[MT],5,D_D[CAT],SMS, D_D[EP],-1,D_D[LOC],$A25)/$D25,0))","v":4.2996305005038628E-2},{"$f":"IF(ISNA($A25),\"\",IFERROR(SUMIFS(D_D[AUT],D_D[MT],5,D_D[CAT],SMS, D_D[EP],-1,D_D[LOC],$A25)/$D25,0))","v":9.7413503527040649E-3}]
["377",13,"San Diego",{"$f":"IF(ISNA($A26),\"\",IFERROR(SUMIFS(D_D[INV],D_D[MT],5,D_D[CAT],SMS, D_D[EP],-1,D_D[LOC],$A26),0))","v":7235},{"$f":"IF(ISNA($A26),\"\",IFERROR(SUMIFS(D_D[BL],D_D[MT],5,D_D[CAT],SMS, D_D[EP],-1,D_D[LOC],$A26),0))","v":2310},0.31928127159640635,{"$f":"IF(ISNA($A26),\"\",IFERROR(SUMIFS(D_D[ADP],D_D[MT],5,D_D[CAT],SMS, D_D[EP],-1,D_D[LOC],$A26),0))","v":94.07},{"$f":"IF(ISNA($A26),\"\",IFERROR(SUMIFS(D_D[DEV],D_D[MT],5,D_D[CAT],SMS, D_D[EP],-1,D_D[LOC],$A26)/$D26,0))","v":0.29053213545266066},{"$f":"IF(ISNA($A26),\"\",IFERROR(SUMIFS(D_D[EVD],D_D[MT],5,D_D[CAT],SMS, D_D[EP],-1,D_D[LOC],$A26)/$D26,0))","v":0.44699378023496888},{"$f":"IF(ISNA($A26),\"\",IFERROR(SUMIFS(D_D[DEC],D_D[MT],5,D_D[CAT],SMS, D_D[EP],-1,D_D[LOC],$A26)/$D26,0))","v":0.23441603317208018},{"$f":"IF(ISNA($A26),\"\",IFERROR(SUMIFS(D_D[AWD],D_D[MT],5,D_D[CAT],SMS, D_D[EP],-1,D_D[LOC],$A26)/$D26,0))","v":1.8244644091223221E-2},{"$f":"IF(ISNA($A26),\"\",IFERROR(SUMIFS(D_D[AUT],D_D[MT],5,D_D[CAT],SMS, D_D[EP],-1,D_D[LOC],$A26)/$D26,0))","v":9.8134070490670348E-3}]
["346",14,"Seattle",{"$f":"IF(ISNA($A27),\"\",IFERROR(SUMIFS(D_D[INV],D_D[MT],5,D_D[CAT],SMS, D_D[EP],-1,D_D[LOC],$A27),0))","v":6223},{"$f":"IF(ISNA($A27),\"\",IFERROR(SUMIFS(D_D[BL],D_D[MT],5,D_D[CAT],SMS, D_D[EP],-1,D_D[LOC],$A27),0))","v":2089},0.3356901815844448,{"$f":"IF(ISNA($A27),\"\",IFERROR(SUMIFS(D_D[ADP],D_D[MT],5,D_D[CAT],SMS, D_D[EP],-1,D_D[LOC],$A27),0))","v":113.16},{"$f":"IF(ISNA($A27),\"\",IFERROR(SUMIFS(D_D[DEV],D_D[MT],5,D_D[CAT],SMS, D_D[EP],-1,D_D[LOC],$A27)/$D27,0))","v":0.20151052547003054},{"$f":"IF(ISNA($A27),\"\",IFERROR(SUMIFS(D_D[EVD],D_D[MT],5,D_D[CAT],SMS, D_D[EP],-1,D_D[LOC],$A27)/$D27,0))","v":0.35979431142535756},{"$f":"IF(ISNA($A27),\"\",IFERROR(SUMIFS(D_D[DEC],D_D[MT],5,D_D[CAT],SMS, D_D[EP],-1,D_D[LOC],$A27)/$D27,0))","v":0.29567732604852964},{"$f":"IF(ISNA($A27),\"\",IFERROR(SUMIFS(D_D[AWD],D_D[MT],5,D_D[CAT],SMS, D_D[EP],-1,D_D[LOC],$A27)/$D27,0))","v":0.11827093041941186},{"$f":"IF(ISNA($A27),\"\",IFERROR(SUMIFS(D_D[AUT],D_D[MT],5,D_D[CAT],SMS, D_D[EP],-1,D_D[LOC],$A27)/$D27,0))","v":2.4746906636670417E-2}]
[{"$error":"#N/A"},15,"",{"$f":"IF(ISNA($A28),\"\",IFERROR(SUMIFS(D_D[INV],D_D[MT],5,D_D[CAT],SMS, D_D[EP],-1,D_D[LOC],$A28),0))","v":""},{"$f":"IF(ISNA($A28),\"\",IFERROR(SUMIFS(D_D[BL],D_D[MT],5,D_D[CAT],SMS, D_D[EP],-1,D_D[LOC],$A28),0))","v":""},"",{"$f":"IF(ISNA($A28),\"\",IFERROR(SUMIFS(D_D[ADP],D_D[MT],5,D_D[CAT],SMS, D_D[EP],-1,D_D[LOC],$A28),0))","v":""},{"$f":"IF(ISNA($A28),\"\",IFERROR(SUMIFS(D_D[DEV],D_D[MT],5,D_D[CAT],SMS, D_D[EP],-1,D_D[LOC],$A28)/$D28,0))","v":""},{"$f":"IF(ISNA($A28),\"\",IFERROR(SUMIFS(D_D[EVD],D_D[MT],5,D_D[CAT],SMS, D_D[EP],-1,D_D[LOC],$A28)/$D28,0))","v":""},{"$f":"IF(ISNA($A28),\"\",IFERROR(SUMIFS(D_D[DEC],D_D[MT],5,D_D[CAT],SMS, D_D[EP],-1,D_D[LOC],$A28)/$D28,0))","v":""},{"$f":"IF(ISNA($A28),\"\",IFERROR(SUMIFS(D_D[AWD],D_D[MT],5,D_D[CAT],SMS, D_D[EP],-1,D_D[LOC],$A28)/$D28,0))","v":""},{"$f":"IF(ISNA($A28),\"\",IFERROR(SUMIFS(D_D[AUT],D_D[MT],5,D_D[CAT],SMS, D_D[EP],-1,D_D[LOC],$A28)/$D28,0))","v":""}]
[{"$error":"#N/A"},16,"",{"$f":"IF(ISNA($A29),\"\",IFERROR(SUMIFS(D_D[INV],D_D[MT],5,D_D[CAT],SMS, D_D[EP],-1,D_D[LOC],$A29),0))","v":""},{"$f":"IF(ISNA($A29),\"\",IFERROR(SUMIFS(D_D[BL],D_D[MT],5,D_D[CAT],SMS, D_D[EP],-1,D_D[LOC],$A29),0))","v":""},"",{"$f":"IF(ISNA($A29),\"\",IFERROR(SUMIFS(D_D[ADP],D_D[MT],5,D_D[CAT],SMS, D_D[EP],-1,D_D[LOC],$A29),0))","v":""},{"$f":"IF(ISNA($A29),\"\",IFERROR(SUMIFS(D_D[DEV],D_D[MT],5,D_D[CAT],SMS, D_D[EP],-1,D_D[LOC],$A29)/$D29,0))","v":""},{"$f":"IF(ISNA($A29),\"\",IFERROR(SUMIFS(D_D[EVD],D_D[MT],5,D_D[CAT],SMS, D_D[EP],-1,D_D[LOC],$A29)/$D29,0))","v":""},{"$f":"IF(ISNA($A29),\"\",IFERROR(SUMIFS(D_D[DEC],D_D[MT],5,D_D[CAT],SMS, D_D[EP],-1,D_D[LOC],$A29)/$D29,0))","v":""},{"$f":"IF(ISNA($A29),\"\",IFERROR(SUMIFS(D_D[AWD],D_D[MT],5,D_D[CAT],SMS, D_D[EP],-1,D_D[LOC],$A29)/$D29,0))","v":""},{"$f":"IF(ISNA($A29),\"\",IFERROR(SUMIFS(D_D[AUT],D_D[MT],5,D_D[CAT],SMS, D_D[EP],-1,D_D[LOC],$A29)/$D29,0))","v":""}]
[{"$error":"#N/A"},17,"",{"$f":"IF(ISNA($A30),\"\",IFERROR(SUMIFS(D_D[INV],D_D[MT],5,D_D[CAT],SMS, D_D[EP],-1,D_D[LOC],$A30),0))","v":""},{"$f":"IF(ISNA($A30),\"\",IFERROR(SUMIFS(D_D[BL],D_D[MT],5,D_D[CAT],SMS, D_D[EP],-1,D_D[LOC],$A30),0))","v":""},"",{"$f":"IF(ISNA($A30),\"\",IFERROR(SUMIFS(D_D[ADP],D_D[MT],5,D_D[CAT],SMS, D_D[EP],-1,D_D[LOC],$A30),0))","v":""},{"$f":"IF(ISNA($A30),\"\",IFERROR(SUMIFS(D_D[DEV],D_D[MT],5,D_D[CAT],SMS, D_D[EP],-1,D_D[LOC],$A30)/$D30,0))","v":""},{"$f":"IF(ISNA($A30),\"\",IFERROR(SUMIFS(D_D[EVD],D_D[MT],5,D_D[CAT],SMS, D_D[EP],-1,D_D[LOC],$A30)/$D30,0))","v":""},{"$f":"IF(ISNA($A30),\"\",IFERROR(SUMIFS(D_D[DEC],D_D[MT],5,D_D[CAT],SMS, D_D[EP],-1,D_D[LOC],$A30)/$D30,0))","v":""},{"$f":"IF(ISNA($A30),\"\",IFERROR(SUMIFS(D_D[AWD],D_D[MT],5,D_D[CAT],SMS, D_D[EP],-1,D_D[LOC],$A30)/$D30,0))","v":""},{"$f":"IF(ISNA($A30),\"\",IFERROR(SUMIFS(D_D[AUT],D_D[MT],5,D_D[CAT],SMS, D_D[EP],-1,D_D[LOC],$A30)/$D30,0))","v":""}]
[{"$error":"#N/A"},18,"",{"$f":"IF(ISNA($A31),\"\",IFERROR(SUMIFS(D_D[INV],D_D[MT],5,D_D[CAT],SMS, D_D[EP],-1,D_D[LOC],$A31),0))","v":""},{"$f":"IF(ISNA($A31),\"\",IFERROR(SUMIFS(D_D[BL],D_D[MT],5,D_D[CAT],SMS, D_D[EP],-1,D_D[LOC],$A31),0))","v":""},"",{"$f":"IF(ISNA($A31),\"\",IFERROR(SUMIFS(D_D[ADP],D_D[MT],5,D_D[CAT],SMS, D_D[EP],-1,D_D[LOC],$A31),0))","v":""},{"$f":"IF(ISNA($A31),\"\",IFERROR(SUMIFS(D_D[DEV],D_D[MT],5,D_D[CAT],SMS, D_D[EP],-1,D_D[LOC],$A31)/$D31,0))","v":""},{"$f":"IF(ISNA($A31),\"\",IFERROR(SUMIFS(D_D[EVD],D_D[MT],5,D_D[CAT],SMS, D_D[EP],-1,D_D[LOC],$A31)/$D31,0))","v":""},{"$f":"IF(ISNA($A31),\"\",IFERROR(SUMIFS(D_D[DEC],D_D[MT],5,D_D[CAT],SMS, D_D[EP],-1,D_D[LOC],$A31)/$D31,0))","v":""},{"$f":"IF(ISNA($A31),\"\",IFERROR(SUMIFS(D_D[AWD],D_D[MT],5,D_D[CAT],SMS, D_D[EP],-1,D_D[LOC],$A31)/$D31,0))","v":""},{"$f":"IF(ISNA($A31),\"\",IFERROR(SUMIFS(D_D[AUT],D_D[MT],5,D_D[CAT],SMS, D_D[EP],-1,D_D[LOC],$A31)/$D31,0))","v":""}]
[{"$error":"#N/A"},19,"",{"$f":"IF(ISNA($A32),\"\",IFERROR(SUMIFS(D_D[INV],D_D[MT],5,D_D[CAT],SMS, D_D[EP],-1,D_D[LOC],$A32),0))","v":""},{"$f":"IF(ISNA($A32),\"\",IFERROR(SUMIFS(D_D[BL],D_D[MT],5,D_D[CAT],SMS, D_D[EP],-1,D_D[LOC],$A32),0))","v":""},"",{"$f":"IF(ISNA($A32),\"\",IFERROR(SUMIFS(D_D[ADP],D_D[MT],5,D_D[CAT],SMS, D_D[EP],-1,D_D[LOC],$A32),0))","v":""},{"$f":"IF(ISNA($A32),\"\",IFERROR(SUMIFS(D_D[DEV],D_D[MT],5,D_D[CAT],SMS, D_D[EP],-1,D_D[LOC],$A32)/$D32,0))","v":""},{"$f":"IF(ISNA($A32),\"\",IFERROR(SUMIFS(D_D[EVD],D_D[MT],5,D_D[CAT],SMS, D_D[EP],-1,D_D[LOC],$A32)/$D32,0))","v":""},{"$f":"IF(ISNA($A32),\"\",IFERROR(SUMIFS(D_D[DEC],D_D[MT],5,D_D[CAT],SMS, D_D[EP],-1,D_D[LOC],$A32)/$D32,0))","v":""},{"$f":"IF(ISNA($A32),\"\",IFERROR(SUMIFS(D_D[AWD],D_D[MT],5,D_D[CAT],SMS, D_D[EP],-1,D_D[LOC],$A32)/$D32,0))","v":""},{"$f":"IF(ISNA($A32),\"\",IFERROR(SUMIFS(D_D[AUT],D_D[MT],5,D_D[CAT],SMS, D_D[EP],-1,D_D[LOC],$A32)/$D32,0))","v":""}]
[{"$error":"#N/A"},20,"",{"$f":"IF(ISNA($A33),\"\",IFERROR(SUMIFS(D_D[INV],D_D[MT],5,D_D[CAT],SMS, D_D[EP],-1,D_D[LOC],$A33),0))","v":""},{"$f":"IF(ISNA($A33),\"\",IFERROR(SUMIFS(D_D[BL],D_D[MT],5,D_D[CAT],SMS, D_D[EP],-1,D_D[LOC],$A33),0))","v":""},"",{"$f":"IF(ISNA($A33),\"\",IFERROR(SUMIFS(D_D[ADP],D_D[MT],5,D_D[CAT],SMS, D_D[EP],-1,D_D[LOC],$A33),0))","v":""},{"$f":"IF(ISNA($A33),\"\",IFERROR(SUMIFS(D_D[DEV],D_D[MT],5,D_D[CAT],SMS, D_D[EP],-1,D_D[LOC],$A33)/$D33,0))","v":""},{"$f":"IF(ISNA($A33),\"\",IFERROR(SUMIFS(D_D[EVD],D_D[MT],5,D_D[CAT],SMS, D_D[EP],-1,D_D[LOC],$A33)/$D33,0))","v":""},{"$f":"IF(ISNA($A33),\"\",IFERROR(SUMIFS(D_D[DEC],D_D[MT],5,D_D[CAT],SMS, D_D[EP],-1,D_D[LOC],$A33)/$D33,0))","v":""},{"$f":"IF(ISNA($A33),\"\",IFERROR(SUMIFS(D_D[AWD],D_D[MT],5,D_D[CAT],SMS, D_D[EP],-1,D_D[LOC],$A33)/$D33,0))","v":""},{"$f":"IF(ISNA($A33),\"\",IFERROR(SUMIFS(D_D[AUT],D_D[MT],5,D_D[CAT],SMS, D_D[EP],-1,D_D[LOC],$A33)/$D33,0))","v":""}]
[{"$error":"#N/A"},21,"",{"$f":"IF(ISNA($A34),\"\",IFERROR(SUMIFS(D_D[INV],D_D[MT],5,D_D[CAT],SMS, D_D[EP],-1,D_D[LOC],$A34),0))","v":""},{"$f":"IF(ISNA($A34),\"\",IFERROR(SUMIFS(D_D[BL],D_D[MT],5,D_D[CAT],SMS, D_D[EP],-1,D_D[LOC],$A34),0))","v":""},"",{"$f":"IF(ISNA($A34),\"\",IFERROR(SUMIFS(D_D[ADP],D_D[MT],5,D_D[CAT],SMS, D_D[EP],-1,D_D[LOC],$A34),0))","v":""},{"$f":"IF(ISNA($A34),\"\",IFERROR(SUMIFS(D_D[DEV],D_D[MT],5,D_D[CAT],SMS, D_D[EP],-1,D_D[LOC],$A34)/$D34,0))","v":""},{"$f":"IF(ISNA($A34),\"\",IFERROR(SUMIFS(D_D[EVD],D_D[MT],5,D_D[CAT],SMS, D_D[EP],-1,D_D[LOC],$A34)/$D34,0))","v":""},{"$f":"IF(ISNA($A34),\"\",IFERROR(SUMIFS(D_D[DEC],D_D[MT],5,D_D[CAT],SMS, D_D[EP],-1,D_D[LOC],$A34)/$D34,0))","v":""},{"$f":"IF(ISNA($A34),\"\",IFERROR(SUMIFS(D_D[AWD],D_D[MT],5,D_D[CAT],SMS, D_D[EP],-1,D_D[LOC],$A34)/$D34,0))","v":""},{"$f":"IF(ISNA($A34),\"\",IFERROR(SUMIFS(D_D[AUT],D_D[MT],5,D_D[CAT],SMS, D_D[EP],-1,D_D[LOC],$A34)/$D34,0))","v":""}]
[{"$error":"#N/A"},22,"",{"$f":"IF(ISNA($A35),\"\",IFERROR(SUMIFS(D_D[INV],D_D[MT],5,D_D[CAT],SMS, D_D[EP],-1,D_D[LOC],$A35),0))","v":""},{"$f":"IF(ISNA($A35),\"\",IFERROR(SUMIFS(D_D[BL],D_D[MT],5,D_D[CAT],SMS, D_D[EP],-1,D_D[LOC],$A35),0))","v":""},"",{"$f":"IF(ISNA($A35),\"\",IFERROR(SUMIFS(D_D[ADP],D_D[MT],5,D_D[CAT],SMS, D_D[EP],-1,D_D[LOC],$A35),0))","v":""},{"$f":"IF(ISNA($A35),\"\",IFERROR(SUMIFS(D_D[DEV],D_D[MT],5,D_D[CAT],SMS, D_D[EP],-1,D_D[LOC],$A35)/$D35,0))","v":""},{"$f":"IF(ISNA($A35),\"\",IFERROR(SUMIFS(D_D[EVD],D_D[MT],5,D_D[CAT],SMS, D_D[EP],-1,D_D[LOC],$A35)/$D35,0))","v":""},{"$f":"IF(ISNA($A35),\"\",IFERROR(SUMIFS(D_D[DEC],D_D[MT],5,D_D[CAT],SMS, D_D[EP],-1,D_D[LOC],$A35)/$D35,0))","v":""},{"$f":"IF(ISNA($A35),\"\",IFERROR(SUMIFS(D_D[AWD],D_D[MT],5,D_D[CAT],SMS, D_D[EP],-1,D_D[LOC],$A35)/$D35,0))","v":""},{"$f":"IF(ISNA($A35),\"\",IFERROR(SUMIFS(D_D[AUT],D_D[MT],5,D_D[CAT],SMS, D_D[EP],-1,D_D[LOC],$A35)/$D35,0))","v":""}]
[{"$error":"#N/A"},23,"",{"$f":"IF(ISNA($A36),\"\",IFERROR(SUMIFS(D_D[INV],D_D[MT],5,D_D[CAT],SMS, D_D[EP],-1,D_D[LOC],$A36),0))","v":""},{"$f":"IF(ISNA($A36),\"\",IFERROR(SUMIFS(D_D[BL],D_D[MT],5,D_D[CAT],SMS, D_D[EP],-1,D_D[LOC],$A36),0))","v":""},"",{"$f":"IF(ISNA($A36),\"\",IFERROR(SUMIFS(D_D[ADP],D_D[MT],5,D_D[CAT],SMS, D_D[EP],-1,D_D[LOC],$A36),0))","v":""},{"$f":"IF(ISNA($A36),\"\",IFERROR(SUMIFS(D_D[DEV],D_D[MT],5,D_D[CAT],SMS, D_D[EP],-1,D_D[LOC],$A36)/$D36,0))","v":""},{"$f":"IF(ISNA($A36),\"\",IFERROR(SUMIFS(D_D[EVD],D_D[MT],5,D_D[CAT],SMS, D_D[EP],-1,D_D[LOC],$A36)/$D36,0))","v":""},{"$f":"IF(ISNA($A36),\"\",IFERROR(SUMIFS(D_D[DEC],D_D[MT],5,D_D[CAT],SMS, D_D[EP],-1,D_D[LOC],$A36)/$D36,0))","v":""},{"$f":"IF(ISNA($A36),\"\",IFERROR(SUMIFS(D_D[AWD],D_D[MT],5,D_D[CAT],SMS, D_D[EP],-1,D_D[LOC],$A36)/$D36,0))","v":""},{"$f":"IF(ISNA($A36),\"\",IFERROR(SUMIFS(D_D[AUT],D_D[MT],5,D_D[CAT],SMS, D_D[EP],-1,D_D[LOC],$A36)/$D36,0))","v":""}]

{"sheet":"Rating Bundle - NWQ - State","index":9,"n_rows":89,"n_cols":12,"rows_kept":89,"cut":false,"hidden":false,"merged":[[8,9,10,9],[8,10,10,10],[8,11,10,11],[8,4,10,4],[8,5,10,5],[8,6,10,6],[8,7,10,7],[8,8,10,8],[7,4,7,6],[7,7,7,11],[1,9,1,11],[2,9,2,11],[1,4,1,8],[2,4,2,8],[5,9,5,11],[3,4,4,8]]}
[]
[null,null,"DISTRICT SELECTOR",null,"Compensation and Pension Rating Bundle Metrics",null,null,null,null,"Report through"]
[null,null,null,null,"NWQ State View",null,null,null,null,{"$f":"D_DT[]","v":"2023-08-05"}]
[null,null,null,null,"The State listed is based on the address associated with the claim, not payment address"]
[]
[null,null,null,null,"Each Special Mission has distinct claim counts",null,null,null,null,"Life Cycle Metrics defined on Legend tab"]
[]
[null,null,null,null,"CLAIM METRICS",null,null,"LIFE CYCLE METRICS (as Percent of # Pending)"]
[null,null,"SPECIAL MISSION SELECTOR",null,"#\nPending","#\nPending\n> 125 Days","%\nPending\n> 125 Days","Pending Development","Pending Evidence","Pending Decision","Pending Award","Pending Authorization"]
[]
[]
[100,null,{"$f":"Driver!$C$20","v":"USA - All Missions"},"Total",{"$f":"IF(ISNA($A12),\"\",IFERROR(SUMIFS(D_D[INV],D_D[MT],5,D_D[CAT],SMS, D_D[EP],-1,D_D[LOC],$A12),0))","v":944142},{"$f":"IF(ISNA($A12),\"\",IFERROR(SUMIFS(D_D[BL],D_D[MT],5,D_D[CAT],SMS, D_D[EP],-1,D_D[LOC],$A12),0))","v":272525},{"$f":"IF(ISNA($A12),\"\",IFERROR(F12/E12,0))","v":0.28864831773186661},{"$f":"IF(ISNA($A12),\"\",IFERROR(SUMIFS(D_D[DEV],D_D[MT],5,D_D[CAT],SMS, D_D[EP],-1,D_D[LOC],$A12)/$E12,0))","v":0.16810183213965696},{"$f":"IF(ISNA($A12),\"\",IFERROR(SUMIFS(D_D[EVD],D_D[MT],5,D_D[CAT],SMS, D_D[EP],-1,D_D[LOC],$A12)/$E12,0))","v":0.72276098298772851},{"$f":"IF(ISNA($A12),\"\",IFERROR(SUMIFS(D_D[DEC],D_D[MT],5,D_D[CAT],SMS, D_D[EP],-1,D_D[LOC],$A12)/$E12,0))","v":9.9081494097286213E-2},{"$f":"IF(ISNA($A12),\"\",IFERROR(SUMIFS(D_D[AWD],D_D[MT],5,D_D[CAT],SMS, D_D[EP],-1,D_D[LOC],$A12)/$E12,0))","v":7.1281650429702312E-3},{"$f":"IF(ISNA($A12),\"\",IFERROR(SUMIFS(D_D[AUT],D_D[MT],5,D_D[CAT],SMS, D_D[EP],-1,D_D[LOC],$A12)/$E12,0))","v":2.9275257323580564E-3}]
[499,null,{"$f":"\"NWQ-\"&Driver!$C$20","v":"NWQ-USA - All Missions"},"Total",{"$f":"IF(ISNA($A13),\"\",IFERROR(SUMIFS(D_D[INV],D_D[MT],5,D_D[CAT],SMS, D_D[EP],-1,D_D[LOC],$A13),0))","v":763629},{"$f":"IF(ISNA($A13),\"\",IFERROR(SUMIFS(D_D[BL],D_D[MT],5,D_D[CAT],SMS, D_D[EP],-1,D_D[LOC],$A13),0))","v":215081},{"$f":"IF(ISNA($A13),\"\",IFERROR(F13/E13,0))","v":0.28165640644868123},{"$f":"IF(ISNA($A13),\"\",IFERROR(SUMIFS(D_D[DEV],D_D[MT],5,D_D[CAT],SMS, D_D[EP],-1,D_D[LOC],$A13)/$E13,0))","v":0.13743584908378284},{"$f":"IF(ISNA($A13),\"\",IFERROR(SUMIFS(D_D[EVD],D_D[MT],5,D_D[CAT],SMS, D_D[EP],-1,D_D[LOC],$A13)/$E13,0))","v":0.79152834688048779},{"$f":"IF(ISNA($A13),\"\",IFERROR(SUMIFS(D_D[DEC],D_D[MT],5,D_D[CAT],SMS, D_D[EP],-1,D_D[LOC],$A13)/$E13,0))","v":7.0564370918338615E-2},{"$f":"IF(ISNA($A13),\"\",IFERROR(SUMIFS(D_D[AWD],D_D[MT],5,D_D[CAT],SMS, D_D[EP],-1,D_D[LOC],$A13)/$E13,0))","v":4.7012358095357824E-4},{"$f":"IF(ISNA($A13),\"\",IFERROR(SUMIFS(D_D[AUT],D_D[MT],5,D_D[CAT],SMS, D_D[EP],-1,D_D[LOC],$A13)/$E13,0))","v":1.3095364371965968E-6}]
[{"$f":"INDEX(STATE,(MATCH($C14,STATE_D,0)))","v":"395"},1,{"$f":"IFERROR(INDEX(INDIRECT(DS_NWQ),B14),\"\")","v":"Pacific District"},{"$f":"IFERROR(INDEX(INDIRECT(DS_NWQD),B14),\"\")","v":" "},{"$f":"IF(ISNA($A14),\"\",IFERROR(SUMIFS(D_D[INV],D_D[MT],5,D_D[CAT],SMS, D_D[EP],499,D_D[LOC],$A14),0))","v":169660},{"$f":"IF(ISNA($A14),\"\",IFERROR(SUMIFS(D_D[BL],D_D[MT],5,D_D[CAT],SMS, D_D[EP],499,D_D[LOC],$A14),0))","v":51387},{"$f":"IF(ISNA($A14),\"\",IFERROR(F14/E14,0))","v":0.30288223505835199},{"$f":"IF(ISNA($A14),\"\",IFERROR(SUMIFS(D_D[DEV],D_D[MT],5,D_D[CAT],SMS, D_D[EP],499,D_D[LOC],$A14)/$E14,0))","v":0.15896498880113166},{"$f":"IF(ISNA($A14),\"\",IFERROR(SUMIFS(D_D[EVD],D_D[MT],5,D_D[CAT],SMS, D_D[EP],499,D_D[LOC],$A14)/$E14,0))","v":0.74078156312625254},{"$f":"IF(ISNA($A14),\"\",IFERROR(SUMIFS(D_D[DEC],D_D[MT],5,D_D[CAT],SMS, D_D[EP],499,D_D[LOC],$A14)/$E14,0))","v":9.0940704939290351E-2},{"$f":"IF(ISNA($A14),\"\",IFERROR(SUMIFS(D_D[AWD],D_D[MT],5,D_D[CAT],SMS, D_D[EP],499,D_D[LOC],$A14)/$E14,0))","v":6.6603795826948014E-3},{"$f":"IF(ISNA($A14),\"\",IFERROR(SUMIFS(D_D[AUT],D_D[MT],5,D_D[CAT],SMS, D_D[EP],499,D_D[LOC],$A14)/$E14,0))","v":2.652363550630673E-3}]
[{"$f":"IFERROR(INDEX(INDIRECT(DS_NWQI),B15),#N/A)","v":"AK100"},2,"Alaska",{"$f":"IFERROR(INDEX(INDIRECT(DS_NWQD),B15),\"\")","v":"Alaska-Total"},{"$f":"IF(ISNA($A15),\"\",IFERROR(SUMIFS(D_D[INV],D_D[MT],5,D_D[CAT],SMS, D_D[EP],499,D_D[LOC],$A15),0))","v":2996},{"$f":"IF(ISNA($A15),\"\",IFERROR(SUMIFS(D_D[BL],D_D[MT],5,D_D[CAT],SMS, D_D[EP],499,D_D[LOC],$A15),0))","v":936},0.31241655540720964,{"$f":"IF(ISNA($A15),\"\",IFERROR(SUMIFS(D_D[DEV],D_D[MT],5,D_D[CAT],SMS, D_D[EP],499,D_D[LOC],$A15)/$E15,0))","v":0.13551401869158877},{"$f":"IF(ISNA($A15),\"\",IFERROR(SUMIFS(D_D[EVD],D_D[MT],5,D_D[CAT],SMS, D_D[EP],499,D_D[LOC],$A15)/$E15,0))","v":0.77269692923898536},{"$f":"IF(ISNA($A15),\"\",IFERROR(SUMIFS(D_D[DEC],D_D[MT],5,D_D[CAT],SMS, D_D[EP],499,D_D[LOC],$A15)/$E15,0))","v":8.3444592790387184E-2},{"$f":"IF(ISNA($A15),\"\",IFERROR(SUMIFS(D_D[AWD],D_D[MT],5,D_D[CAT],SMS, D_D[EP],499,D_D[LOC],$A15)/$E15,0))","v":6.3417890520694256E-3},{"$f":"IF(ISNA($A15),\"\",IFERROR(SUMIFS(D_D[AUT],D_D[MT],5,D_D[CAT],SMS, D_D[EP],499,D_D[LOC],$A15)/$E15,0))","v":2.0026702269692926E-3}]
["AK463",3,0,"Anchorage RO",{"$f":"IF(ISNA($A16),\"\",IFERROR(SUMIFS(D_D[INV],D_D[MT],5,D_D[CAT],SMS, D_D[EP],499,D_D[LOC],$A16),0))","v":60},{"$f":"IF(ISNA($A16),\"\",IFERROR(SUMIFS(D_D[BL],D_D[MT],5,D_D[CAT],SMS, D_D[EP],499,D_D[LOC],$A16),0))","v":3},0.05,{"$f":"IF(ISNA($A16),\"\",IFERROR(SUMIFS(D_D[DEV],D_D[MT],5,D_D[CAT],SMS, D_D[EP],499,D_D[LOC],$A16)/$E16,0))","v":0.8},{"$f":"IF(ISNA($A16),\"\",IFERROR(SUMIFS(D_D[EVD],D_D[MT],5,D_D[CAT],SMS, D_D[EP],499,D_D[LOC],$A16)/$E16,0))","v":0.15},{"$f":"IF(ISNA($A16),\"\",IFERROR(SUMIFS(D_D[DEC],D_D[MT],5,D_D[CAT],SMS, D_D[EP],499,D_D[LOC],$A16)/$E16,0))","v":3.3333333333333333E-2},{"$f":"IF(ISNA($A16),\"\",IFERROR(SUMIFS(D_D[AWD],D_D[MT],5,D_D[CAT],SMS, D_D[EP],499,D_D[LOC],$A16)/$E16,0))","v":0},{"$f":"IF(ISNA($A16),\"\",IFERROR(SUMIFS(D_D[AUT],D_D[MT],5,D_D[CAT],SMS, D_D[EP],499,D_D[LOC],$A16)/$E16,0))","v":1.6666666666666666E-2}]
["AK-1",4," ","Alaska-Other RO",{"$f":"IF(ISNA($A17),\"\",IFERROR(SUMIFS(D_D[INV],D_D[MT],5,D_D[CAT],SMS, D_D[EP],499,D_D[LOC],$A17),0))","v":508},{"$f":"IF(ISNA($A17),\"\",IFERROR(SUMIFS(D_D[BL],D_D[MT],5,D_D[CAT],SMS, D_D[EP],499,D_D[LOC],$A17),0))","v":193},0.37992125984251968,{"$f":"IF(ISNA($A17),\"\",IFERROR(SUMIFS(D_D[DEV],D_D[MT],5,D_D[CAT],SMS, D_D[EP],499,D_D[LOC],$A17)/$E17,0))","v":0.21062992125984251},{"$f":"IF(ISNA($A17),\"\",IFERROR(SUMIFS(D_D[EVD],D_D[MT],5,D_D[CAT],SMS, D_D[EP],499,D_D[LOC],$A17)/$E17,0))","v":0.47834645669291337},{"$f":"IF(ISNA($A17),\"\",IFERROR(SUMIFS(D_D[DEC],D_D[MT],5,D_D[CAT],SMS, D_D[EP],499,D_D[LOC],$A17)/$E17,0))","v":0.26377952755905509},{"$f":"IF(ISNA($A17),\"\",IFERROR(SUMIFS(D_D[AWD],D_D[MT],5,D_D[CAT],SMS, D_D[EP],499,D_D[LOC],$A17)/$E17,0))","v":3.7401574803149609E-2},{"$f":"IF(ISNA($A17),\"\",IFERROR(SUMIFS(D_D[AUT],D_D[MT],5,D_D[CAT],SMS, D_D[EP],499,D_D[LOC],$A17)/$E17,0))","v":9.8425196850393699E-3}]
["AK499",5," ","Alaska-NWQ",{"$f":"IF(ISNA($A18),\"\",IFERROR(SUMIFS(D_D[INV],D_D[MT],5,D_D[CAT],SMS, D_D[EP],499,D_D[LOC],$A18),0))","v":2428},{"$f":"IF(ISNA($A18),\"\",IFERROR(SUMIFS(D_D[BL],D_D[MT],5,D_D[CAT],SMS, D_D[EP],499,D_D[LOC],$A18),0))","v":740},0.30477759472817134,{"$f":"IF(ISNA($A18),\"\",IFERROR(SUMIFS(D_D[DEV],D_D[MT],5,D_D[CAT],SMS, D_D[EP],499,D_D[LOC],$A18)/$E18,0))","v":0.10337726523887973},{"$f":"IF(ISNA($A18),\"\",IFERROR(SUMIFS(D_D[EVD],D_D[MT],5,D_D[CAT],SMS, D_D[EP],499,D_D[LOC],$A18)/$E18,0))","v":0.84967051070840194},{"$f":"IF(ISNA($A18),\"\",IFERROR(SUMIFS(D_D[DEC],D_D[MT],5,D_D[CAT],SMS, D_D[EP],499,D_D[LOC],$A18)/$E18,0))","v":4.6952224052718289E-2},{"$f":"IF(ISNA($A18),\"\",IFERROR(SUMIFS(D_D[AWD],D_D[MT],5,D_D[CAT],SMS, D_D[EP],499,D_D[LOC],$A18)/$E18,0))","v":0},{"$f":"IF(ISNA($A18),\"\",IFERROR(SUMIFS(D_D[AUT],D_D[MT],5,D_D[CAT],SMS, D_D[EP],499,D_D[LOC],$A18)/$E18,0))","v":0}]
["AZ100",6,"Arizona","Arizona-Total",{"$f":"IF(ISNA($A19),\"\",IFERROR(SUMIFS(D_D[INV],D_D[MT],5,D_D[CAT],SMS, D_D[EP],499,D_D[LOC],$A19),0))","v":23516},{"$f":"IF(ISNA($A19),\"\",IFERROR(SUMIFS(D_D[BL],D_D[MT],5,D_D[CAT],SMS, D_D[EP],499,D_D[LOC],$A19),0))","v":7097},0.30179452287804048,{"$f":"IF(ISNA($A19),\"\",IFERROR(SUMIFS(D_D[DEV],D_D[MT],5,D_D[CAT],SMS, D_D[EP],499,D_D[LOC],$A19)/$E19,0))","v":0.16065657424732097},{"$f":"IF(ISNA($A19),\"\",IFERROR(SUMIFS(D_D[EVD],D_D[MT],5,D_D[CAT],SMS, D_D[EP],499,D_D[LOC],$A19)/$E19,0))","v":0.7448120428644327},{"$f":"IF(ISNA($A19),\"\",IFERROR(SUMIFS(D_D[DEC],D_D[MT],5,D_D[CAT],SMS, D_D[EP],499,D_D[LOC],$A19)/$E19,0))","v":8.6579350229630883E-2},{"$f":"IF(ISNA($A19),\"\",IFERROR(SUMIFS(D_D[AWD],D_D[MT],5,D_D[CAT],SMS, D_D[EP],499,D_D[LOC],$A19)/$E19,0))","v":5.6131995237285251E-3},{"$f":"IF(ISNA($A19),\"\",IFERROR(SUMIFS(D_D[AUT],D_D[MT],5,D_D[CAT],SMS, D_D[EP],499,D_D[LOC],$A19)/$E19,0))","v":2.3388331348868853E-3}]
["AZ345",7,0,"Phoenix RO",{"$f":"IF(ISNA($A20),\"\",IFERROR(SUMIFS(D_D[INV],D_D[MT],5,D_D[CAT],SMS, D_D[EP],499,D_D[LOC],$A20),0))","v":727},{"$f":"IF(ISNA($A20),\"\",IFERROR(SUMIFS(D_D[BL],D_D[MT],5,D_D[CAT],SMS, D_D[EP],499,D_D[LOC],$A20),0))","v":117},0.1609353507565337,{"$f":"IF(ISNA($A20),\"\",IFERROR(SUMIFS(D_D[DEV],D_D[MT],5,D_D[CAT],SMS, D_D[EP],499,D_D[LOC],$A20)/$E20,0))","v":0.63686382393397523},{"$f":"IF(ISNA($A20),\"\",IFERROR(SUMIFS(D_D[EVD],D_D[MT],5,D_D[CAT],SMS, D_D[EP],499,D_D[LOC],$A20)/$E20,0))","v":0.27510316368638238},{"$f":"IF(ISNA($A20),\"\",IFERROR(SUMIFS(D_D[DEC],D_D[MT],5,D_D[CAT],SMS, D_D[EP],499,D_D[LOC],$A20)/$E20,0))","v":7.4277854195323248E-2},{"$f":"IF(ISNA($A20),\"\",IFERROR(SUMIFS(D_D[AWD],D_D[MT],5,D_D[CAT],SMS, D_D[EP],499,D_D[LOC],$A20)/$E20,0))","v":1.1004126547455296E-2},{"$f":"IF(ISNA($A20),\"\",IFERROR(SUMIFS(D_D[AUT],D_D[MT],5,D_D[CAT],SMS, D_D[EP],499,D_D[LOC],$A20)/$E20,0))","v":2.751031636863824E-3}]
["AZ-1",8," ","Arizona-Other RO",{"$f":"IF(ISNA($A21),\"\",IFERROR(SUMIFS(D_D[INV],D_D[MT],5,D_D[CAT],SMS, D_D[EP],499,D_D[LOC],$A21),0))","v":3774},{"$f":"IF(ISNA($A21),\"\",IFERROR(SUMIFS(D_D[BL],D_D[MT],5,D_D[CAT],SMS, D_D[EP],499,D_D[LOC],$A21),0))","v":1391},0.36857445680975093,{"$f":"IF(ISNA($A21),\"\",IFERROR(SUMIFS(D_D[DEV],D_D[MT],5,D_D[CAT],SMS, D_D[EP],499,D_D[LOC],$A21)/$E21,0))","v":0.23237943826179119},{"$f":"IF(ISNA($A21),\"\",IFERROR(SUMIFS(D_D[EVD],D_D[MT],5,D_D[CAT],SMS, D_D[EP],499,D_D[LOC],$A21)/$E21,0))","v":0.4994700582935877},{"$f":"IF(ISNA($A21),\"\",IFERROR(SUMIFS(D_D[DEC],D_D[MT],5,D_D[CAT],SMS, D_D[EP],499,D_D[LOC],$A21)/$E21,0))","v":0.22257551669316375},{"$f":"IF(ISNA($A21),\"\",IFERROR(SUMIFS(D_D[AWD],D_D[MT],5,D_D[CAT],SMS, D_D[EP],499,D_D[LOC],$A21)/$E21,0))","v":3.1531531531531529E-2},{"$f":"IF(ISNA($A21),\"\",IFERROR(SUMIFS(D_D[AUT],D_D[MT],5,D_D[CAT],SMS, D_D[EP],499,D_D[LOC],$A21)/$E21,0))","v":1.4043455219925808E-2}]
["AZ499",9," ",{"$f":"IFERROR(INDEX(INDIRECT(DS_NWQD),B22),\"\")","v":"Arizona-NWQ"},{"$f":"IF(ISNA($A22),\"\",IFERROR(SUMIFS(D_D[INV],D_D[MT],5,D_D[CAT],SMS, D_D[EP],499,D_D[LOC],$A22),0))","v":19015},{"$f":"IF(ISNA($A22),\"\",IFERROR(SUMIFS(D_D[BL],D_D[MT],5,D_D[CAT],SMS, D_D[EP],499,D_D[LOC],$A22),0))","v":5589},{"$f":"IF(ISNA($A22),\"\",IFERROR(F22/E22,0))","v":0.29392584801472521},{"$f":"IF(ISNA($A22),\"\",IFERROR(SUMIFS(D_D[DEV],D_D[MT],5,D_D[CAT],SMS, D_D[EP],499,D_D[LOC],$A22)/$E22,0))","v":0.12821456744675255},{"$f":"IF(ISNA($A22),\"\",IFERROR(SUMIFS(D_D[EVD],D_D[MT],5,D_D[CAT],SMS, D_D[EP],499,D_D[LOC],$A22)/$E22,0))","v":0.81146463318432815},{"$f":"IF(ISNA($A22),\"\",IFERROR(SUMIFS(D_D[DEC],D_D[MT],5,D_D[CAT],SMS, D_D[EP],499,D_D[LOC],$A22)/$E22,0))","v":6.0057849066526427E-2},{"$f":"IF(ISNA($A22),\"\",IFERROR(SUMIFS(D_D[AWD],D_D[MT],5,D_D[CAT],SMS, D_D[EP],499,D_D[LOC],$A22)/$E22,0))","v":2.6295030239284776E-4},{"$f":"IF(ISNA($A22),\"\",IFERROR(SUMIFS(D_D[AUT],D_D[MT],5,D_D[CAT],SMS, D_D[EP],499,D_D[LOC],$A22)/$E22,0))","v":0}]
["CA100",10,"California","California-Total",{"$f":"IF(ISNA($A23),\"\",IFERROR(SUMIFS(D_D[INV],D_D[MT],5,D_D[CAT],SMS, D_D[EP],499,D_D[LOC],$A23),0))","v":75390},{"$f":"IF(ISNA($A23),\"\",IFERROR(SUMIFS(D_D[BL],D_D[MT],5,D_D[CAT],SMS, D_D[EP],499,D_D[LOC],$A23),0))","v":22404},0.29717469160366095,{"$f":"IF(ISNA($A23),\"\",IFERROR(SUMIFS(D_D[DEV],D_D[MT],5,D_D[CAT],SMS, D_D[EP],499,D_D[LOC],$A23)/$E23,0))","v":0.16411990980236105},{"$f":"IF(ISNA($A23),\"\",IFERROR(SUMIFS(D_D[EVD],D_D[MT],5,D_D[CAT],SMS, D_D[EP],499,D_D[LOC],$A23)/$E23,0))","v":0.73033558827430689},{"$f":"IF(ISNA($A23),\"\",IFERROR(SUMIFS(D_D[DEC],D_D[MT],5,D_D[CAT],SMS, D_D[EP],499,D_D[LOC],$A23)/$E23,0))","v":9.617986470354159E-2},{"$f":"IF(ISNA($A23),\"\",IFERROR(SUMIFS(D_D[AWD],D_D[MT],5,D_D[CAT],SMS, D_D[EP],499,D_D[LOC],$A23)/$E23,0))","v":6.6454436927974531E-3},{"$f":"IF(ISNA($A23),\"\",IFERROR(SUMIFS(D_D[AUT],D_D[MT],5,D_D[CAT],SMS, D_D[EP],499,D_D[LOC],$A23)/$E23,0))","v":2.7191935269929701E-3}]
["CA344",11,0,"Los Angeles RO",{"$f":"IF(ISNA($A24),\"\",IFERROR(SUMIFS(D_D[INV],D_D[MT],5,D_D[CAT],SMS, D_D[EP],499,D_D[LOC],$A24),0))","v":900},{"$f":"IF(ISNA($A24),\"\",IFERROR(SUMIFS(D_D[BL],D_D[MT],5,D_D[CAT],SMS, D_D[EP],499,D_D[LOC],$A24),0))","v":116},0.12888888888888889,{"$f":"IF(ISNA($A24),\"\",IFERROR(SUMIFS(D_D[DEV],D_D[MT],5,D_D[CAT],SMS, D_D[EP],499,D_D[LOC],$A24)/$E24,0))","v":0.57444444444444442},{"$f":"IF(ISNA($A24),\"\",IFERROR(SUMIFS(D_D[EVD],D_D[MT],5,D_D[CAT],SMS, D_D[EP],499,D_D[LOC],$A24)/$E24,0))","v":0.29333333333333333},{"$f":"IF(ISNA($A24),\"\",IFERROR(SUMIFS(D_D[DEC],D_D[MT],5,D_D[CAT],SMS, D_D[EP],499,D_D[LOC],$A24)/$E24,0))","v":0.12555555555555556},{"$f":"IF(ISNA($A24),\"\",IFERROR(SUMIFS(D_D[AWD],D_D[MT],5,D_D[CAT],SMS, D_D[EP],499,D_D[LOC],$A24)/$E24,0))","v":3.3333333333333335E-3},{"$f":"IF(ISNA($A24),\"\",IFERROR(SUMIFS(D_D[AUT],D_D[MT],5,D_D[CAT],SMS, D_D[EP],499,D_D[LOC],$A24)/$E24,0))","v":3.3333333333333335E-3}]
["CA343",12,0,"Oakland RO",{"$f":"IF(ISNA($A25),\"\",IFERROR(SUMIFS(D_D[INV],D_D[MT],5,D_D[CAT],SMS, D_D[EP],499,D_D[LOC],$A25),0))","v":781},{"$f":"IF(ISNA($A25),\"\",IFERROR(SUMIFS(D_D[BL],D_D[MT],5,D_D[CAT],SMS, D_D[EP],499,D_D[LOC],$A25),0))","v":65},8.3226632522407168E-2,{"$f":"IF(ISNA($A25),\"\",IFERROR(SUMIFS(D_D[DEV],D_D[MT],5,D_D[CAT],SMS, D_D[EP],499,D_D[LOC],$A25)/$E25,0))","v":0.65941101152368753},{"$f":"IF(ISNA($A25),\"\",IFERROR(SUMIFS(D_D[EVD],D_D[MT],5,D_D[CAT],SMS, D_D[EP],499,D_D[LOC],$A25)/$E25,0))","v":0.24583866837387963},{"$f":"IF(ISNA($A25),\"\",IFERROR(SUMIFS(D_D[DEC],D_D[MT],5,D_D[CAT],SMS, D_D[EP],499,D_D[LOC],$A25)/$E25,0))","v":8.5787451984635082E-2},{"$f":"IF(ISNA($A25),\"\",IFERROR(SUMIFS(D_D[AWD],D_D[MT],5,D_D[CAT],SMS, D_D[EP],499,D_D[LOC],$A25)/$E25,0))","v":5.1216389244558257E-3},{"$f":"IF(ISNA($A25),\"\",IFERROR(SUMIFS(D_D[AUT],D_D[MT],5,D_D[CAT],SMS, D_D[EP],499,D_D[LOC],$A25)/$E25,0))","v":3.8412291933418692E-3}]
["CA377",13," ","San Diego RO",{"$f":"IF(ISNA($A26),\"\",IFERROR(SUMIFS(D_D[INV],D_D[MT],5,D_D[CAT],SMS, D_D[EP],499,D_D[LOC],$A26),0))","v":1269},{"$f":"IF(ISNA($A26),\"\",IFERROR(SUMIFS(D_D[BL],D_D[MT],5,D_D[CAT],SMS, D_D[EP],499,D_D[LOC],$A26),0))","v":316},0.24901497241922774,{"$f":"IF(ISNA($A26),\"\",IFERROR(SUMIFS(D_D[DEV],D_D[MT],5,D_D[CAT],SMS, D_D[EP],499,D_D[LOC],$A26)/$E26,0))","v":0.44208037825059104},{"$f":"IF(ISNA($A26),\"\",IFERROR(SUMIFS(D_D[EVD],D_D[MT],5,D_D[CAT],SMS, D_D[EP],499,D_D[LOC],$A26)/$E26,0))","v":0.35697399527186763},{"$f":"IF(ISNA($A26),\"\",IFERROR(SUMIFS(D_D[DEC],D_D[MT],5,D_D[CAT],SMS, D_D[EP],499,D_D[LOC],$A26)/$E26,0))","v":0.18282111899133174},{"$f":"IF(ISNA($A26),\"\",IFERROR(SUMIFS(D_D[AWD],D_D[MT],5,D_D[CAT],SMS, D_D[EP],499,D_D[LOC],$A26)/$E26,0))","v":1.260835303388495E-2},{"$f":"IF(ISNA($A26),\"\",IFERROR(SUMIFS(D_D[AUT],D_D[MT],5,D_D[CAT],SMS, D_D[EP],499,D_D[LOC],$A26)/$E26,0))","v":5.5161544523246652E-3}]
["CA-1",14," ","California-Other RO",{"$f":"IF(ISNA($A27),\"\",IFERROR(SUMIFS(D_D[INV],D_D[MT],5,D_D[CAT],SMS, D_D[EP],499,D_D[LOC],$A27),0))","v":11473},{"$f":"IF(ISNA($A27),\"\",IFERROR(SUMIFS(D_D[BL],D_D[MT],5,D_D[CAT],SMS, D_D[EP],499,D_D[LOC],$A27),0))","v":4161},0.36267759086551032,{"$f":"IF(ISNA($A27),\"\",IFERROR(SUMIFS(D_D[DEV],D_D[MT],5,D_D[CAT],SMS, D_D[EP],499,D_D[LOC],$A27)/$E27,0))","v":0.22766495249716726},{"$f":"IF(ISNA($A27),\"\",IFERROR(SUMIFS(D_D[EVD],D_D[MT],5,D_D[CAT],SMS, D_D[EP],499,D_D[LOC],$A27)/$E27,0))","v":0.48008367471454721},{"$f":"IF(ISNA($A27),\"\",IFERROR(SUMIFS(D_D[DEC],D_D[MT],5,D_D[CAT],SMS, D_D[EP],499,D_D[LOC],$A27)/$E27,0))","v":0.23585810162991372},{"$f":"IF(ISNA($A27),\"\",IFERROR(SUMIFS(D_D[AWD],D_D[MT],5,D_D[CAT],SMS, D_D[EP],499,D_D[LOC],$A27)/$E27,0))","v":3.9658328248932277E-2},{"$f":"IF(ISNA($A27),\"\",IFERROR(SUMIFS(D_D[AUT],D_D[MT],5,D_D[CAT],SMS, D_D[EP],499,D_D[LOC],$A27)/$E27,0))","v":1.6734942909439554E-2}]
["CA499",15," ",{"$f":"IFERROR(INDEX(INDIRECT(DS_NWQD),B28),\"\")","v":"California-NWQ"},{"$f":"IF(ISNA($A28),\"\",IFERROR(SUMIFS(D_D[INV],D_D[MT],5,D_D[CAT],SMS, D_D[EP],499,D_D[LOC],$A28),0))","v":60967},{"$f":"IF(ISNA($A28),\"\",IFERROR(SUMIFS(D_D[BL],D_D[MT],5,D_D[CAT],SMS, D_D[EP],499,D_D[LOC],$A28),0))","v":17746},{"$f":"IF(ISNA($A28),\"\",IFERROR(F28/E28,0))","v":0.29107549986058029},{"$f":"IF(ISNA($A28),\"\",IFERROR(SUMIFS(D_D[DEV],D_D[MT],5,D_D[CAT],SMS, D_D[EP],499,D_D[LOC],$A28)/$E28,0))","v":0.13397411714534091},{"$f":"IF(ISNA($A28),\"\",IFERROR(SUMIFS(D_D[EVD],D_D[MT],5,D_D[CAT],SMS, D_D[EP],499,D_D[LOC],$A28)/$E28,0))","v":0.79785785752948313},{"$f":"IF(ISNA($A28),\"\",IFERROR(SUMIFS(D_D[DEC],D_D[MT],5,D_D[CAT],SMS, D_D[EP],499,D_D[LOC],$A28)/$E28,0))","v":6.7790772057014448E-2},{"$f":"IF(ISNA($A28),\"\",IFERROR(SUMIFS(D_D[AWD],D_D[MT],5,D_D[CAT],SMS, D_D[EP],499,D_D[LOC],$A28)/$E28,0))","v":3.7725326816146442E-4},{"$f":"IF(ISNA($A28),\"\",IFERROR(SUMIFS(D_D[AUT],D_D[MT],5,D_D[CAT],SMS, D_D[EP],499,D_D[LOC],$A28)/$E28,0))","v":0}]
["HI100",16,"Hawaii","Hawaii-Total",{"$f":"IF(ISNA($A29),\"\",IFERROR(SUMIFS(D_D[INV],D_D[MT],5,D_D[CAT],SMS, D_D[EP],499,D_D[LOC],$A29),0))","v":6130},{"$f":"IF(ISNA($A29),\"\",IFERROR(SUMIFS(D_D[BL],D_D[MT],5,D_D[CAT],SMS, D_D[EP],499,D_D[LOC],$A29),0))","v":1874},0.30570962479608482,{"$f":"IF(ISNA($A29),\"\",IFERROR(SUMIFS(D_D[DEV],D_D[MT],5,D_D[CAT],SMS, D_D[EP],499,D_D[LOC],$A29)/$E29,0))","v":0.16035889070146819},{"$f":"IF(ISNA($A29),\"\",IFERROR(SUMIFS(D_D[EVD],D_D[MT],5,D_D[CAT],SMS, D_D[EP],499,D_D[LOC],$A29)/$E29,0))","v":0.73115823817292003},{"$f":"IF(ISNA($A29),\"\",IFERROR(SUMIFS(D_D[DEC],D_D[MT],5,D_D[CAT],SMS, D_D[EP],499,D_D[LOC],$A29)/$E29,0))","v":9.7063621533442085E-2},{"$f":"IF(ISNA($A29),\"\",IFERROR(SUMIFS(D_D[AWD],D_D[MT],5,D_D[CAT],SMS, D_D[EP],499,D_D[LOC],$A29)/$E29,0))","v":8.3197389885807504E-3},{"$f":"IF(ISNA($A29),\"\",IFERROR(SUMIFS(D_D[AUT],D_D[MT],5,D_D[CAT],SMS, D_D[EP],499,D_D[LOC],$A29)/$E29,0))","v":3.0995106035889069E-3}]
["HI459",17,0,"Honolulu RO",{"$f":"IF(ISNA($A30),\"\",IFERROR(SUMIFS(D_D[INV],D_D[MT],5,D_D[CAT],SMS, D_D[EP],499,D_D[LOC],$A30),0))","v":144},{"$f":"IF(ISNA($A30),\"\",IFERROR(SUMIFS(D_D[BL],D_D[MT],5,D_D[CAT],SMS, D_D[EP],499,D_D[LOC],$A30),0))","v":9},6.25E-2,{"$f":"IF(ISNA($A30),\"\",IFERROR(SUMIFS(D_D[DEV],D_D[MT],5,D_D[CAT],SMS, D_D[EP],499,D_D[LOC],$A30)/$E30,0))","v":0.75},{"$f":"IF(ISNA($A30),\"\",IFERROR(SUMIFS(D_D[EVD],D_D[MT],5,D_D[CAT],SMS, D_D[EP],499,D_D[LOC],$A30)/$E30,0))","v":0.1736111111111111},{"$f":"IF(ISNA($A30),\"\",IFERROR(SUMIFS(D_D[DEC],D_D[MT],5,D_D[CAT],SMS, D_D[EP],499,D_D[LOC],$A30)/$E30,0))","v":7.6388888888888895E-2},{"$f":"IF(ISNA($A30),\"\",IFERROR(SUMIFS(D_D[AWD],D_D[MT],5,D_D[CAT],SMS, D_D[EP],499,D_D[LOC],$A30)/$E30,0))","v":0},{"$f":"IF(ISNA($A30),\"\",IFERROR(SUMIFS(D_D[AUT],D_D[MT],5,D_D[CAT],SMS, D_D[EP],499,D_D[LOC],$A30)/$E30,0))","v":0}]
["HI-1",18,0,"Hawaii-Other RO",{"$f":"IF(ISNA($A31),\"\",IFERROR(SUMIFS(D_D[INV],D_D[MT],5,D_D[CAT],SMS, D_D[EP],499,D_D[LOC],$A31),0))","v":1070},{"$f":"IF(ISNA($A31),\"\",IFERROR(SUMIFS(D_D[BL],D_D[MT],5,D_D[CAT],SMS, D_D[EP],499,D_D[LOC],$A31),0))","v":428},0.4,{"$f":"IF(ISNA($A31),\"\",IFERROR(SUMIFS(D_D[DEV],D_D[MT],5,D_D[CAT],SMS, D_D[EP],499,D_D[LOC],$A31)/$E31,0))","v":0.21682242990654205},{"$f":"IF(ISNA($A31),\"\",IFERROR(SUMIFS(D_D[EVD],D_D[MT],5,D_D[CAT],SMS, D_D[EP],499,D_D[LOC],$A31)/$E31,0))","v":0.49158878504672898},{"$f":"IF(ISNA($A31),\"\",IFERROR(SUMIFS(D_D[DEC],D_D[MT],5,D_D[CAT],SMS, D_D[EP],499,D_D[LOC],$A31)/$E31,0))","v":0.22803738317757008},{"$f":"IF(ISNA($A31),\"\",IFERROR(SUMIFS(D_D[AWD],D_D[MT],5,D_D[CAT],SMS, D_D[EP],499,D_D[LOC],$A31)/$E31,0))","v":4.5794392523364487E-2},{"$f":"IF(ISNA($A31),\"\",IFERROR(SUMIFS(D_D[AUT],D_D[MT],5,D_D[CAT],SMS, D_D[EP],499,D_D[LOC],$A31)/$E31,0))","v":1.7757009345794394E-2}]
["HI499",19,0,"Hawaii-NWQ",{"$f":"IF(ISNA($A32),\"\",IFERROR(SUMIFS(D_D[INV],D_D[MT],5,D_D[CAT],SMS, D_D[EP],499,D_D[LOC],$A32),0))","v":4916},{"$f":"IF(ISNA($A32),\"\",IFERROR(SUMIFS(D_D[BL],D_D[MT],5,D_D[CAT],SMS, D_D[EP],499,D_D[LOC],$A32),0))","v":1437},0.2923108218063466,{"$f":"IF(ISNA($A32),\"\",IFERROR(SUMIFS(D_D[DEV],D_D[MT],5,D_D[CAT],SMS, D_D[EP],499,D_D[LOC],$A32)/$E32,0))","v":0.13079739625711961},{"$f":"IF(ISNA($A32),\"\",IFERROR(SUMIFS(D_D[EVD],D_D[MT],5,D_D[CAT],SMS, D_D[EP],499,D_D[LOC],$A32)/$E32,0))","v":0.79963384865744502},{"$f":"IF(ISNA($A32),\"\",IFERROR(SUMIFS(D_D[DEC],D_D[MT],5,D_D[CAT],SMS, D_D[EP],499,D_D[LOC],$A32)/$E32,0))","v":6.9161920260374293E-2},{"$f":"IF(ISNA($A32),\"\",IFERROR(SUMIFS(D_D[AWD],D_D[MT],5,D_D[CAT],SMS, D_D[EP],499,D_D[LOC],$A32)/$E32,0))","v":4.0683482506102521E-4},{"$f":"IF(ISNA($A32),\"\",IFERROR(SUMIFS(D_D[AUT],D_D[MT],5,D_D[CAT],SMS, D_D[EP],499,D_D[LOC],$A32)/$E32,0))","v":0}]
["ID100",20,"Idaho","Idaho-Total",{"$f":"IF(ISNA($A33),\"\",IFERROR(SUMIFS(D_D[INV],D_D[MT],5,D_D[CAT],SMS, D_D[EP],499,D_D[LOC],$A33),0))","v":5329},{"$f":"IF(ISNA($A33),\"\",IFERROR(SUMIFS(D_D[BL],D_D[MT],5,D_D[CAT],SMS, D_D[EP],499,D_D[LOC],$A33),0))","v":1565},0.29367611184087072,{"$f":"IF(ISNA($A33),\"\",IFERROR(SUMIFS(D_D[DEV],D_D[MT],5,D_D[CAT],SMS, D_D[EP],499,D_D[LOC],$A33)/$E33,0))","v":0.12310001876524676},{"$f":"IF(ISNA($A33),\"\",IFERROR(SUMIFS(D_D[EVD],D_D[MT],5,D_D[CAT],SMS, D_D[EP],499,D_D[LOC],$A33)/$E33,0))","v":0.803715518859073},{"$f":"IF(ISNA($A33),\"\",IFERROR(SUMIFS(D_D[DEC],D_D[MT],5,D_D[CAT],SMS, D_D[EP],499,D_D[LOC],$A33)/$E33,0))","v":6.4740101332332517E-2},{"$f":"IF(ISNA($A33),\"\",IFERROR(SUMIFS(D_D[AWD],D_D[MT],5,D_D[CAT],SMS, D_D[EP],499,D_D[LOC],$A33)/$E33,0))","v":5.62957402889848E-3},{"$f":"IF(ISNA($A33),\"\",IFERROR(SUMIFS(D_D[AUT],D_D[MT],5,D_D[CAT],SMS, D_D[EP],499,D_D[LOC],$A33)/$E33,0))","v":2.81478701444924E-3}]
["ID347",21,0,"Boise RO",{"$f":"IF(ISNA($A34),\"\",IFERROR(SUMIFS(D_D[INV],D_D[MT],5,D_D[CAT],SMS, D_D[EP],499,D_D[LOC],$A34),0))","v":106},{"$f":"IF(ISNA($A34),\"\",IFERROR(SUMIFS(D_D[BL],D_D[MT],5,D_D[CAT],SMS, D_D[EP],499,D_D[LOC],$A34),0))","v":5},4.716981132075472E-2,{"$f":"IF(ISNA($A34),\"\",IFERROR(SUMIFS(D_D[DEV],D_D[MT],5,D_D[CAT],SMS, D_D[EP],499,D_D[LOC],$A34)/$E34,0))","v":0.87735849056603776},{"$f":"IF(ISNA($A34),\"\",IFERROR(SUMIFS(D_D[EVD],D_D[MT],5,D_D[CAT],SMS, D_D[EP],499,D_D[LOC],$A34)/$E34,0))","v":4.716981132075472E-2},{"$f":"IF(ISNA($A34),\"\",IFERROR(SUMIFS(D_D[DEC],D_D[MT],5,D_D[CAT],SMS, D_D[EP],499,D_D[LOC],$A34)/$E34,0))","v":4.716981132075472E-2},{"$f":"IF(ISNA($A34),\"\",IFERROR(SUMIFS(D_D[AWD],D_D[MT],5,D_D[CAT],SMS, D_D[EP],499,D_D[LOC],$A34)/$E34,0))","v":9.433962264150943E-3},{"$f":"IF(ISNA($A34),\"\",IFERROR(SUMIFS(D_D[AUT],D_D[MT],5,D_D[CAT],SMS, D_D[EP],499,D_D[LOC],$A34)/$E34,0))","v":1.8867924528301886E-2}]
["ID-1",22,0,"Idaho-Other RO",{"$f":"IF(ISNA($A35),\"\",IFERROR(SUMIFS(D_D[INV],D_D[MT],5,D_D[CAT],SMS, D_D[EP],499,D_D[LOC],$A35),0))","v":893},{"$f":"IF(ISNA($A35),\"\",IFERROR(SUMIFS(D_D[BL],D_D[MT],5,D_D[CAT],SMS, D_D[EP],499,D_D[LOC],$A35),0))","v":357},0.39977603583426652,{"$f":"IF(ISNA($A35),\"\",IFERROR(SUMIFS(D_D[DEV],D_D[MT],5,D_D[CAT],SMS, D_D[EP],499,D_D[LOC],$A35)/$E35,0))","v":0.18253079507278835},{"$f":"IF(ISNA($A35),\"\",IFERROR(SUMIFS(D_D[EVD],D_D[MT],5,D_D[CAT],SMS, D_D[EP],499,D_D[LOC],$A35)/$E35,0))","v":0.52295632698768202},{"$f":"IF(ISNA($A35),\"\",IFERROR(SUMIFS(D_D[DEC],D_D[MT],5,D_D[CAT],SMS, D_D[EP],499,D_D[LOC],$A35)/$E35,0))","v":0.24972004479283313},{"$f":"IF(ISNA($A35),\"\",IFERROR(SUMIFS(D_D[AWD],D_D[MT],5,D_D[CAT],SMS, D_D[EP],499,D_D[LOC],$A35)/$E35,0))","v":3.0235162374020158E-2},{"$f":"IF(ISNA($A35),\"\",IFERROR(SUMIFS(D_D[AUT],D_D[MT],5,D_D[CAT],SMS, D_D[EP],499,D_D[LOC],$A35)/$E35,0))","v":1.4557670772676373E-2}]
["ID499",23,0,"Idaho-NWQ",{"$f":"IF(ISNA($A36),\"\",IFERROR(SUMIFS(D_D[INV],D_D[MT],5,D_D[CAT],SMS, D_D[EP],499,D_D[LOC],$A36),0))","v":4330},{"$f":"IF(ISNA($A36),\"\",IFERROR(SUMIFS(D_D[BL],D_D[MT],5,D_D[CAT],SMS, D_D[EP],499,D_D[LOC],$A36),0))","v":1203},0.27782909930715938,{"$f":"IF(ISNA($A36),\"\",IFERROR(SUMIFS(D_D[DEV],D_D[MT],5,D_D[CAT],SMS, D_D[EP],499,D_D[LOC],$A36)/$E36,0))","v":9.237875288683603E-2},{"$f":"IF(ISNA($A36),\"\",IFERROR(SUMIFS(D_D[EVD],D_D[MT],5,D_D[CAT],SMS, D_D[EP],499,D_D[LOC],$A36)/$E36,0))","v":0.88013856812933022},{"$f":"IF(ISNA($A36),\"\",IFERROR(SUMIFS(D_D[DEC],D_D[MT],5,D_D[CAT],SMS, D_D[EP],499,D_D[LOC],$A36)/$E36,0))","v":2.7020785219399539E-2},{"$f":"IF(ISNA($A36),\"\",IFERROR(SUMIFS(D_D[AWD],D_D[MT],5,D_D[CAT],SMS, D_D[EP],499,D_D[LOC],$A36)/$E36,0))","v":4.6189376443418013E-4},{"$f":"IF(ISNA($A36),\"\",IFERROR(SUMIFS(D_D[AUT],D_D[MT],5,D_D[CAT],SMS, D_D[EP],499,D_D[LOC],$A36)/$E36,0))","v":0}]
["NV100",24,"Nevada","Nevada-Total",{"$f":"IF(ISNA($A37),\"\",IFERROR(SUMIFS(D_D[INV],D_D[MT],5,D_D[CAT],SMS, D_D[EP],499,D_D[LOC],$A37),0))","v":12937},{"$f":"IF(ISNA($A37),\"\",IFERROR(SUMIFS(D_D[BL],D_D[MT],5,D_D[CAT],SMS, D_D[EP],499,D_D[LOC],$A37),0))","v":4044},0.31259179098709128,{"$f":"IF(ISNA($A37),\"\",IFERROR(SUMIFS(D_D[DEV],D_D[MT],5,D_D[CAT],SMS, D_D[EP],499,D_D[LOC],$A37)/$E37,0))","v":0.15714616990028601},{"$f":"IF(ISNA($A37),\"\",IFERROR(SUMIFS(D_D[EVD],D_D[MT],5,D_D[CAT],SMS, D_D[EP],499,D_D[LOC],$A37)/$E37,0))","v":0.72868516657648608},{"$f":"IF(ISNA($A37),\"\",IFERROR(SUMIFS(D_D[DEC],D_D[MT],5,D_D[CAT],SMS, D_D[EP],499,D_D[LOC],$A37)/$E37,0))","v":0.10373347762232357},{"$f":"IF(ISNA($A37),\"\",IFERROR(SUMIFS(D_D[AWD],D_D[MT],5,D_D[CAT],SMS, D_D[EP],499,D_D[LOC],$A37)/$E37,0))","v":7.6524696606632137E-3},{"$f":"IF(ISNA($A37),\"\",IFERROR(SUMIFS(D_D[AUT],D_D[MT],5,D_D[CAT],SMS, D_D[EP],499,D_D[LOC],$A37)/$E37,0))","v":2.7827162402411687E-3}]
["NV354",25,0,"Reno RO",{"$f":"IF(ISNA($A38),\"\",IFERROR(SUMIFS(D_D[INV],D_D[MT],5,D_D[CAT],SMS, D_D[EP],499,D_D[LOC],$A38),0))","v":246},{"$f":"IF(ISNA($A38),\"\",IFERROR(SUMIFS(D_D[BL],D_D[MT],5,D_D[CAT],SMS, D_D[EP],499,D_D[LOC],$A38),0))","v":16},6.5040650406504072E-2,{"$f":"IF(ISNA($A38),\"\",IFERROR(SUMIFS(D_D[DEV],D_D[MT],5,D_D[CAT],SMS, D_D[EP],499,D_D[LOC],$A38)/$E38,0))","v":0.78048780487804881},{"$f":"IF(ISNA($A38),\"\",IFERROR(SUMIFS(D_D[EVD],D_D[MT],5,D_D[CAT],SMS, D_D[EP],499,D_D[LOC],$A38)/$E38,0))","v":0.11788617886178862},{"$f":"IF(ISNA($A38),\"\",IFERROR(SUMIFS(D_D[DEC],D_D[MT],5,D_D[CAT],SMS, D_D[EP],499,D_D[LOC],$A38)/$E38,0))","v":8.943089430894309E-2},{"$f":"IF(ISNA($A38),\"\",IFERROR(SUMIFS(D_D[AWD],D_D[MT],5,D_D[CAT],SMS, D_D[EP],499,D_D[LOC],$A38)/$E38,0))","v":8.130081300813009E-3},{"$f":"IF(ISNA($A38),\"\",IFERROR(SUMIFS(D_D[AUT],D_D[MT],5,D_D[CAT],SMS, D_D[EP],499,D_D[LOC],$A38)/$E38,0))","v":4.0650406504065045E-3}]
["NV-1",26,0,"Nevada-Other RO",{"$f":"IF(ISNA($A39),\"\",IFERROR(SUMIFS(D_D[INV],D_D[MT],5,D_D[CAT],SMS, D_D[EP],499,D_D[LOC],$A39),0))","v":2270},{"$f":"IF(ISNA($A39),\"\",IFERROR(SUMIFS(D_D[BL],D_D[MT],5,D_D[CAT],SMS, D_D[EP],499,D_D[LOC],$A39),0))","v":837},0.36872246696035244,{"$f":"IF(ISNA($A39),\"\",IFERROR(SUMIFS(D_D[DEV],D_D[MT],5,D_D[CAT],SMS, D_D[EP],499,D_D[LOC],$A39)/$E39,0))","v":0.23700440528634362},{"$f":"IF(ISNA($A39),\"\",IFERROR(SUMIFS(D_D[EVD],D_D[MT],5,D_D[CAT],SMS, D_D[EP],499,D_D[LOC],$A39)/$E39,0))","v":0.47180616740088105},{"$f":"IF(ISNA($A39),\"\",IFERROR(SUMIFS(D_D[DEC],D_D[MT],5,D_D[CAT],SMS, D_D[EP],499,D_D[LOC],$A39)/$E39,0))","v":0.23480176211453743},{"$f":"IF(ISNA($A39),\"\",IFERROR(SUMIFS(D_D[AWD],D_D[MT],5,D_D[CAT],SMS, D_D[EP],499,D_D[LOC],$A39)/$E39,0))","v":4.0969162995594714E-2},{"$f":"IF(ISNA($A39),\"\",IFERROR(SUMIFS(D_D[AUT],D_D[MT],5,D_D[CAT],SMS, D_D[EP],499,D_D[LOC],$A39)/$E39,0))","v":1.5418502202643172E-2}]
["NV499",27,0,"Nevada-NWQ",{"$f":"IF(ISNA($A40),\"\",IFERROR(SUMIFS(D_D[INV],D_D[MT],5,D_D[CAT],SMS, D_D[EP],499,D_D[LOC],$A40),0))","v":10421},{"$f":"IF(ISNA($A40),\"\",IFERROR(SUMIFS(D_D[BL],D_D[MT],5,D_D[CAT],SMS, D_D[EP],499,D_D[LOC],$A40),0))","v":3191},0.30620861721523845,{"$f":"IF(ISNA($A40),\"\",IFERROR(SUMIFS(D_D[DEV],D_D[MT],5,D_D[CAT],SMS, D_D[EP],499,D_D[LOC],$A40)/$E40,0))","v":0.12503598503022742},{"$f":"IF(ISNA($A40),\"\",IFERROR(SUMIFS(D_D[EVD],D_D[MT],5,D_D[CAT],SMS, D_D[EP],499,D_D[LOC],$A40)/$E40,0))","v":0.79905959121005665},{"$f":"IF(ISNA($A40),\"\",IFERROR(SUMIFS(D_D[DEC],D_D[MT],5,D_D[CAT],SMS, D_D[EP],499,D_D[LOC],$A40)/$E40,0))","v":7.5520583437290081E-2},{"$f":"IF(ISNA($A40),\"\",IFERROR(SUMIFS(D_D[AWD],D_D[MT],5,D_D[CAT],SMS, D_D[EP],499,D_D[LOC],$A40)/$E40,0))","v":3.8384032242587082E-4},{"$f":"IF(ISNA($A40),\"\",IFERROR(SUMIFS(D_D[AUT],D_D[MT],5,D_D[CAT],SMS, D_D[EP],499,D_D[LOC],$A40)/$E40,0))","v":0}]
["NM100",28,"New Mexico","New Mexico-Total",{"$f":"IF(ISNA($A41),\"\",IFERROR(SUMIFS(D_D[INV],D_D[MT],5,D_D[CAT],SMS, D_D[EP],499,D_D[LOC],$A41),0))","v":7122},{"$f":"IF(ISNA($A41),\"\",IFERROR(SUMIFS(D_D[BL],D_D[MT],5,D_D[CAT],SMS, D_D[EP],499,D_D[LOC],$A41),0))","v":2347},0.32954226340915471,{"$f":"IF(ISNA($A41),\"\",IFERROR(SUMIFS(D_D[DEV],D_D[MT],5,D_D[CAT],SMS, D_D[EP],499,D_D[LOC],$A41)/$E41,0))","v":0.16610502667789948},{"$f":"IF(ISNA($A41),\"\",IFERROR(SUMIFS(D_D[EVD],D_D[MT],5,D_D[CAT],SMS, D_D[EP],499,D_D[LOC],$A41)/$E41,0))","v":0.73041280539174391},{"$f":"IF(ISNA($A41),\"\",IFERROR(SUMIFS(D_D[DEC],D_D[MT],5,D_D[CAT],SMS, D_D[EP],499,D_D[LOC],$A41)/$E41,0))","v":9.3793878124122432E-2},{"$f":"IF(ISNA($A41),\"\",IFERROR(SUMIFS(D_D[AWD],D_D[MT],5,D_D[CAT],SMS, D_D[EP],499,D_D[LOC],$A41)/$E41,0))","v":6.5992698680146025E-3},{"$f":"IF(ISNA($A41),\"\",IFERROR(SUMIFS(D_D[AUT],D_D[MT],5,D_D[CAT],SMS, D_D[EP],499,D_D[LOC],$A41)/$E41,0))","v":3.0890199382196011E-3}]
["NM340",29,0,"Albuquerque RO",{"$f":"IF(ISNA($A42),\"\",IFERROR(SUMIFS(D_D[INV],D_D[MT],5,D_D[CAT],SMS, D_D[EP],499,D_D[LOC],$A42),0))","v":170},{"$f":"IF(ISNA($A42),\"\",IFERROR(SUMIFS(D_D[BL],D_D[MT],5,D_D[CAT],SMS, D_D[EP],499,D_D[LOC],$A42),0))","v":8},4.7058823529411764E-2,{"$f":"IF(ISNA($A42),\"\",IFERROR(SUMIFS(D_D[DEV],D_D[MT],5,D_D[CAT],SMS, D_D[EP],499,D_D[LOC],$A42)/$E42,0))","v":0.76470588235294112},{"$f":"IF(ISNA($A42),\"\",IFERROR(SUMIFS(D_D[EVD],D_D[MT],5,D_D[CAT],SMS, D_D[EP],499,D_D[LOC],$A42)/$E42,0))","v":0.19411764705882353},{"$f":"IF(ISNA($A42),\"\",IFERROR(SUMIFS(D_D[DEC],D_D[MT],5,D_D[CAT],SMS, D_D[EP],499,D_D[LOC],$A42)/$E42,0))","v":3.5294117647058823E-2},{"$f":"IF(ISNA($A42),\"\",IFERROR(SUMIFS(D_D[AWD],D_D[MT],5,D_D[CAT],SMS, D_D[EP],499,D_D[LOC],$A42)/$E42,0))","v":5.8823529411764705E-3},{"$f":"IF(ISNA($A42),\"\",IFERROR(SUMIFS(D_D[AUT],D_D[MT],5,D_D[CAT],SMS, D_D[EP],499,D_D[LOC],$A42)/$E42,0))","v":0}]
["NM-1",30,0,"New Mexico-Other RO",{"$f":"IF(ISNA($A43),\"\",IFERROR(SUMIFS(D_D[INV],D_D[MT],5,D_D[CAT],SMS, D_D[EP],499,D_D[LOC],$A43),0))","v":1187},{"$f":"IF(ISNA($A43),\"\",IFERROR(SUMIFS(D_D[BL],D_D[MT],5,D_D[CAT],SMS, D_D[EP],499,D_D[LOC],$A43),0))","v":481},0.40522325189553499,{"$f":"IF(ISNA($A43),\"\",IFERROR(SUMIFS(D_D[DEV],D_D[MT],5,D_D[CAT],SMS, D_D[EP],499,D_D[LOC],$A43)/$E43,0))","v":0.22409435551811288},{"$f":"IF(ISNA($A43),\"\",IFERROR(SUMIFS(D_D[EVD],D_D[MT],5,D_D[CAT],SMS, D_D[EP],499,D_D[LOC],$A43)/$E43,0))","v":0.49031171019376579},{"$f":"IF(ISNA($A43),\"\",IFERROR(SUMIFS(D_D[DEC],D_D[MT],5,D_D[CAT],SMS, D_D[EP],499,D_D[LOC],$A43)/$E43,0))","v":0.23167649536647009},{"$f":"IF(ISNA($A43),\"\",IFERROR(SUMIFS(D_D[AWD],D_D[MT],5,D_D[CAT],SMS, D_D[EP],499,D_D[LOC],$A43)/$E43,0))","v":3.5383319292333612E-2},{"$f":"IF(ISNA($A43),\"\",IFERROR(SUMIFS(D_D[AUT],D_D[MT],5,D_D[CAT],SMS, D_D[EP],499,D_D[LOC],$A43)/$E43,0))","v":1.8534119629317607E-2}]
["NM499",31,0,"New Mexico-NWQ",{"$f":"IF(ISNA($A44),\"\",IFERROR(SUMIFS(D_D[INV],D_D[MT],5,D_D[CAT],SMS, D_D[EP],499,D_D[LOC],$A44),0))","v":5765},{"$f":"IF(ISNA($A44),\"\",IFERROR(SUMIFS(D_D[BL],D_D[MT],5,D_D[CAT],SMS, D_D[EP],499,D_D[LOC],$A44),0))","v":1858},0.32228967909800521,{"$f":"IF(ISNA($A44),\"\",IFERROR(SUMIFS(D_D[DEV],D_D[MT],5,D_D[CAT],SMS, D_D[EP],499,D_D[LOC],$A44)/$E44,0))","v":0.13651344319167388},{"$f":"IF(ISNA($A44),\"\",IFERROR(SUMIFS(D_D[EVD],D_D[MT],5,D_D[CAT],SMS, D_D[EP],499,D_D[LOC],$A44)/$E44,0))","v":0.7956634865568083},{"$f":"IF(ISNA($A44),\"\",IFERROR(SUMIFS(D_D[DEC],D_D[MT],5,D_D[CAT],SMS, D_D[EP],499,D_D[LOC],$A44)/$E44,0))","v":6.7129228100607105E-2},{"$f":"IF(ISNA($A44),\"\",IFERROR(SUMIFS(D_D[AWD],D_D[MT],5,D_D[CAT],SMS, D_D[EP],499,D_D[LOC],$A44)/$E44,0))","v":6.9384215091066782E-4},{"$f":"IF(ISNA($A44),\"\",IFERROR(SUMIFS(D_D[AUT],D_D[MT],5,D_D[CAT],SMS, D_D[EP],499,D_D[LOC],$A44)/$E44,0))","v":0}]
["OR100",32,"Oregon","Oregon-Total",{"$f":"IF(ISNA($A45),\"\",IFERROR(SUMIFS(D_D[INV],D_D[MT],5,D_D[CAT],SMS, D_D[EP],499,D_D[LOC],$A45),0))","v":9706},{"$f":"IF(ISNA($A45),\"\",IFERROR(SUMIFS(D_D[BL],D_D[MT],5,D_D[CAT],SMS, D_D[EP],499,D_D[LOC],$A45),0))","v":3014},0.31052956933855347,{"$f":"IF(ISNA($A45),\"\",IFERROR(SUMIFS(D_D[DEV],D_D[MT],5,D_D[CAT],SMS, D_D[EP],499,D_D[LOC],$A45)/$E45,0))","v":0.13950133937770451},{"$f":"IF(ISNA($A45),\"\",IFERROR(SUMIFS(D_D[EVD],D_D[MT],5,D_D[CAT],SMS, D_D[EP],499,D_D[LOC],$A45)/$E45,0))","v":0.78889346795796411},{"$f":"IF(ISNA($A45),\"\",IFERROR(SUMIFS(D_D[DEC],D_D[MT],5,D_D[CAT],SMS, D_D[EP],499,D_D[LOC],$A45)/$E45,0))","v":6.3259839274675461E-2},{"$f":"IF(ISNA($A45),\"\",IFERROR(SUMIFS(D_D[AWD],D_D[MT],5,D_D[CAT],SMS, D_D[EP],499,D_D[LOC],$A45)/$E45,0))","v":6.0787141974036679E-3},{"$f":"IF(ISNA($A45),\"\",IFERROR(SUMIFS(D_D[AUT],D_D[MT],5,D_D[CAT],SMS, D_D[EP],499,D_D[LOC],$A45)/$E45,0))","v":2.266639192252215E-3}]
["OR348",33,0,"Portland RO",{"$f":"IF(ISNA($A46),\"\",IFERROR(SUMIFS(D_D[INV],D_D[MT],5,D_D[CAT],SMS, D_D[EP],499,D_D[LOC],$A46),0))","v":261},{"$f":"IF(ISNA($A46),\"\",IFERROR(SUMIFS(D_D[BL],D_D[MT],5,D_D[CAT],SMS, D_D[EP],499,D_D[LOC],$A46),0))","v":28},0.10727969348659004,{"$f":"IF(ISNA($A46),\"\",IFERROR(SUMIFS(D_D[DEV],D_D[MT],5,D_D[CAT],SMS, D_D[EP],499,D_D[LOC],$A46)/$E46,0))","v":0.70498084291187735},{"$f":"IF(ISNA($A46),\"\",IFERROR(SUMIFS(D_D[EVD],D_D[MT],5,D_D[CAT],SMS, D_D[EP],499,D_D[LOC],$A46)/$E46,0))","v":0.21455938697318008},{"$f":"IF(ISNA($A46),\"\",IFERROR(SUMIFS(D_D[DEC],D_D[MT],5,D_D[CAT],SMS, D_D[EP],499,D_D[LOC],$A46)/$E46,0))","v":8.0459770114942528E-2},{"$f":"IF(ISNA($A46),\"\",IFERROR(SUMIFS(D_D[AWD],D_D[MT],5,D_D[CAT],SMS, D_D[EP],499,D_D[LOC],$A46)/$E46,0))","v":0},{"$f":"IF(ISNA($A46),\"\",IFERROR(SUMIFS(D_D[AUT],D_D[MT],5,D_D[CAT],SMS, D_D[EP],499,D_D[LOC],$A46)/$E46,0))","v":0}]
[{"$f":"IFERROR(INDEX(INDIRECT(DS_NWQI),B47),#N/A)","v":"OR-1"},34,0,"Oregon-Other RO",{"$f":"IF(ISNA($A47),\"\",IFERROR(SUMIFS(D_D[INV],D_D[MT],5,D_D[CAT],SMS, D_D[EP],499,D_D[LOC],$A47),0))","v":1602},{"$f":"IF(ISNA($A47),\"\",IFERROR(SUMIFS(D_D[BL],D_D[MT],5,D_D[CAT],SMS, D_D[EP],499,D_D[LOC],$A47),0))","v":611},0.38139825218476903,{"$f":"IF(ISNA($A47),\"\",IFERROR(SUMIFS(D_D[DEV],D_D[MT],5,D_D[CAT],SMS, D_D[EP],499,D_D[LOC],$A47)/$E47,0))","v":0.24406991260923847},{"$f":"IF(ISNA($A47),\"\",IFERROR(SUMIFS(D_D[EVD],D_D[MT],5,D_D[CAT],SMS, D_D[EP],499,D_D[LOC],$A47)/$E47,0))","v":0.49875156054931336},{"$f":"IF(ISNA($A47),\"\",IFERROR(SUMIFS(D_D[DEC],D_D[MT],5,D_D[CAT],SMS, D_D[EP],499,D_D[LOC],$A47)/$E47,0))","v":0.20786516853932585},{"$f":"IF(ISNA($A47),\"\",IFERROR(SUMIFS(D_D[AWD],D_D[MT],5,D_D[CAT],SMS, D_D[EP],499,D_D[LOC],$A47)/$E47,0))","v":3.5580524344569285E-2},{"$f":"IF(ISNA($A47),\"\",IFERROR(SUMIFS(D_D[AUT],D_D[MT],5,D_D[CAT],SMS, D_D[EP],499,D_D[LOC],$A47)/$E47,0))","v":1.3732833957553059E-2}]
["OR499",35,0,"Oregon-NWQ",{"$f":"IF(ISNA($A48),\"\",IFERROR(SUMIFS(D_D[INV],D_D[MT],5,D_D[CAT],SMS, D_D[EP],499,D_D[LOC],$A48),0))","v":7843},{"$f":"IF(ISNA($A48),\"\",IFERROR(SUMIFS(D_D[BL],D_D[MT],5,D_D[CAT],SMS, D_D[EP],499,D_D[LOC],$A48),0))","v":2375},0.30281779931148795,{"$f":"IF(ISNA($A48),\"\",IFERROR(SUMIFS(D_D[DEV],D_D[MT],5,D_D[CAT],SMS, D_D[EP],499,D_D[LOC],$A48)/$E48,0))","v":9.932423817416805E-2},{"$f":"IF(ISNA($A48),\"\",IFERROR(SUMIFS(D_D[EVD],D_D[MT],5,D_D[CAT],SMS, D_D[EP],499,D_D[LOC],$A48)/$E48,0))","v":0.86727017722810151},{"$f":"IF(ISNA($A48),\"\",IFERROR(SUMIFS(D_D[DEC],D_D[MT],5,D_D[CAT],SMS, D_D[EP],499,D_D[LOC],$A48)/$E48,0))","v":3.3150580135152367E-2},{"$f":"IF(ISNA($A48),\"\",IFERROR(SUMIFS(D_D[AWD],D_D[MT],5,D_D[CAT],SMS, D_D[EP],499,D_D[LOC],$A48)/$E48,0))","v":2.550044625780951E-4},{"$f":"IF(ISNA($A48),\"\",IFERROR(SUMIFS(D_D[AUT],D_D[MT],5,D_D[CAT],SMS, D_D[EP],499,D_D[LOC],$A48)/$E48,0))","v":0}]
["PI100",36,"Philippines",{"$f":"IFERROR(INDEX(INDIRECT(DS_NWQD),B49),\"\")","v":"Philippines-Total"},{"$f":"IF(ISNA($A49),\"\",IFERROR(SUMIFS(D_D[INV],D_D[MT],5,D_D[CAT],SMS, D_D[EP],499,D_D[LOC],$A49),0))","v":2},{"$f":"IF(ISNA($A49),\"\",IFERROR(SUMIFS(D_D[BL],D_D[MT],5,D_D[CAT],SMS, D_D[EP],499,D_D[LOC],$A49),0))","v":0},{"$f":"IF(ISNA($A49),\"\",IFERROR(F49/E49,0))","v":0},{"$f":"IF(ISNA($A49),\"\",IFERROR(SUMIFS(D_D[DEV],D_D[MT],5,D_D[CAT],SMS, D_D[EP],499,D_D[LOC],$A49)/$E49,0))","v":0.5},{"$f":"IF(ISNA($A49),\"\",IFERROR(SUMIFS(D_D[EVD],D_D[MT],5,D_D[CAT],SMS, D_D[EP],499,D_D[LOC],$A49)/$E49,0))","v":0.5},{"$f":"IF(ISNA($A49),\"\",IFERROR(SUMIFS(D_D[DEC],D_D[MT],5,D_D[CAT],SMS, D_D[EP],499,D_D[LOC],$A49)/$E49,0))","v":0},{"$f":"IF(ISNA($A49),\"\",IFERROR(SUMIFS(D_D[AWD],D_D[MT],5,D_D[CAT],SMS, D_D[EP],499,D_D[LOC],$A49)/$E49,0))","v":0},{"$f":"IF(ISNA($A49),\"\",IFERROR(SUMIFS(D_D[AUT],D_D[MT],5,D_D[CAT],SMS, D_D[EP],499,D_D[LOC],$A49)/$E49,0))","v":0}]
["PI358",37,0,"Manila RO",{"$f":"IF(ISNA($A50),\"\",IFERROR(SUMIFS(D_D[INV],D_D[MT],5,D_D[CAT],SMS, D_D[EP],499,D_D[LOC],$A50),0))","v":0},{"$f":"IF(ISNA($A50),\"\",IFERROR(SUMIFS(D_D[BL],D_D[MT],5,D_D[CAT],SMS, D_D[EP],499,D_D[LOC],$A50),0))","v":0},0,{"$f":"IF(ISNA($A50),\"\",IFERROR(SUMIFS(D_D[DEV],D_D[MT],5,D_D[CAT],SMS, D_D[EP],499,D_D[LOC],$A50)/$E50,0))","v":0},{"$f":"IF(ISNA($A50),\"\",IFERROR(SUMIFS(D_D[EVD],D_D[MT],5,D_D[CAT],SMS, D_D[EP],499,D_D[LOC],$A50)/$E50,0))","v":0},{"$f":"IF(ISNA($A50),\"\",IFERROR(SUMIFS(D_D[DEC],D_D[MT],5,D_D[CAT],SMS, D_D[EP],499,D_D[LOC],$A50)/$E50,0))","v":0},{"$f":"IF(ISNA($A50),\"\",IFERROR(SUMIFS(D_D[AWD],D_D[MT],5,D_D[CAT],SMS, D_D[EP],499,D_D[LOC],$A50)/$E50,0))","v":0},{"$f":"IF(ISNA($A50),\"\",IFERROR(SUMIFS(D_D[AUT],D_D[MT],5,D_D[CAT],SMS, D_D[EP],499,D_D[LOC],$A50)/$E50,0))","v":0}]
["PI-1",38,0,"Philippines-Other RO",{"$f":"IF(ISNA($A51),\"\",IFERROR(SUMIFS(D_D[INV],D_D[MT],5,D_D[CAT],SMS, D_D[EP],499,D_D[LOC],$A51),0))","v":2},{"$f":"IF(ISNA($A51),\"\",IFERROR(SUMIFS(D_D[BL],D_D[MT],5,D_D[CAT],SMS, D_D[EP],499,D_D[LOC],$A51),0))","v":0},0,{"$f":"IF(ISNA($A51),\"\",IFERROR(SUMIFS(D_D[DEV],D_D[MT],5,D_D[CAT],SMS, D_D[EP],499,D_D[LOC],$A51)/$E51,0))","v":0.5},{"$f":"IF(ISNA($A51),\"\",IFERROR(SUMIFS(D_D[EVD],D_D[MT],5,D_D[CAT],SMS, D_D[EP],499,D_D[LOC],$A51)/$E51,0))","v":0.5},{"$f":"IF(ISNA($A51),\"\",IFERROR(SUMIFS(D_D[DEC],D_D[MT],5,D_D[CAT],SMS, D_D[EP],499,D_D[LOC],$A51)/$E51,0))","v":0},{"$f":"IF(ISNA($A51),\"\",IFERROR(SUMIFS(D_D[AWD],D_D[MT],5,D_D[CAT],SMS, D_D[EP],499,D_D[LOC],$A51)/$E51,0))","v":0},{"$f":"IF(ISNA($A51),\"\",IFERROR(SUMIFS(D_D[AUT],D_D[MT],5,D_D[CAT],SMS, D_D[EP],499,D_D[LOC],$A51)/$E51,0))","v":0}]
["PI499",39,0,"Philippines-NWQ",{"$f":"IF(ISNA($A52),\"\",IFERROR(SUMIFS(D_D[INV],D_D[MT],5,D_D[CAT],SMS, D_D[EP],499,D_D[LOC],$A52),0))","v":0},{"$f":"IF(ISNA($A52),\"\",IFERROR(SUMIFS(D_D[BL],D_D[MT],5,D_D[CAT],SMS, D_D[EP],499,D_D[LOC],$A52),0))","v":0},0,{"$f":"IF(ISNA($A52),\"\",IFERROR(SUMIFS(D_D[DEV],D_D[MT],5,D_D[CAT],SMS, D_D[EP],499,D_D[LOC],$A52)/$E52,0))","v":0},{"$f":"IF(ISNA($A52),\"\",IFERROR(SUMIFS(D_D[EVD],D_D[MT],5,D_D[CAT],SMS, D_D[EP],499,D_D[LOC],$A52)/$E52,0))","v":0},{"$f":"IF(ISNA($A52),\"\",IFERROR(SUMIFS(D_D[DEC],D_D[MT],5,D_D[CAT],SMS, D_D[EP],499,D_D[LOC],$A52)/$E52,0))","v":0},{"$f":"IF(ISNA($A52),\"\",IFERROR(SUMIFS(D_D[AWD],D_D[MT],5,D_D[CAT],SMS, D_D[EP],499,D_D[LOC],$A52)/$E52,0))","v":0},{"$f":"IF(ISNA($A52),\"\",IFERROR(SUMIFS(D_D[AUT],D_D[MT],5,D_D[CAT],SMS, D_D[EP],499,D_D[LOC],$A52)/$E52,0))","v":0}]
["UT100",40,"Utah","Utah-Total",{"$f":"IF(ISNA($A53),\"\",IFERROR(SUMIFS(D_D[INV],D_D[MT],5,D_D[CAT],SMS, D_D[EP],499,D_D[LOC],$A53),0))","v":6021},{"$f":"IF(ISNA($A53),\"\",IFERROR(SUMIFS(D_D[BL],D_D[MT],5,D_D[CAT],SMS, D_D[EP],499,D_D[LOC],$A53),0))","v":1840},0.30559707689752535,{"$f":"IF(ISNA($A53),\"\",IFERROR(SUMIFS(D_D[DEV],D_D[MT],5,D_D[CAT],SMS, D_D[EP],499,D_D[LOC],$A53)/$E53,0))","v":0.16043846537120079},{"$f":"IF(ISNA($A53),\"\",IFERROR(SUMIFS(D_D[EVD],D_D[MT],5,D_D[CAT],SMS, D_D[EP],499,D_D[LOC],$A53)/$E53,0))","v":0.74373027736256436},{"$f":"IF(ISNA($A53),\"\",IFERROR(SUMIFS(D_D[DEC],D_D[MT],5,D_D[CAT],SMS, D_D[EP],499,D_D[LOC],$A53)/$E53,0))","v":8.7360903504401261E-2},{"$f":"IF(ISNA($A53),\"\",IFERROR(SUMIFS(D_D[AWD],D_D[MT],5,D_D[CAT],SMS, D_D[EP],499,D_D[LOC],$A53)/$E53,0))","v":6.4773293472845045E-3},{"$f":"IF(ISNA($A53),\"\",IFERROR(SUMIFS(D_D[AUT],D_D[MT],5,D_D[CAT],SMS, D_D[EP],499,D_D[LOC],$A53)/$E53,0))","v":1.9930244145490781E-3}]
["UT341",41,0,"Salt Lake City RO",{"$f":"IF(ISNA($A54),\"\",IFERROR(SUMIFS(D_D[INV],D_D[MT],5,D_D[CAT],SMS, D_D[EP],499,D_D[LOC],$A54),0))","v":133},{"$f":"IF(ISNA($A54),\"\",IFERROR(SUMIFS(D_D[BL],D_D[MT],5,D_D[CAT],SMS, D_D[EP],499,D_D[LOC],$A54),0))","v":16},0.12030075187969924,{"$f":"IF(ISNA($A54),\"\",IFERROR(SUMIFS(D_D[DEV],D_D[MT],5,D_D[CAT],SMS, D_D[EP],499,D_D[LOC],$A54)/$E54,0))","v":0.68421052631578949},{"$f":"IF(ISNA($A54),\"\",IFERROR(SUMIFS(D_D[EVD],D_D[MT],5,D_D[CAT],SMS, D_D[EP],499,D_D[LOC],$A54)/$E54,0))","v":0.21804511278195488},{"$f":"IF(ISNA($A54),\"\",IFERROR(SUMIFS(D_D[DEC],D_D[MT],5,D_D[CAT],SMS, D_D[EP],499,D_D[LOC],$A54)/$E54,0))","v":8.2706766917293228E-2},{"$f":"IF(ISNA($A54),\"\",IFERROR(SUMIFS(D_D[AWD],D_D[MT],5,D_D[CAT],SMS, D_D[EP],499,D_D[LOC],$A54)/$E54,0))","v":7.5187969924812026E-3},{"$f":"IF(ISNA($A54),\"\",IFERROR(SUMIFS(D_D[AUT],D_D[MT],5,D_D[CAT],SMS, D_D[EP],499,D_D[LOC],$A54)/$E54,0))","v":7.5187969924812026E-3}]
["UT-1",42,0,"Utah-Other RO",{"$f":"IF(ISNA($A55),\"\",IFERROR(SUMIFS(D_D[INV],D_D[MT],5,D_D[CAT],SMS, D_D[EP],499,D_D[LOC],$A55),0))","v":950},{"$f":"IF(ISNA($A55),\"\",IFERROR(SUMIFS(D_D[BL],D_D[MT],5,D_D[CAT],SMS, D_D[EP],499,D_D[LOC],$A55),0))","v":376},0.39578947368421052,{"$f":"IF(ISNA($A55),\"\",IFERROR(SUMIFS(D_D[DEV],D_D[MT],5,D_D[CAT],SMS, D_D[EP],499,D_D[LOC],$A55)/$E55,0))","v":0.22105263157894736},{"$f":"IF(ISNA($A55),\"\",IFERROR(SUMIFS(D_D[EVD],D_D[MT],5,D_D[CAT],SMS, D_D[EP],499,D_D[LOC],$A55)/$E55,0))","v":0.46631578947368418},{"$f":"IF(ISNA($A55),\"\",IFERROR(SUMIFS(D_D[DEC],D_D[MT],5,D_D[CAT],SMS, D_D[EP],499,D_D[LOC],$A55)/$E55,0))","v":0.26210526315789473},{"$f":"IF(ISNA($A55),\"\",IFERROR(SUMIFS(D_D[AWD],D_D[MT],5,D_D[CAT],SMS, D_D[EP],499,D_D[LOC],$A55)/$E55,0))","v":3.8947368421052633E-2},{"$f":"IF(ISNA($A55),\"\",IFERROR(SUMIFS(D_D[AUT],D_D[MT],5,D_D[CAT],SMS, D_D[EP],499,D_D[LOC],$A55)/$E55,0))","v":1.1578947368421053E-2}]
["UT499",43,0,"Utah-NWQ",{"$f":"IF(ISNA($A56),\"\",IFERROR(SUMIFS(D_D[INV],D_D[MT],5,D_D[CAT],SMS, D_D[EP],499,D_D[LOC],$A56),0))","v":4938},{"$f":"IF(ISNA($A56),\"\",IFERROR(SUMIFS(D_D[BL],D_D[MT],5,D_D[CAT],SMS, D_D[EP],499,D_D[LOC],$A56),0))","v":1448},0.2932361279870393,{"$f":"IF(ISNA($A56),\"\",IFERROR(SUMIFS(D_D[DEV],D_D[MT],5,D_D[CAT],SMS, D_D[EP],499,D_D[LOC],$A56)/$E56,0))","v":0.13466990684487648},{"$f":"IF(ISNA($A56),\"\",IFERROR(SUMIFS(D_D[EVD],D_D[MT],5,D_D[CAT],SMS, D_D[EP],499,D_D[LOC],$A56)/$E56,0))","v":0.81125961927906032},{"$f":"IF(ISNA($A56),\"\",IFERROR(SUMIFS(D_D[DEC],D_D[MT],5,D_D[CAT],SMS, D_D[EP],499,D_D[LOC],$A56)/$E56,0))","v":5.3867962737950588E-2},{"$f":"IF(ISNA($A56),\"\",IFERROR(SUMIFS(D_D[AWD],D_D[MT],5,D_D[CAT],SMS, D_D[EP],499,D_D[LOC],$A56)/$E56,0))","v":2.025111381125962E-4},{"$f":"IF(ISNA($A56),\"\",IFERROR(SUMIFS(D_D[AUT],D_D[MT],5,D_D[CAT],SMS, D_D[EP],499,D_D[LOC],$A56)/$E56,0))","v":0}]
["WA100",44,"Washington","Washington-Total",{"$f":"IF(ISNA($A57),\"\",IFERROR(SUMIFS(D_D[INV],D_D[MT],5,D_D[CAT],SMS, D_D[EP],499,D_D[LOC],$A57),0))","v":20511},{"$f":"IF(ISNA($A57),\"\",IFERROR(SUMIFS(D_D[BL],D_D[MT],5,D_D[CAT],SMS, D_D[EP],499,D_D[LOC],$A57),0))","v":6266},0.30549461264687239,{"$f":"IF(ISNA($A57),\"\",IFERROR(SUMIFS(D_D[DEV],D_D[MT],5,D_D[CAT],SMS, D_D[EP],499,D_D[LOC],$A57)/$E57,0))","v":0.15781775632587391},{"$f":"IF(ISNA($A57),\"\",IFERROR(SUMIFS(D_D[EVD],D_D[MT],5,D_D[CAT],SMS, D_D[EP],499,D_D[LOC],$A57)/$E57,0))","v":0.74403978353078837},{"$f":"IF(ISNA($A57),\"\",IFERROR(SUMIFS(D_D[DEC],D_D[MT],5,D_D[CAT],SMS, D_D[EP],499,D_D[LOC],$A57)/$E57,0))","v":8.7855297157622733E-2},{"$f":"IF(ISNA($A57),\"\",IFERROR(SUMIFS(D_D[AWD],D_D[MT],5,D_D[CAT],SMS, D_D[EP],499,D_D[LOC],$A57)/$E57,0))","v":7.4594120228170246E-3},{"$f":"IF(ISNA($A57),\"\",IFERROR(SUMIFS(D_D[AUT],D_D[MT],5,D_D[CAT],SMS, D_D[EP],499,D_D[LOC],$A57)/$E57,0))","v":2.8277509628979571E-3}]
["WA346",45,0,"Seattle RO",{"$f":"IF(ISNA($A58),\"\",IFERROR(SUMIFS(D_D[INV],D_D[MT],5,D_D[CAT],SMS, D_D[EP],499,D_D[LOC],$A58),0))","v":681},{"$f":"IF(ISNA($A58),\"\",IFERROR(SUMIFS(D_D[BL],D_D[MT],5,D_D[CAT],SMS, D_D[EP],499,D_D[LOC],$A58),0))","v":92},0.13509544787077826,{"$f":"IF(ISNA($A58),\"\",IFERROR(SUMIFS(D_D[DEV],D_D[MT],5,D_D[CAT],SMS, D_D[EP],499,D_D[LOC],$A58)/$E58,0))","v":0.58296622613803228},{"$f":"IF(ISNA($A58),\"\",IFERROR(SUMIFS(D_D[EVD],D_D[MT],5,D_D[CAT],SMS, D_D[EP],499,D_D[LOC],$A58)/$E58,0))","v":0.22907488986784141},{"$f":"IF(ISNA($A58),\"\",IFERROR(SUMIFS(D_D[DEC],D_D[MT],5,D_D[CAT],SMS, D_D[EP],499,D_D[LOC],$A58)/$E58,0))","v":0.13656387665198239},{"$f":"IF(ISNA($A58),\"\",IFERROR(SUMIFS(D_D[AWD],D_D[MT],5,D_D[CAT],SMS, D_D[EP],499,D_D[LOC],$A58)/$E58,0))","v":3.9647577092511016E-2},{"$f":"IF(ISNA($A58),\"\",IFERROR(SUMIFS(D_D[AUT],D_D[MT],5,D_D[CAT],SMS, D_D[EP],499,D_D[LOC],$A58)/$E58,0))","v":1.1747430249632892E-2}]
["WA-1",46,0,"Washington-Other RO",{"$f":"IF(ISNA($A59),\"\",IFERROR(SUMIFS(D_D[INV],D_D[MT],5,D_D[CAT],SMS, D_D[EP],499,D_D[LOC],$A59),0))","v":3520},{"$f":"IF(ISNA($A59),\"\",IFERROR(SUMIFS(D_D[BL],D_D[MT],5,D_D[CAT],SMS, D_D[EP],499,D_D[LOC],$A59),0))","v":1284},0.36477272727272725,{"$f":"IF(ISNA($A59),\"\",IFERROR(SUMIFS(D_D[DEV],D_D[MT],5,D_D[CAT],SMS, D_D[EP],499,D_D[LOC],$A59)/$E59,0))","v":0.24346590909090909},{"$f":"IF(ISNA($A59),\"\",IFERROR(SUMIFS(D_D[EVD],D_D[MT],5,D_D[CAT],SMS, D_D[EP],499,D_D[LOC],$A59)/$E59,0))","v":0.48664772727272726},{"$f":"IF(ISNA($A59),\"\",IFERROR(SUMIFS(D_D[DEC],D_D[MT],5,D_D[CAT],SMS, D_D[EP],499,D_D[LOC],$A59)/$E59,0))","v":0.22187499999999999},{"$f":"IF(ISNA($A59),\"\",IFERROR(SUMIFS(D_D[AWD],D_D[MT],5,D_D[CAT],SMS, D_D[EP],499,D_D[LOC],$A59)/$E59,0))","v":3.3806818181818181E-2},{"$f":"IF(ISNA($A59),\"\",IFERROR(SUMIFS(D_D[AUT],D_D[MT],5,D_D[CAT],SMS, D_D[EP],499,D_D[LOC],$A59)/$E59,0))","v":1.4204545454545454E-2}]
["WA499",47,0,{"$f":"IFERROR(INDEX(INDIRECT(DS_NWQD),B60),\"\")","v":"Washington-NWQ"},{"$f":"IF(ISNA($A60),\"\",IFERROR(SUMIFS(D_D[INV],D_D[MT],5,D_D[CAT],SMS, D_D[EP],499,D_D[LOC],$A60),0))","v":16310},{"$f":"IF(ISNA($A60),\"\",IFERROR(SUMIFS(D_D[BL],D_D[MT],5,D_D[CAT],SMS, D_D[EP],499,D_D[LOC],$A60),0))","v":4890},{"$f":"IF(ISNA($A60),\"\",IFERROR(F60/E60,0))","v":0.2998160637645616},{"$f":"IF(ISNA($A60),\"\",IFERROR(SUMIFS(D_D[DEV],D_D[MT],5,D_D[CAT],SMS, D_D[EP],499,D_D[LOC],$A60)/$E60,0))","v":0.12158185162477007},{"$f":"IF(ISNA($A60),\"\",IFERROR(SUMIFS(D_D[EVD],D_D[MT],5,D_D[CAT],SMS, D_D[EP],499,D_D[LOC],$A60)/$E60,0))","v":0.82109135499693442},{"$f":"IF(ISNA($A60),\"\",IFERROR(SUMIFS(D_D[DEC],D_D[MT],5,D_D[CAT],SMS, D_D[EP],499,D_D[LOC],$A60)/$E60,0))","v":5.6897608828939301E-2},{"$f":"IF(ISNA($A60),\"\",IFERROR(SUMIFS(D_D[AWD],D_D[MT],5,D_D[CAT],SMS, D_D[EP],499,D_D[LOC],$A60)/$E60,0))","v":4.2918454935622315E-4},{"$f":"IF(ISNA($A60),\"\",IFERROR(SUMIFS(D_D[AUT],D_D[MT],5,D_D[CAT],SMS, D_D[EP],499,D_D[LOC],$A60)/$E60,0))","v":0}]
[{"$error":"#N/A"},48,"","",{"$f":"IF(ISNA($A61),\"\",IFERROR(SUMIFS(D_D[INV],D_D[MT],5,D_D[CAT],SMS, D_D[EP],499,D_D[LOC],$A61),0))","v":""},{"$f":"IF(ISNA($A61),\"\",IFERROR(SUMIFS(D_D[BL],D_D[MT],5,D_D[CAT],SMS, D_D[EP],499,D_D[LOC],$A61),0))","v":""},"",{"$f":"IF(ISNA($A61),\"\",IFERROR(SUMIFS(D_D[DEV],D_D[MT],5,D_D[CAT],SMS, D_D[EP],499,D_D[LOC],$A61)/$E61,0))","v":""},{"$f":"IF(ISNA($A61),\"\",IFERROR(SUMIFS(D_D[EVD],D_D[MT],5,D_D[CAT],SMS, D_D[EP],499,D_D[LOC],$A61)/$E61,0))","v":""},{"$f":"IF(ISNA($A61),\"\",IFERROR(SUMIFS(D_D[DEC],D_D[MT],5,D_D[CAT],SMS, D_D[EP],499,D_D[LOC],$A61)/$E61,0))","v":""},{"$f":"IF(ISNA($A61),\"\",IFERROR(SUMIFS(D_D[AWD],D_D[MT],5,D_D[CAT],SMS, D_D[EP],499,D_D[LOC],$A61)/$E61,0))","v":""},{"$f":"IF(ISNA($A61),\"\",IFERROR(SUMIFS(D_D[AUT],D_D[MT],5,D_D[CAT],SMS, D_D[EP],499,D_D[LOC],$A61)/$E61,0))","v":""}]
[{"$error":"#N/A"},49,"","",{"$f":"IF(ISNA($A62),\"\",IFERROR(SUMIFS(D_D[INV],D_D[MT],5,D_D[CAT],SMS, D_D[EP],499,D_D[LOC],$A62),0))","v":""},{"$f":"IF(ISNA($A62),\"\",IFERROR(SUMIFS(D_D[BL],D_D[MT],5,D_D[CAT],SMS, D_D[EP],499,D_D[LOC],$A62),0))","v":""},"",{"$f":"IF(ISNA($A62),\"\",IFERROR(SUMIFS(D_D[DEV],D_D[MT],5,D_D[CAT],SMS, D_D[EP],499,D_D[LOC],$A62)/$E62,0))","v":""},{"$f":"IF(ISNA($A62),\"\",IFERROR(SUMIFS(D_D[EVD],D_D[MT],5,D_D[CAT],SMS, D_D[EP],499,D_D[LOC],$A62)/$E62,0))","v":""},{"$f":"IF(ISNA($A62),\"\",IFERROR(SUMIFS(D_D[DEC],D_D[MT],5,D_D[CAT],SMS, D_D[EP],499,D_D[LOC],$A62)/$E62,0))","v":""},{"$f":"IF(ISNA($A62),\"\",IFERROR(SUMIFS(D_D[AWD],D_D[MT],5,D_D[CAT],SMS, D_D[EP],499,D_D[LOC],$A62)/$E62,0))","v":""},{"$f":"IF(ISNA($A62),\"\",IFERROR(SUMIFS(D_D[AUT],D_D[MT],5,D_D[CAT],SMS, D_D[EP],499,D_D[LOC],$A62)/$E62,0))","v":""}]
[{"$error":"#N/A"},50,{"$f":"IFERROR(INDEX(INDIRECT(DS_NWQ),B63),\"\")","v":""},"",{"$f":"IF(ISNA($A63),\"\",IFERROR(SUMIFS(D_D[INV],D_D[MT],5,D_D[CAT],SMS, D_D[EP],499,D_D[LOC],$A63),0))","v":""},{"$f":"IF(ISNA($A63),\"\",IFERROR(SUMIFS(D_D[BL],D_D[MT],5,D_D[CAT],SMS, D_D[EP],499,D_D[LOC],$A63),0))","v":""},"",{"$f":"IF(ISNA($A63),\"\",IFERROR(SUMIFS(D_D[DEV],D_D[MT],5,D_D[CAT],SMS, D_D[EP],499,D_D[LOC],$A63)/$E63,0))","v":""},{"$f":"IF(ISNA($A63),\"\",IFERROR(SUMIFS(D_D[EVD],D_D[MT],5,D_D[CAT],SMS, D_D[EP],499,D_D[LOC],$A63)/$E63,0))","v":""},{"$f":"IF(ISNA($A63),\"\",IFERROR(SUMIFS(D_D[DEC],D_D[MT],5,D_D[CAT],SMS, D_D[EP],499,D_D[LOC],$A63)/$E63,0))","v":""},{"$f":"IF(ISNA($A63),\"\",IFERROR(SUMIFS(D_D[AWD],D_D[MT],5,D_D[CAT],SMS, D_D[EP],499,D_D[LOC],$A63)/$E63,0))","v":""},{"$f":"IF(ISNA($A63),\"\",IFERROR(SUMIFS(D_D[AUT],D_D[MT],5,D_D[CAT],SMS, D_D[EP],499,D_D[LOC],$A63)/$E63,0))","v":""}]
[{"$error":"#N/A"},51,"",{"$f":"IFERROR(INDEX(INDIRECT(DS_NWQD),B64),\"\")","v":""},{"$f":"IF(ISNA($A64),\"\",IFERROR(SUMIFS(D_D[INV],D_D[MT],5,D_D[CAT],SMS, D_D[EP],499,D_D[LOC],$A64),0))","v":""},{"$f":"IF(ISNA($A64),\"\",IFERROR(SUMIFS(D_D[BL],D_D[MT],5,D_D[CAT],SMS, D_D[EP],499,D_D[LOC],$A64),0))","v":""},{"$f":"IF(ISNA($A64),\"\",IFERROR(F64/E64,0))","v":""},{"$f":"IF(ISNA($A64),\"\",IFERROR(SUMIFS(D_D[DEV],D_D[MT],5,D_D[CAT],SMS, D_D[EP],499,D_D[LOC],$A64)/$E64,0))","v":""},{"$f":"IF(ISNA($A64),\"\",IFERROR(SUMIFS(D_D[EVD],D_D[MT],5,D_D[CAT],SMS, D_D[EP],499,D_D[LOC],$A64)/$E64,0))","v":""},{"$f":"IF(ISNA($A64),\"\",IFERROR(SUMIFS(D_D[DEC],D_D[MT],5,D_D[CAT],SMS, D_D[EP],499,D_D[LOC],$A64)/$E64,0))","v":""},{"$f":"IF(ISNA($A64),\"\",IFERROR(SUMIFS(D_D[AWD],D_D[MT],5,D_D[CAT],SMS, D_D[EP],499,D_D[LOC],$A64)/$E64,0))","v":""},{"$f":"IF(ISNA($A64),\"\",IFERROR(SUMIFS(D_D[AUT],D_D[MT],5,D_D[CAT],SMS, D_D[EP],499,D_D[LOC],$A64)/$E64,0))","v":""}]
[{"$error":"#N/A"},52,"","",{"$f":"IF(ISNA($A65),\"\",IFERROR(SUMIFS(D_D[INV],D_D[MT],5,D_D[CAT],SMS, D_D[EP],499,D_D[LOC],$A65),0))","v":""},{"$f":"IF(ISNA($A65),\"\",IFERROR(SUMIFS(D_D[BL],D_D[MT],5,D_D[CAT],SMS, D_D[EP],499,D_D[LOC],$A65),0))","v":""},"",{"$f":"IF(ISNA($A65),\"\",IFERROR(SUMIFS(D_D[DEV],D_D[MT],5,D_D[CAT],SMS, D_D[EP],499,D_D[LOC],$A65)/$E65,0))","v":""},{"$f":"IF(ISNA($A65),\"\",IFERROR(SUMIFS(D_D[EVD],D_D[MT],5,D_D[CAT],SMS, D_D[EP],499,D_D[LOC],$A65)/$E65,0))","v":""},{"$f":"IF(ISNA($A65),\"\",IFERROR(SUMIFS(D_D[DEC],D_D[MT],5,D_D[CAT],SMS, D_D[EP],499,D_D[LOC],$A65)/$E65,0))","v":""},{"$f":"IF(ISNA($A65),\"\",IFERROR(SUMIFS(D_D[AWD],D_D[MT],5,D_D[CAT],SMS, D_D[EP],499,D_D[LOC],$A65)/$E65,0))","v":""},{"$f":"IF(ISNA($A65),\"\",IFERROR(SUMIFS(D_D[AUT],D_D[MT],5,D_D[CAT],SMS, D_D[EP],499,D_D[LOC],$A65)/$E65,0))","v":""}]
[{"$error":"#N/A"},53,"","",{"$f":"IF(ISNA($A66),\"\",IFERROR(SUMIFS(D_D[INV],D_D[MT],5,D_D[CAT],SMS, D_D[EP],499,D_D[LOC],$A66),0))","v":""},{"$f":"IF(ISNA($A66),\"\",IFERROR(SUMIFS(D_D[BL],D_D[MT],5,D_D[CAT],SMS, D_D[EP],499,D_D[LOC],$A66),0))","v":""},"",{"$f":"IF(ISNA($A66),\"\",IFERROR(SUMIFS(D_D[DEV],D_D[MT],5,D_D[CAT],SMS, D_D[EP],499,D_D[LOC],$A66)/$E66,0))","v":""},{"$f":"IF(ISNA($A66),\"\",IFERROR(SUMIFS(D_D[EVD],D_D[MT],5,D_D[CAT],SMS, D_D[EP],499,D_D[LOC],$A66)/$E66,0))","v":""},{"$f":"IF(ISNA($A66),\"\",IFERROR(SUMIFS(D_D[DEC],D_D[MT],5,D_D[CAT],SMS, D_D[EP],499,D_D[LOC],$A66)/$E66,0))","v":""},{"$f":"IF(ISNA($A66),\"\",IFERROR(SUMIFS(D_D[AWD],D_D[MT],5,D_D[CAT],SMS, D_D[EP],499,D_D[LOC],$A66)/$E66,0))","v":""},{"$f":"IF(ISNA($A66),\"\",IFERROR(SUMIFS(D_D[AUT],D_D[MT],5,D_D[CAT],SMS, D_D[EP],499,D_D[LOC],$A66)/$E66,0))","v":""}]
[{"$error":"#N/A"},54,"","",{"$f":"IF(ISNA($A67),\"\",IFERROR(SUMIFS(D_D[INV],D_D[MT],5,D_D[CAT],SMS, D_D[EP],499,D_D[LOC],$A67),0))","v":""},{"$f":"IF(ISNA($A67),\"\",IFERROR(SUMIFS(D_D[BL],D_D[MT],5,D_D[CAT],SMS, D_D[EP],499,D_D[LOC],$A67),0))","v":""},"",{"$f":"IF(ISNA($A67),\"\",IFERROR(SUMIFS(D_D[DEV],D_D[MT],5,D_D[CAT],SMS, D_D[EP],499,D_D[LOC],$A67)/$E67,0))","v":""},{"$f":"IF(ISNA($A67),\"\",IFERROR(SUMIFS(D_D[EVD],D_D[MT],5,D_D[CAT],SMS, D_D[EP],499,D_D[LOC],$A67)/$E67,0))","v":""},{"$f":"IF(ISNA($A67),\"\",IFERROR(SUMIFS(D_D[DEC],D_D[MT],5,D_D[CAT],SMS, D_D[EP],499,D_D[LOC],$A67)/$E67,0))","v":""},{"$f":"IF(ISNA($A67),\"\",IFERROR(SUMIFS(D_D[AWD],D_D[MT],5,D_D[CAT],SMS, D_D[EP],499,D_D[LOC],$A67)/$E67,0))","v":""},{"$f":"IF(ISNA($A67),\"\",IFERROR(SUMIFS(D_D[AUT],D_D[MT],5,D_D[CAT],SMS, D_D[EP],499,D_D[LOC],$A67)/$E67,0))","v":""}]
[{"$error":"#N/A"},55,"","",{"$f":"IF(ISNA($A68),\"\",IFERROR(SUMIFS(D_D[INV],D_D[MT],5,D_D[CAT],SMS, D_D[EP],499,D_D[LOC],$A68),0))","v":""},{"$f":"IF(ISNA($A68),\"\",IFERROR(SUMIFS(D_D[BL],D_D[MT],5,D_D[CAT],SMS, D_D[EP],499,D_D[LOC],$A68),0))","v":""},"",{"$f":"IF(ISNA($A68),\"\",IFERROR(SUMIFS(D_D[DEV],D_D[MT],5,D_D[CAT],SMS, D_D[EP],499,D_D[LOC],$A68)/$E68,0))","v":""},{"$f":"IF(ISNA($A68),\"\",IFERROR(SUMIFS(D_D[EVD],D_D[MT],5,D_D[CAT],SMS, D_D[EP],499,D_D[LOC],$A68)/$E68,0))","v":""},{"$f":"IF(ISNA($A68),\"\",IFERROR(SUMIFS(D_D[DEC],D_D[MT],5,D_D[CAT],SMS, D_D[EP],499,D_D[LOC],$A68)/$E68,0))","v":""},{"$f":"IF(ISNA($A68),\"\",IFERROR(SUMIFS(D_D[AWD],D_D[MT],5,D_D[CAT],SMS, D_D[EP],499,D_D[LOC],$A68)/$E68,0))","v":""},{"$f":"IF(ISNA($A68),\"\",IFERROR(SUMIFS(D_D[AUT],D_D[MT],5,D_D[CAT],SMS, D_D[EP],499,D_D[LOC],$A68)/$E68,0))","v":""}]
[{"$error":"#N/A"},56,"","",{"$f":"IF(ISNA($A69),\"\",IFERROR(SUMIFS(D_D[INV],D_D[MT],5,D_D[CAT],SMS, D_D[EP],499,D_D[LOC],$A69),0))","v":""},{"$f":"IF(ISNA($A69),\"\",IFERROR(SUMIFS(D_D[BL],D_D[MT],5,D_D[CAT],SMS, D_D[EP],499,D_D[LOC],$A69),0))","v":""},"",{"$f":"IF(ISNA($A69),\"\",IFERROR(SUMIFS(D_D[DEV],D_D[MT],5,D_D[CAT],SMS, D_D[EP],499,D_D[LOC],$A69)/$E69,0))","v":""},{"$f":"IF(ISNA($A69),\"\",IFERROR(SUMIFS(D_D[EVD],D_D[MT],5,D_D[CAT],SMS, D_D[EP],499,D_D[LOC],$A69)/$E69,0))","v":""},{"$f":"IF(ISNA($A69),\"\",IFERROR(SUMIFS(D_D[DEC],D_D[MT],5,D_D[CAT],SMS, D_D[EP],499,D_D[LOC],$A69)/$E69,0))","v":""},{"$f":"IF(ISNA($A69),\"\",IFERROR(SUMIFS(D_D[AWD],D_D[MT],5,D_D[CAT],SMS, D_D[EP],499,D_D[LOC],$A69)/$E69,0))","v":""},{"$f":"IF(ISNA($A69),\"\",IFERROR(SUMIFS(D_D[AUT],D_D[MT],5,D_D[CAT],SMS, D_D[EP],499,D_D[LOC],$A69)/$E69,0))","v":""}]
[{"$error":"#N/A"},57,"","",{"$f":"IF(ISNA($A70),\"\",IFERROR(SUMIFS(D_D[INV],D_D[MT],5,D_D[CAT],SMS, D_D[EP],499,D_D[LOC],$A70),0))","v":""},{"$f":"IF(ISNA($A70),\"\",IFERROR(SUMIFS(D_D[BL],D_D[MT],5,D_D[CAT],SMS, D_D[EP],499,D_D[LOC],$A70),0))","v":""},"",{"$f":"IF(ISNA($A70),\"\",IFERROR(SUMIFS(D_D[DEV],D_D[MT],5,D_D[CAT],SMS, D_D[EP],499,D_D[LOC],$A70)/$E70,0))","v":""},{"$f":"IF(ISNA($A70),\"\",IFERROR(SUMIFS(D_D[EVD],D_D[MT],5,D_D[CAT],SMS, D_D[EP],499,D_D[LOC],$A70)/$E70,0))","v":""},{"$f":"IF(ISNA($A70),\"\",IFERROR(SUMIFS(D_D[DEC],D_D[MT],5,D_D[CAT],SMS, D_D[EP],499,D_D[LOC],$A70)/$E70,0))","v":""},{"$f":"IF(ISNA($A70),\"\",IFERROR(SUMIFS(D_D[AWD],D_D[MT],5,D_D[CAT],SMS, D_D[EP],499,D_D[LOC],$A70)/$E70,0))","v":""},{"$f":"IF(ISNA($A70),\"\",IFERROR(SUMIFS(D_D[AUT],D_D[MT],5,D_D[CAT],SMS, D_D[EP],499,D_D[LOC],$A70)/$E70,0))","v":""}]
[{"$error":"#N/A"},58,"","",{"$f":"IF(ISNA($A71),\"\",IFERROR(SUMIFS(D_D[INV],D_D[MT],5,D_D[CAT],SMS, D_D[EP],499,D_D[LOC],$A71),0))","v":""},{"$f":"IF(ISNA($A71),\"\",IFERROR(SUMIFS(D_D[BL],D_D[MT],5,D_D[CAT],SMS, D_D[EP],499,D_D[LOC],$A71),0))","v":""},"",{"$f":"IF(ISNA($A71),\"\",IFERROR(SUMIFS(D_D[DEV],D_D[MT],5,D_D[CAT],SMS, D_D[EP],499,D_D[LOC],$A71)/$E71,0))","v":""},{"$f":"IF(ISNA($A71),\"\",IFERROR(SUMIFS(D_D[EVD],D_D[MT],5,D_D[CAT],SMS, D_D[EP],499,D_D[LOC],$A71)/$E71,0))","v":""},{"$f":"IF(ISNA($A71),\"\",IFERROR(SUMIFS(D_D[DEC],D_D[MT],5,D_D[CAT],SMS, D_D[EP],499,D_D[LOC],$A71)/$E71,0))","v":""},{"$f":"IF(ISNA($A71),\"\",IFERROR(SUMIFS(D_D[AWD],D_D[MT],5,D_D[CAT],SMS, D_D[EP],499,D_D[LOC],$A71)/$E71,0))","v":""},{"$f":"IF(ISNA($A71),\"\",IFERROR(SUMIFS(D_D[AUT],D_D[MT],5,D_D[CAT],SMS, D_D[EP],499,D_D[LOC],$A71)/$E71,0))","v":""}]
[{"$error":"#N/A"},59,"","",{"$f":"IF(ISNA($A72),\"\",IFERROR(SUMIFS(D_D[INV],D_D[MT],5,D_D[CAT],SMS, D_D[EP],499,D_D[LOC],$A72),0))","v":""},{"$f":"IF(ISNA($A72),\"\",IFERROR(SUMIFS(D_D[BL],D_D[MT],5,D_D[CAT],SMS, D_D[EP],499,D_D[LOC],$A72),0))","v":""},"",{"$f":"IF(ISNA($A72),\"\",IFERROR(SUMIFS(D_D[DEV],D_D[MT],5,D_D[CAT],SMS, D_D[EP],499,D_D[LOC],$A72)/$E72,0))","v":""},{"$f":"IF(ISNA($A72),\"\",IFERROR(SUMIFS(D_D[EVD],D_D[MT],5,D_D[CAT],SMS, D_D[EP],499,D_D[LOC],$A72)/$E72,0))","v":""},{"$f":"IF(ISNA($A72),\"\",IFERROR(SUMIFS(D_D[DEC],D_D[MT],5,D_D[CAT],SMS, D_D[EP],499,D_D[LOC],$A72)/$E72,0))","v":""},{"$f":"IF(ISNA($A72),\"\",IFERROR(SUMIFS(D_D[AWD],D_D[MT],5,D_D[CAT],SMS, D_D[EP],499,D_D[LOC],$A72)/$E72,0))","v":""},{"$f":"IF(ISNA($A72),\"\",IFERROR(SUMIFS(D_D[AUT],D_D[MT],5,D_D[CAT],SMS, D_D[EP],499,D_D[LOC],$A72)/$E72,0))","v":""}]
[{"$error":"#N/A"},60,"","",{"$f":"IF(ISNA($A73),\"\",IFERROR(SUMIFS(D_D[INV],D_D[MT],5,D_D[CAT],SMS, D_D[EP],499,D_D[LOC],$A73),0))","v":""},{"$f":"IF(ISNA($A73),\"\",IFERROR(SUMIFS(D_D[BL],D_D[MT],5,D_D[CAT],SMS, D_D[EP],499,D_D[LOC],$A73),0))","v":""},"",{"$f":"IF(ISNA($A73),\"\",IFERROR(SUMIFS(D_D[DEV],D_D[MT],5,D_D[CAT],SMS, D_D[EP],499,D_D[LOC],$A73)/$E73,0))","v":""},{"$f":"IF(ISNA($A73),\"\",IFERROR(SUMIFS(D_D[EVD],D_D[MT],5,D_D[CAT],SMS, D_D[EP],499,D_D[LOC],$A73)/$E73,0))","v":""},{"$f":"IF(ISNA($A73),\"\",IFERROR(SUMIFS(D_D[DEC],D_D[MT],5,D_D[CAT],SMS, D_D[EP],499,D_D[LOC],$A73)/$E73,0))","v":""},{"$f":"IF(ISNA($A73),\"\",IFERROR(SUMIFS(D_D[AWD],D_D[MT],5,D_D[CAT],SMS, D_D[EP],499,D_D[LOC],$A73)/$E73,0))","v":""},{"$f":"IF(ISNA($A73),\"\",IFERROR(SUMIFS(D_D[AUT],D_D[MT],5,D_D[CAT],SMS, D_D[EP],499,D_D[LOC],$A73)/$E73,0))","v":""}]
[{"$error":"#N/A"},61,"","",{"$f":"IF(ISNA($A74),\"\",IFERROR(SUMIFS(D_D[INV],D_D[MT],5,D_D[CAT],SMS, D_D[EP],499,D_D[LOC],$A74),0))","v":""},{"$f":"IF(ISNA($A74),\"\",IFERROR(SUMIFS(D_D[BL],D_D[MT],5,D_D[CAT],SMS, D_D[EP],499,D_D[LOC],$A74),0))","v":""},"",{"$f":"IF(ISNA($A74),\"\",IFERROR(SUMIFS(D_D[DEV],D_D[MT],5,D_D[CAT],SMS, D_D[EP],499,D_D[LOC],$A74)/$E74,0))","v":""},{"$f":"IF(ISNA($A74),\"\",IFERROR(SUMIFS(D_D[EVD],D_D[MT],5,D_D[CAT],SMS, D_D[EP],499,D_D[LOC],$A74)/$E74,0))","v":""},{"$f":"IF(ISNA($A74),\"\",IFERROR(SUMIFS(D_D[DEC],D_D[MT],5,D_D[CAT],SMS, D_D[EP],499,D_D[LOC],$A74)/$E74,0))","v":""},{"$f":"IF(ISNA($A74),\"\",IFERROR(SUMIFS(D_D[AWD],D_D[MT],5,D_D[CAT],SMS, D_D[EP],499,D_D[LOC],$A74)/$E74,0))","v":""},{"$f":"IF(ISNA($A74),\"\",IFERROR(SUMIFS(D_D[AUT],D_D[MT],5,D_D[CAT],SMS, D_D[EP],499,D_D[LOC],$A74)/$E74,0))","v":""}]
[{"$error":"#N/A"},62,"","",{"$f":"IF(ISNA($A75),\"\",IFERROR(SUMIFS(D_D[INV],D_D[MT],5,D_D[CAT],SMS, D_D[EP],499,D_D[LOC],$A75),0))","v":""},{"$f":"IF(ISNA($A75),\"\",IFERROR(SUMIFS(D_D[BL],D_D[MT],5,D_D[CAT],SMS, D_D[EP],499,D_D[LOC],$A75),0))","v":""},"",{"$f":"IF(ISNA($A75),\"\",IFERROR(SUMIFS(D_D[DEV],D_D[MT],5,D_D[CAT],SMS, D_D[EP],499,D_D[LOC],$A75)/$E75,0))","v":""},{"$f":"IF(ISNA($A75),\"\",IFERROR(SUMIFS(D_D[EVD],D_D[MT],5,D_D[CAT],SMS, D_D[EP],499,D_D[LOC],$A75)/$E75,0))","v":""},{"$f":"IF(ISNA($A75),\"\",IFERROR(SUMIFS(D_D[DEC],D_D[MT],5,D_D[CAT],SMS, D_D[EP],499,D_D[LOC],$A75)/$E75,0))","v":""},{"$f":"IF(ISNA($A75),\"\",IFERROR(SUMIFS(D_D[AWD],D_D[MT],5,D_D[CAT],SMS, D_D[EP],499,D_D[LOC],$A75)/$E75,0))","v":""},{"$f":"IF(ISNA($A75),\"\",IFERROR(SUMIFS(D_D[AUT],D_D[MT],5,D_D[CAT],SMS, D_D[EP],499,D_D[LOC],$A75)/$E75,0))","v":""}]
[{"$error":"#N/A"},63,"","",{"$f":"IF(ISNA($A76),\"\",IFERROR(SUMIFS(D_D[INV],D_D[MT],5,D_D[CAT],SMS, D_D[EP],499,D_D[LOC],$A76),0))","v":""},{"$f":"IF(ISNA($A76),\"\",IFERROR(SUMIFS(D_D[BL],D_D[MT],5,D_D[CAT],SMS, D_D[EP],499,D_D[LOC],$A76),0))","v":""},"",{"$f":"IF(ISNA($A76),\"\",IFERROR(SUMIFS(D_D[DEV],D_D[MT],5,D_D[CAT],SMS, D_D[EP],499,D_D[LOC],$A76)/$E76,0))","v":""},{"$f":"IF(ISNA($A76),\"\",IFERROR(SUMIFS(D_D[EVD],D_D[MT],5,D_D[CAT],SMS, D_D[EP],499,D_D[LOC],$A76)/$E76,0))","v":""},{"$f":"IF(ISNA($A76),\"\",IFERROR(SUMIFS(D_D[DEC],D_D[MT],5,D_D[CAT],SMS, D_D[EP],499,D_D[LOC],$A76)/$E76,0))","v":""},{"$f":"IF(ISNA($A76),\"\",IFERROR(SUMIFS(D_D[AWD],D_D[MT],5,D_D[CAT],SMS, D_D[EP],499,D_D[LOC],$A76)/$E76,0))","v":""},{"$f":"IF(ISNA($A76),\"\",IFERROR(SUMIFS(D_D[AUT],D_D[MT],5,D_D[CAT],SMS, D_D[EP],499,D_D[LOC],$A76)/$E76,0))","v":""}]
[{"$error":"#N/A"},64,"","",{"$f":"IF(ISNA($A77),\"\",IFERROR(SUMIFS(D_D[INV],D_D[MT],5,D_D[CAT],SMS, D_D[EP],499,D_D[LOC],$A77),0))","v":""},{"$f":"IF(ISNA($A77),\"\",IFERROR(SUMIFS(D_D[BL],D_D[MT],5,D_D[CAT],SMS, D_D[EP],499,D_D[LOC],$A77),0))","v":""},"",{"$f":"IF(ISNA($A77),\"\",IFERROR(SUMIFS(D_D[DEV],D_D[MT],5,D_D[CAT],SMS, D_D[EP],499,D_D[LOC],$A77)/$E77,0))","v":""},{"$f":"IF(ISNA($A77),\"\",IFERROR(SUMIFS(D_D[EVD],D_D[MT],5,D_D[CAT],SMS, D_D[EP],499,D_D[LOC],$A77)/$E77,0))","v":""},{"$f":"IF(ISNA($A77),\"\",IFERROR(SUMIFS(D_D[DEC],D_D[MT],5,D_D[CAT],SMS, D_D[EP],499,D_D[LOC],$A77)/$E77,0))","v":""},{"$f":"IF(ISNA($A77),\"\",IFERROR(SUMIFS(D_D[AWD],D_D[MT],5,D_D[CAT],SMS, D_D[EP],499,D_D[LOC],$A77)/$E77,0))","v":""},{"$f":"IF(ISNA($A77),\"\",IFERROR(SUMIFS(D_D[AUT],D_D[MT],5,D_D[CAT],SMS, D_D[EP],499,D_D[LOC],$A77)/$E77,0))","v":""}]
[{"$error":"#N/A"},65,"","",{"$f":"IF(ISNA($A78),\"\",IFERROR(SUMIFS(D_D[INV],D_D[MT],5,D_D[CAT],SMS, D_D[EP],499,D_D[LOC],$A78),0))","v":""},{"$f":"IF(ISNA($A78),\"\",IFERROR(SUMIFS(D_D[BL],D_D[MT],5,D_D[CAT],SMS, D_D[EP],499,D_D[LOC],$A78),0))","v":""},"",{"$f":"IF(ISNA($A78),\"\",IFERROR(SUMIFS(D_D[DEV],D_D[MT],5,D_D[CAT],SMS, D_D[EP],499,D_D[LOC],$A78)/$E78,0))","v":""},{"$f":"IF(ISNA($A78),\"\",IFERROR(SUMIFS(D_D[EVD],D_D[MT],5,D_D[CAT],SMS, D_D[EP],499,D_D[LOC],$A78)/$E78,0))","v":""},{"$f":"IF(ISNA($A78),\"\",IFERROR(SUMIFS(D_D[DEC],D_D[MT],5,D_D[CAT],SMS, D_D[EP],499,D_D[LOC],$A78)/$E78,0))","v":""},{"$f":"IF(ISNA($A78),\"\",IFERROR(SUMIFS(D_D[AWD],D_D[MT],5,D_D[CAT],SMS, D_D[EP],499,D_D[LOC],$A78)/$E78,0))","v":""},{"$f":"IF(ISNA($A78),\"\",IFERROR(SUMIFS(D_D[AUT],D_D[MT],5,D_D[CAT],SMS, D_D[EP],499,D_D[LOC],$A78)/$E78,0))","v":""}]
[{"$error":"#N/A"},66,"","",{"$f":"IF(ISNA($A79),\"\",IFERROR(SUMIFS(D_D[INV],D_D[MT],5,D_D[CAT],SMS, D_D[EP],499,D_D[LOC],$A79),0))","v":""},{"$f":"IF(ISNA($A79),\"\",IFERROR(SUMIFS(D_D[BL],D_D[MT],5,D_D[CAT],SMS, D_D[EP],499,D_D[LOC],$A79),0))","v":""},"",{"$f":"IF(ISNA($A79),\"\",IFERROR(SUMIFS(D_D[DEV],D_D[MT],5,D_D[CAT],SMS, D_D[EP],499,D_D[LOC],$A79)/$E79,0))","v":""},{"$f":"IF(ISNA($A79),\"\",IFERROR(SUMIFS(D_D[EVD],D_D[MT],5,D_D[CAT],SMS, D_D[EP],499,D_D[LOC],$A79)/$E79,0))","v":""},{"$f":"IF(ISNA($A79),\"\",IFERROR(SUMIFS(D_D[DEC],D_D[MT],5,D_D[CAT],SMS, D_D[EP],499,D_D[LOC],$A79)/$E79,0))","v":""},{"$f":"IF(ISNA($A79),\"\",IFERROR(SUMIFS(D_D[AWD],D_D[MT],5,D_D[CAT],SMS, D_D[EP],499,D_D[LOC],$A79)/$E79,0))","v":""},{"$f":"IF(ISNA($A79),\"\",IFERROR(SUMIFS(D_D[AUT],D_D[MT],5,D_D[CAT],SMS, D_D[EP],499,D_D[LOC],$A79)/$E79,0))","v":""}]
[{"$error":"#N/A"},67,"","",{"$f":"IF(ISNA($A80),\"\",IFERROR(SUMIFS(D_D[INV],D_D[MT],5,D_D[CAT],SMS, D_D[EP],499,D_D[LOC],$A80),0))","v":""},{"$f":"IF(ISNA($A80),\"\",IFERROR(SUMIFS(D_D[BL],D_D[MT],5,D_D[CAT],SMS, D_D[EP],499,D_D[LOC],$A80),0))","v":""},"",{"$f":"IF(ISNA($A80),\"\",IFERROR(SUMIFS(D_D[DEV],D_D[MT],5,D_D[CAT],SMS, D_D[EP],499,D_D[LOC],$A80)/$E80,0))","v":""},{"$f":"IF(ISNA($A80),\"\",IFERROR(SUMIFS(D_D[EVD],D_D[MT],5,D_D[CAT],SMS, D_D[EP],499,D_D[LOC],$A80)/$E80,0))","v":""},{"$f":"IF(ISNA($A80),\"\",IFERROR(SUMIFS(D_D[DEC],D_D[MT],5,D_D[CAT],SMS, D_D[EP],499,D_D[LOC],$A80)/$E80,0))","v":""},{"$f":"IF(ISNA($A80),\"\",IFERROR(SUMIFS(D_D[AWD],D_D[MT],5,D_D[CAT],SMS, D_D[EP],499,D_D[LOC],$A80)/$E80,0))","v":""},{"$f":"IF(ISNA($A80),\"\",IFERROR(SUMIFS(D_D[AUT],D_D[MT],5,D_D[CAT],SMS, D_D[EP],499,D_D[LOC],$A80)/$E80,0))","v":""}]
[{"$error":"#N/A"},68,{"$f":"IFERROR(INDEX(INDIRECT(DS_NWQ),B81),\"\")","v":""},"",{"$f":"IF(ISNA($A81),\"\",IFERROR(SUMIFS(D_D[INV],D_D[MT],5,D_D[CAT],SMS, D_D[EP],499,D_D[LOC],$A81),0))","v":""},{"$f":"IF(ISNA($A81),\"\",IFERROR(SUMIFS(D_D[BL],D_D[MT],5,D_D[CAT],SMS, D_D[EP],499,D_D[LOC],$A81),0))","v":""},"",{"$f":"IF(ISNA($A81),\"\",IFERROR(SUMIFS(D_D[DEV],D_D[MT],5,D_D[CAT],SMS, D_D[EP],499,D_D[LOC],$A81)/$E81,0))","v":""},{"$f":"IF(ISNA($A81),\"\",IFERROR(SUMIFS(D_D[EVD],D_D[MT],5,D_D[CAT],SMS, D_D[EP],499,D_D[LOC],$A81)/$E81,0))","v":""},{"$f":"IF(ISNA($A81),\"\",IFERROR(SUMIFS(D_D[DEC],D_D[MT],5,D_D[CAT],SMS, D_D[EP],499,D_D[LOC],$A81)/$E81,0))","v":""},{"$f":"IF(ISNA($A81),\"\",IFERROR(SUMIFS(D_D[AWD],D_D[MT],5,D_D[CAT],SMS, D_D[EP],499,D_D[LOC],$A81)/$E81,0))","v":""},{"$f":"IF(ISNA($A81),\"\",IFERROR(SUMIFS(D_D[AUT],D_D[MT],5,D_D[CAT],SMS, D_D[EP],499,D_D[LOC],$A81)/$E81,0))","v":""}]
[{"$error":"#N/A"},69,"",{"$f":"IFERROR(INDEX(INDIRECT(DS_NWQD),B82),\"\")","v":""},{"$f":"IF(ISNA($A82),\"\",IFERROR(SUMIFS(D_D[INV],D_D[MT],5,D_D[CAT],SMS, D_D[EP],499,D_D[LOC],$A82),0))","v":""},{"$f":"IF(ISNA($A82),\"\",IFERROR(SUMIFS(D_D[BL],D_D[MT],5,D_D[CAT],SMS, D_D[EP],499,D_D[LOC],$A82),0))","v":""},{"$f":"IF(ISNA($A82),\"\",IFERROR(F82/E82,0))","v":""},{"$f":"IF(ISNA($A82),\"\",IFERROR(SUMIFS(D_D[DEV],D_D[MT],5,D_D[CAT],SMS, D_D[EP],499,D_D[LOC],$A82)/$E82,0))","v":""},{"$f":"IF(ISNA($A82),\"\",IFERROR(SUMIFS(D_D[EVD],D_D[MT],5,D_D[CAT],SMS, D_D[EP],499,D_D[LOC],$A82)/$E82,0))","v":""},{"$f":"IF(ISNA($A82),\"\",IFERROR(SUMIFS(D_D[DEC],D_D[MT],5,D_D[CAT],SMS, D_D[EP],499,D_D[LOC],$A82)/$E82,0))","v":""},{"$f":"IF(ISNA($A82),\"\",IFERROR(SUMIFS(D_D[AWD],D_D[MT],5,D_D[CAT],SMS, D_D[EP],499,D_D[LOC],$A82)/$E82,0))","v":""},{"$f":"IF(ISNA($A82),\"\",IFERROR(SUMIFS(D_D[AUT],D_D[MT],5,D_D[CAT],SMS, D_D[EP],499,D_D[LOC],$A82)/$E82,0))","v":""}]
[{"$error":"#N/A"},70,"","",{"$f":"IF(ISNA($A83),\"\",IFERROR(SUMIFS(D_D[INV],D_D[MT],5,D_D[CAT],SMS, D_D[EP],499,D_D[LOC],$A83),0))","v":""},{"$f":"IF(ISNA($A83),\"\",IFERROR(SUMIFS(D_D[BL],D_D[MT],5,D_D[CAT],SMS, D_D[EP],499,D_D[LOC],$A83),0))","v":""},"",{"$f":"IF(ISNA($A83),\"\",IFERROR(SUMIFS(D_D[DEV],D_D[MT],5,D_D[CAT],SMS, D_D[EP],499,D_D[LOC],$A83)/$E83,0))","v":""},{"$f":"IF(ISNA($A83),\"\",IFERROR(SUMIFS(D_D[EVD],D_D[MT],5,D_D[CAT],SMS, D_D[EP],499,D_D[LOC],$A83)/$E83,0))","v":""},{"$f":"IF(ISNA($A83),\"\",IFERROR(SUMIFS(D_D[DEC],D_D[MT],5,D_D[CAT],SMS, D_D[EP],499,D_D[LOC],$A83)/$E83,0))","v":""},{"$f":"IF(ISNA($A83),\"\",IFERROR(SUMIFS(D_D[AWD],D_D[MT],5,D_D[CAT],SMS, D_D[EP],499,D_D[LOC],$A83)/$E83,0))","v":""},{"$f":"IF(ISNA($A83),\"\",IFERROR(SUMIFS(D_D[AUT],D_D[MT],5,D_D[CAT],SMS, D_D[EP],499,D_D[LOC],$A83)/$E83,0))","v":""}]
[{"$error":"#N/A"},71,"","",{"$f":"IF(ISNA($A84),\"\",IFERROR(SUMIFS(D_D[INV],D_D[MT],5,D_D[CAT],SMS, D_D[EP],499,D_D[LOC],$A84),0))","v":""},{"$f":"IF(ISNA($A84),\"\",IFERROR(SUMIFS(D_D[BL],D_D[MT],5,D_D[CAT],SMS, D_D[EP],499,D_D[LOC],$A84),0))","v":""},"",{"$f":"IF(ISNA($A84),\"\",IFERROR(SUMIFS(D_D[DEV],D_D[MT],5,D_D[CAT],SMS, D_D[EP],499,D_D[LOC],$A84)/$E84,0))","v":""},{"$f":"IF(ISNA($A84),\"\",IFERROR(SUMIFS(D_D[EVD],D_D[MT],5,D_D[CAT],SMS, D_D[EP],499,D_D[LOC],$A84)/$E84,0))","v":""},{"$f":"IF(ISNA($A84),\"\",IFERROR(SUMIFS(D_D[DEC],D_D[MT],5,D_D[CAT],SMS, D_D[EP],499,D_D[LOC],$A84)/$E84,0))","v":""},{"$f":"IF(ISNA($A84),\"\",IFERROR(SUMIFS(D_D[AWD],D_D[MT],5,D_D[CAT],SMS, D_D[EP],499,D_D[LOC],$A84)/$E84,0))","v":""},{"$f":"IF(ISNA($A84),\"\",IFERROR(SUMIFS(D_D[AUT],D_D[MT],5,D_D[CAT],SMS, D_D[EP],499,D_D[LOC],$A84)/$E84,0))","v":""}]
[{"$error":"#N/A"},72,"","",{"$f":"IF(ISNA($A85),\"\",IFERROR(SUMIFS(D_D[INV],D_D[MT],5,D_D[CAT],SMS, D_D[EP],499,D_D[LOC],$A85),0))","v":""},{"$f":"IF(ISNA($A85),\"\",IFERROR(SUMIFS(D_D[BL],D_D[MT],5,D_D[CAT],SMS, D_D[EP],499,D_D[LOC],$A85),0))","v":""},"",{"$f":"IF(ISNA($A85),\"\",IFERROR(SUMIFS(D_D[DEV],D_D[MT],5,D_D[CAT],SMS, D_D[EP],499,D_D[LOC],$A85)/$E85,0))","v":""},{"$f":"IF(ISNA($A85),\"\",IFERROR(SUMIFS(D_D[EVD],D_D[MT],5,D_D[CAT],SMS, D_D[EP],499,D_D[LOC],$A85)/$E85,0))","v":""},{"$f":"IF(ISNA($A85),\"\",IFERROR(SUMIFS(D_D[DEC],D_D[MT],5,D_D[CAT],SMS, D_D[EP],499,D_D[LOC],$A85)/$E85,0))","v":""},{"$f":"IF(ISNA($A85),\"\",IFERROR(SUMIFS(D_D[AWD],D_D[MT],5,D_D[CAT],SMS, D_D[EP],499,D_D[LOC],$A85)/$E85,0))","v":""},{"$f":"IF(ISNA($A85),\"\",IFERROR(SUMIFS(D_D[AUT],D_D[MT],5,D_D[CAT],SMS, D_D[EP],499,D_D[LOC],$A85)/$E85,0))","v":""}]
[{"$error":"#N/A"},73,"","",{"$f":"IF(ISNA($A86),\"\",IFERROR(SUMIFS(D_D[INV],D_D[MT],5,D_D[CAT],SMS, D_D[EP],499,D_D[LOC],$A86),0))","v":""},{"$f":"IF(ISNA($A86),\"\",IFERROR(SUMIFS(D_D[BL],D_D[MT],5,D_D[CAT],SMS, D_D[EP],499,D_D[LOC],$A86),0))","v":""},"",{"$f":"IF(ISNA($A86),\"\",IFERROR(SUMIFS(D_D[DEV],D_D[MT],5,D_D[CAT],SMS, D_D[EP],499,D_D[LOC],$A86)/$E86,0))","v":""},{"$f":"IF(ISNA($A86),\"\",IFERROR(SUMIFS(D_D[EVD],D_D[MT],5,D_D[CAT],SMS, D_D[EP],499,D_D[LOC],$A86)/$E86,0))","v":""},{"$f":"IF(ISNA($A86),\"\",IFERROR(SUMIFS(D_D[DEC],D_D[MT],5,D_D[CAT],SMS, D_D[EP],499,D_D[LOC],$A86)/$E86,0))","v":""},{"$f":"IF(ISNA($A86),\"\",IFERROR(SUMIFS(D_D[AWD],D_D[MT],5,D_D[CAT],SMS, D_D[EP],499,D_D[LOC],$A86)/$E86,0))","v":""},{"$f":"IF(ISNA($A86),\"\",IFERROR(SUMIFS(D_D[AUT],D_D[MT],5,D_D[CAT],SMS, D_D[EP],499,D_D[LOC],$A86)/$E86,0))","v":""}]
[{"$error":"#N/A"},74,"","",{"$f":"IF(ISNA($A87),\"\",IFERROR(SUMIFS(D_D[INV],D_D[MT],5,D_D[CAT],SMS, D_D[EP],499,D_D[LOC],$A87),0))","v":""},{"$f":"IF(ISNA($A87),\"\",IFERROR(SUMIFS(D_D[BL],D_D[MT],5,D_D[CAT],SMS, D_D[EP],499,D_D[LOC],$A87),0))","v":""},"",{"$f":"IF(ISNA($A87),\"\",IFERROR(SUMIFS(D_D[DEV],D_D[MT],5,D_D[CAT],SMS, D_D[EP],499,D_D[LOC],$A87)/$E87,0))","v":""},{"$f":"IF(ISNA($A87),\"\",IFERROR(SUMIFS(D_D[EVD],D_D[MT],5,D_D[CAT],SMS, D_D[EP],499,D_D[LOC],$A87)/$E87,0))","v":""},{"$f":"IF(ISNA($A87),\"\",IFERROR(SUMIFS(D_D[DEC],D_D[MT],5,D_D[CAT],SMS, D_D[EP],499,D_D[LOC],$A87)/$E87,0))","v":""},{"$f":"IF(ISNA($A87),\"\",IFERROR(SUMIFS(D_D[AWD],D_D[MT],5,D_D[CAT],SMS, D_D[EP],499,D_D[LOC],$A87)/$E87,0))","v":""},{"$f":"IF(ISNA($A87),\"\",IFERROR(SUMIFS(D_D[AUT],D_D[MT],5,D_D[CAT],SMS, D_D[EP],499,D_D[LOC],$A87)/$E87,0))","v":""}]
[{"$error":"#N/A"},75,"","",{"$f":"IF(ISNA($A88),\"\",IFERROR(SUMIFS(D_D[INV],D_D[MT],5,D_D[CAT],SMS, D_D[EP],499,D_D[LOC],$A88),0))","v":""},{"$f":"IF(ISNA($A88),\"\",IFERROR(SUMIFS(D_D[BL],D_D[MT],5,D_D[CAT],SMS, D_D[EP],499,D_D[LOC],$A88),0))","v":""},"",{"$f":"IF(ISNA($A88),\"\",IFERROR(SUMIFS(D_D[DEV],D_D[MT],5,D_D[CAT],SMS, D_D[EP],499,D_D[LOC],$A88)/$E88,0))","v":""},{"$f":"IF(ISNA($A88),\"\",IFERROR(SUMIFS(D_D[EVD],D_D[MT],5,D_D[CAT],SMS, D_D[EP],499,D_D[LOC],$A88)/$E88,0))","v":""},{"$f":"IF(ISNA($A88),\"\",IFERROR(SUMIFS(D_D[DEC],D_D[MT],5,D_D[CAT],SMS, D_D[EP],499,D_D[LOC],$A88)/$E88,0))","v":""},{"$f":"IF(ISNA($A88),\"\",IFERROR(SUMIFS(D_D[AWD],D_D[MT],5,D_D[CAT],SMS, D_D[EP],499,D_D[LOC],$A88)/$E88,0))","v":""},{"$f":"IF(ISNA($A88),\"\",IFERROR(SUMIFS(D_D[AUT],D_D[MT],5,D_D[CAT],SMS, D_D[EP],499,D_D[LOC],$A88)/$E88,0))","v":""}]
[{"$error":"#N/A"},77,"",{"$f":"IFERROR(INDEX(INDIRECT(DS_NWQD),B89),\"\")","v":""},{"$f":"IF(ISNA($A89),\"\",IFERROR(SUMIFS(D_D[INV],D_D[MT],5,D_D[CAT],SMS, D_D[EP],499,D_D[LOC],$A89),0))","v":""},{"$f":"IF(ISNA($A89),\"\",IFERROR(SUMIFS(D_D[BL],D_D[MT],5,D_D[CAT],SMS, D_D[EP],499,D_D[LOC],$A89),0))","v":""},{"$f":"IF(ISNA($A89),\"\",IFERROR(F89/E89,0))","v":""},{"$f":"IF(ISNA($A89),\"\",IFERROR(SUMIFS(D_D[DEV],D_D[MT],5,D_D[CAT],SMS, D_D[EP],499,D_D[LOC],$A89)/$E89,0))","v":""},{"$f":"IF(ISNA($A89),\"\",IFERROR(SUMIFS(D_D[EVD],D_D[MT],5,D_D[CAT],SMS, D_D[EP],499,D_D[LOC],$A89)/$E89,0))","v":""},{"$f":"IF(ISNA($A89),\"\",IFERROR(SUMIFS(D_D[DEC],D_D[MT],5,D_D[CAT],SMS, D_D[EP],499,D_D[LOC],$A89)/$E89,0))","v":""},{"$f":"IF(ISNA($A89),\"\",IFERROR(SUMIFS(D_D[AWD],D_D[MT],5,D_D[CAT],SMS, D_D[EP],499,D_D[LOC],$A89)/$E89,0))","v":""},{"$f":"IF(ISNA($A89),\"\",IFERROR(SUMIFS(D_D[AUT],D_D[MT],5,D_D[CAT],SMS, D_D[EP],499,D_D[LOC],$A89)/$E89,0))","v":""}]

{"sheet":"Traditional Aggregate (TA)","index":10,"n_rows":48,"n_cols":14,"rows_kept":48,"cut":false,"hidden":false,"merged":[[1,1,1,6],[1,7,1,11],[10,11,10,13],[31,11,31,13],[32,11,32,12],[11,11,11,13],[2,1,2,13],[3,6,3,9],[3,1,3,4],[3,11,3,13],[16,11,16,13]]}
[]
[null,{"$f":"\"Compensation and Pension National Inventory - Historical Reporting Bundles* - Data through \"","v":"Compensation and Pension National Inventory - Historical Reporting Bundles* - Data through "},null,null,null,null,null,{"$f":"D_DT[]","v":"2023-08-05"}]
[null,"*The data on this page represents historical, alternative reporting on VBA claims processing.  VBA actively measures and monitors these workloads, but the bundles are not specifically tied to VBA's strategic target 125 Days and 98% Accuracy.  The Rating Bundle measures are the only claims processing bundle that is directly related to the strategic 2015 goals.\nEnd products which are included in the Rating Bundle group are highlighted in green."]
[null,"Compensation Entitlement",null,null,null,null,"Pension Entitlement",null,null,null,null,"Legacy Appeals"]
[null,"Measurement","Claims Pending","Pending over 125 days","Percent Pending over 125 days",null,"Measurement","Claims Pending","Pending over 125 days","Percent Pending over 125 days",null,"Measurement","Appeals Pending","Average Days Pending"]
[null,"Original Entitlement - Veterans1",{"$f":"SUM(C7:C9)","v":201716},{"$f":"SUM(D7:D9)","v":68470},{"$f":"IFERROR(D6/C6,0)","v":0.33943762517599002},null,"Original Entitlement ",{"$f":"SUM(H7:H9)","v":26003},{"$f":"SUM(I7:I9)","v":5278},{"$f":"IFERROR(I6/H6,0)","v":0.20297657962542784},1,"Notice of Disagreements",{"$f":"IFERROR(SUMIFS(D_D[INV],D_D[MT],7,D_D[CAT],1,D_D[EP],$K6),0)","v":216},{"$f":"IFERROR(SUMIFS(D_D[ADP],D_D[MT],7,D_D[CAT],1,D_D[EP],$K6),0)","v":2210.56}]
["095","EP 095 - Initial entitlement decisions for Voc Rehab",{"$f":"IFERROR(SUMIFS(D_D[INV],D_D[MT],3,D_D[CAT],TA_21,D_D[EP],$A7),0)","v":9},{"$f":"IFERROR(SUMIFS(D_D[BL],D_D[MT],3,D_D[CAT],TA_21,D_D[EP],$A7),0)","v":2},{"$f":"IFERROR(D7/C7,0)","v":0.22222222222222221},180,"EP 180 - Initial entitlement - Veteran ",{"$f":"IFERROR(SUMIFS(D_D[INV],D_D[MT],3,D_D[CAT],TA_31,D_D[EP],$F7),0)","v":11410},{"$f":"IFERROR(SUMIFS(D_D[BL],D_D[MT],3,D_D[CAT],TA_31,D_D[EP],$F7),0)","v":2418},0.21191936897458369,9,"Statement of the Case*",{"$f":"IFERROR(SUMIFS(D_D[INV],D_D[MT],7,D_D[CAT],1,D_D[EP],$K7),0)","v":181},{"$f":"IFERROR(SUMIFS(D_D[ADP],D_D[MT],7,D_D[CAT],1,D_D[EP],$K7),0)","v":2389.25}]
["010","EP 010 - Initial entitlement for service-connected disability (=>8)",{"$f":"IFERROR(SUMIFS(D_D[INV],D_D[MT],3,D_D[CAT],TA_21,D_D[EP],$A8),0)","v":78284},{"$f":"IFERROR(SUMIFS(D_D[BL],D_D[MT],3,D_D[CAT],TA_21,D_D[EP],$A8),0)","v":31147},0.39787185120842061,120,"EP 120 - Increased entitlement and/or reconsideration ",{"$f":"IFERROR(SUMIFS(D_D[INV],D_D[MT],3,D_D[CAT],TA_31,D_D[EP],$F8),0)","v":5172},{"$f":"IFERROR(SUMIFS(D_D[BL],D_D[MT],3,D_D[CAT],TA_31,D_D[EP],$F8),0)","v":1107},0.2140371229698376,"2","Form 9s",{"$f":"IFERROR(SUMIFS(D_D[INV],D_D[MT],7,D_D[CAT],1,D_D[EP],$K8),0)","v":105},{"$f":"IFERROR(SUMIFS(D_D[ADP],D_D[MT],7,D_D[CAT],1,D_D[EP],$K8),0)","v":1207.22}]
["110","EP 110 - Initial entitlement for service-connected disability (<=7)",{"$f":"IFERROR(SUMIFS(D_D[INV],D_D[MT],3,D_D[CAT],TA_21,D_D[EP],$A9),0)","v":123423},{"$f":"IFERROR(SUMIFS(D_D[BL],D_D[MT],3,D_D[CAT],TA_21,D_D[EP],$A9),0)","v":37321},0.30238286218938121,190,"EP 190 - Initial entitlement - Survivor ",{"$f":"IFERROR(SUMIFS(D_D[INV],D_D[MT],3,D_D[CAT],TA_31,D_D[EP],$F9),0)","v":9421},{"$f":"IFERROR(SUMIFS(D_D[BL],D_D[MT],3,D_D[CAT],TA_31,D_D[EP],$F9),0)","v":1753},0.18607366521600679,"3","Remands",{"$f":"IFERROR(SUMIFS(D_D[INV],D_D[MT],7,D_D[CAT],1,D_D[EP],$K9),0)","v":31597},{"$f":"IFERROR(SUMIFS(D_D[ADP],D_D[MT],7,D_D[CAT],1,D_D[EP],$K9),0)","v":212.66}]
[null,"Original Entitlement - Survivors2",{"$f":"SUM(C11:C12)","v":20727},{"$f":"SUM(D11:D12)","v":8457},0.40801852655956,null,"Pension Award Adjustments",{"$f":"SUM(H11:H16)","v":7055},{"$f":"SUM(I11:I16)","v":3219},0.45627214741318212,null,"Total Appeals Pending Under VBA control",{"$f":"M6+M7+M8+M9","v":32099}]
["140","EP 140 - Initial claims from surviving spouses, children or parents",{"$f":"IFERROR(SUMIFS(D_D[INV],D_D[MT],3,D_D[CAT],TA_21,D_D[EP],$A11),0)","v":20631},{"$f":"IFERROR(SUMIFS(D_D[BL],D_D[MT],3,D_D[CAT],TA_21,D_D[EP],$A11),0)","v":8413},0.40778440211332462,135,"EP 135 - Hospitalization adjustment (non-rating)",{"$f":"IFERROR(SUMIFS(D_D[INV],D_D[MT],3,D_D[CAT],TA_32,D_D[EP],$F11),0)","v":108},{"$f":"IFERROR(SUMIFS(D_D[BL],D_D[MT],3,D_D[CAT],TA_32,D_D[EP],$F11),0)","v":30},{"$f":"IFERROR(I11/H11,0)","v":0.27777777777777779},null,"*the veteran has 60 days to respond to an SOC to continue onto the Form 9 stage"]
["410","EP 410 - Initial claims from Veterans' children with Spina bifida and/or birth defects",{"$f":"IFERROR(SUMIFS(D_D[INV],D_D[MT],3,D_D[CAT],TA_21,D_D[EP],$A12),0)","v":96},{"$f":"IFERROR(SUMIFS(D_D[BL],D_D[MT],3,D_D[CAT],TA_21,D_D[EP],$A12),0)","v":44},0.45833333333333331,137,"EP 137 - Dependency",{"$f":"IFERROR(SUMIFS(D_D[INV],D_D[MT],3,D_D[CAT],TA_32,D_D[EP],$F12),0)","v":16},{"$f":"IFERROR(SUMIFS(D_D[BL],D_D[MT],3,D_D[CAT],TA_32,D_D[EP],$F12),0)","v":3},0.1875,null,"RAMP (Rapid Appeals Modernization Program)"]
[null,"Supplemental Entitlement",{"$f":"SUM(C14:C17)","v":632601},{"$f":"SUM(D14:D17)","v":183576},0.29019239615492232,"150G","EP 150 - Income adjustments",{"$f":"IFERROR(SUMIFS(D_D[INV],D_D[MT],3,D_D[CAT],TA_32,D_D[EP],$F13),0)","v":6930},{"$f":"IFERROR(SUMIFS(D_D[BL],D_D[MT],3,D_D[CAT],TA_32,D_D[EP],$F13),0)","v":3186},0.45974025974025973,"7","EP 682 - Higher Level Review",{"$f":"IFERROR(SUMIFS(D_D[INV],D_D[MT],7,D_D[CAT],1,D_D[EP],$K13),0)","v":0},{"$f":"IFERROR(SUMIFS(D_D[ADP],D_D[MT],7,D_D[CAT],1,D_D[EP],$K13),0)","v":0}]
["040","EP 040 - Supplemental Claims (AMA)",{"$f":"IFERROR(SUMIFS(D_D[INV],D_D[MT],3,D_D[CAT],TA_21,D_D[EP],$A14),0)","v":179065},{"$f":"IFERROR(SUMIFS(D_D[BL],D_D[MT],3,D_D[CAT],TA_21,D_D[EP],$A14),0)","v":66562},0.37171976656521377,155,"EP 155 - Annual eligibility verification reporting (EVRs)",{"$f":"IFERROR(SUMIFS(D_D[INV],D_D[MT],3,D_D[CAT],TA_32,D_D[EP],$F14),0)","v":0},{"$f":"IFERROR(SUMIFS(D_D[BL],D_D[MT],3,D_D[CAT],TA_32,D_D[EP],$F14),0)","v":0},0,8,"EP 683 - Supplemental Evidence",{"$f":"IFERROR(SUMIFS(D_D[INV],D_D[MT],7,D_D[CAT],1,D_D[EP],$K14),0)","v":0},{"$f":"IFERROR(SUMIFS(D_D[ADP],D_D[MT],7,D_D[CAT],1,D_D[EP],$K14),0)","v":0}]
["020","EP 020 - Increased evaluation and/or additional claimed conditions",{"$f":"IFERROR(SUMIFS(D_D[INV],D_D[MT],3,D_D[CAT],TA_21,D_D[EP],$A15),0)","v":452548},{"$f":"IFERROR(SUMIFS(D_D[BL],D_D[MT],3,D_D[CAT],TA_21,D_D[EP],$A15),0)","v":116973},0.25847644890707727,297,"EP 297 - Misc determinations",{"$f":"IFERROR(SUMIFS(D_D[INV],D_D[MT],3,D_D[CAT],TA_32,D_D[EP],$F15),0)","v":0},{"$f":"IFERROR(SUMIFS(D_D[BL],D_D[MT],3,D_D[CAT],TA_32,D_D[EP],$F15),0)","v":0},0,6,"Total RAMP",{"$f":"IFERROR(SUMIFS(D_D[INV],D_D[MT],7,D_D[CAT],1,D_D[EP],$K15),0)","v":0},{"$f":"IFERROR(SUMIFS(D_D[ADP],D_D[MT],7,D_D[CAT],1,D_D[EP],$K15),0)","v":0}]
["320","EP 320 -Increased entitlement due to hospitalization or surgery",{"$f":"IFERROR(SUMIFS(D_D[INV],D_D[MT],3,D_D[CAT],TA_21,D_D[EP],$A16),0)","v":974},{"$f":"IFERROR(SUMIFS(D_D[BL],D_D[MT],3,D_D[CAT],TA_21,D_D[EP],$A16),0)","v":29},2.9774127310061602E-2,607,"EP 607 - Due process",{"$f":"IFERROR(SUMIFS(D_D[INV],D_D[MT],3,D_D[CAT],TA_32,D_D[EP],$F16),0)","v":1},{"$f":"IFERROR(SUMIFS(D_D[BL],D_D[MT],3,D_D[CAT],TA_32,D_D[EP],$F16),0)","v":0},0]
["420","EP 420 - Spina bifida and/or birth defects reconsideration",{"$f":"IFERROR(SUMIFS(D_D[INV],D_D[MT],3,D_D[CAT],TA_21,D_D[EP],$A17),0)","v":14},{"$f":"IFERROR(SUMIFS(D_D[BL],D_D[MT],3,D_D[CAT],TA_21,D_D[EP],$A17),0)","v":12},0.8571428571428571,null,"Program Reviews",{"$f":"SUM(H18:H20)","v":1285},{"$f":"SUM(I18:I20)","v":1060},{"$f":"IFERROR(I17/H17,0)","v":0.82490272373540852},null,"DROC Decision Review Workload (AMA)"]
["12","Award Adjustments",{"$f":"SUM(C19:C25)","v":351364},{"$f":"SUM(D19:D25)","v":109242},0.31090834576109105,"154","EP 154 - Income Verification Match",{"$f":"IFERROR(SUMIFS(D_D[INV],D_D[MT],3,D_D[CAT],TA_33,D_D[EP],$F18),0)","v":236},{"$f":"IFERROR(SUMIFS(D_D[BL],D_D[MT],3,D_D[CAT],TA_33,D_D[EP],$F18),0)","v":21},8.8983050847457626E-2,null,null,"Claims Pending","Average Days Pending"]
["130G","EP 130 - Dependency",{"$f":"IFERROR(SUMIFS(D_D[INV],D_D[MT],3,D_D[CAT],TA_22,D_D[EP],$A19),0)","v":148455},{"$f":"IFERROR(SUMIFS(D_D[BL],D_D[MT],3,D_D[CAT],TA_22,D_D[EP],$A19),0)","v":17066},{"$f":"IFERROR(D19/C19,0)","v":0.11495739449664881},"696","EP 696 - Cost of Living Adjustments",{"$f":"IFERROR(SUMIFS(D_D[INV],D_D[MT],3,D_D[CAT],TA_33,D_D[EP],$F19),0)","v":1049},{"$f":"IFERROR(SUMIFS(D_D[BL],D_D[MT],3,D_D[CAT],TA_33,D_D[EP],$F19),0)","v":1039},0.99046711153479505,1,"EP 030 - Higher-Level Reviews (HLR)",{"$f":"IFERROR(SUMIFS(D_D[INV],D_D[MT],12,D_D[CAT],9000,D_D[EP],$K19),0)","v":48215},{"$f":"IFERROR(SUMIFS(D_D[ADP],D_D[MT],12,D_D[CAT],9000,D_D[EP],$K19),0)","v":53.743606761381301}]
["133","EP 133 - Survivor restored entitlement",{"$f":"IFERROR(SUMIFS(D_D[INV],D_D[MT],3,D_D[CAT],TA_22,D_D[EP],$A20),0)","v":27},{"$f":"IFERROR(SUMIFS(D_D[BL],D_D[MT],3,D_D[CAT],TA_22,D_D[EP],$A20),0)","v":19},0.70370370370370372,"697","EP 697 - Non-entitlement reviews",{"$f":"IFERROR(SUMIFS(D_D[INV],D_D[MT],3,D_D[CAT],TA_33,D_D[EP],$F20),0)","v":0},{"$f":"IFERROR(SUMIFS(D_D[BL],D_D[MT],3,D_D[CAT],TA_33,D_D[EP],$F20),0)","v":0},0,1.1000000000000001,"HLR - Compensation",{"$f":"IFERROR(SUMIFS(D_D[INV],D_D[MT],12,D_D[CAT],9000,D_D[EP],$K20),0)","v":47246},{"$f":"IFERROR(SUMIFS(D_D[ADP],D_D[MT],12,D_D[CAT],9000,D_D[EP],$K20),0)","v":53.235617830080798}]
["135","EP 135 - Hospitalization adjustment (non-rating)",{"$f":"IFERROR(SUMIFS(D_D[INV],D_D[MT],3,D_D[CAT],TA_22,D_D[EP],$A21),0)","v":254},{"$f":"IFERROR(SUMIFS(D_D[BL],D_D[MT],3,D_D[CAT],TA_22,D_D[EP],$A21),0)","v":39},0.15354330708661418,null,"Pension Other",{"$f":"SUM(H22:H25)","v":58},{"$f":"SUM(I22:I25)","v":0},{"$f":"IFERROR(I21/H21,0)","v":0},1.2,"HLR - Pension",{"$f":"IFERROR(SUMIFS(D_D[INV],D_D[MT],12,D_D[CAT],9000,D_D[EP],$K21),0)","v":969},{"$f":"IFERROR(SUMIFS(D_D[ADP],D_D[MT],12,D_D[CAT],9000,D_D[EP],$K21),0)","v":78.511867905056704}]
["290G","EP 290 - Misc determinations",{"$f":"IFERROR(SUMIFS(D_D[INV],D_D[MT],3,D_D[CAT],TA_22,D_D[EP],$A22),0)","v":47160},{"$f":"IFERROR(SUMIFS(D_D[BL],D_D[MT],3,D_D[CAT],TA_22,D_D[EP],$A22),0)","v":7329},0.15540712468193385,"407","EP 407 - Correspondence ",{"$f":"IFERROR(SUMIFS(D_D[INV],D_D[MT],3,D_D[CAT],TA_34,D_D[EP],$F22),0)","v":58},{"$f":"IFERROR(SUMIFS(D_D[BL],D_D[MT],3,D_D[CAT],TA_34,D_D[EP],$F22),0)","v":0},0,2,"EP 040 - Higher-Level Review Returns (HLRR)",{"$f":"IFERROR(SUMIFS(D_D[INV],D_D[MT],12,D_D[CAT],9000,D_D[EP],$K22),0)","v":46341},{"$f":"IFERROR(SUMIFS(D_D[ADP],D_D[MT],12,D_D[CAT],9000,D_D[EP],$K22),0)","v":151.46274357480399}]
["450","EP 450 - Spina bifida and/or birth defects adjustments",{"$f":"IFERROR(SUMIFS(D_D[INV],D_D[MT],3,D_D[CAT],TA_22,D_D[EP],$A23),0)","v":6},{"$f":"IFERROR(SUMIFS(D_D[BL],D_D[MT],3,D_D[CAT],TA_22,D_D[EP],$A23),0)","v":5},0.83333333333333337,"507","EP 507 - Congressional correspondence ",{"$f":"IFERROR(SUMIFS(D_D[INV],D_D[MT],3,D_D[CAT],TA_34,D_D[EP],$F23),0)","v":0},{"$f":"IFERROR(SUMIFS(D_D[BL],D_D[MT],3,D_D[CAT],TA_34,D_D[EP],$F23),0)","v":0},0,2.1,"HLRR - Compensation",{"$f":"IFERROR(SUMIFS(D_D[INV],D_D[MT],12,D_D[CAT],9000,D_D[EP],$K23),0)","v":45871},{"$f":"IFERROR(SUMIFS(D_D[ADP],D_D[MT],12,D_D[CAT],9000,D_D[EP],$K23),0)","v":151.17150269233201}]
["310G","EP 310 -Future examination for disabilities",{"$f":"IFERROR(SUMIFS(D_D[INV],D_D[MT],3,D_D[CAT],TA_22,D_D[EP],$A24),0)","v":9300},{"$f":"IFERROR(SUMIFS(D_D[BL],D_D[MT],3,D_D[CAT],TA_22,D_D[EP],$A24),0)","v":548},5.8924731182795696E-2,"937","EP 937 - Internal quality reviews",{"$f":"IFERROR(SUMIFS(D_D[INV],D_D[MT],3,D_D[CAT],TA_34,D_D[EP],$F24),0)","v":0},{"$f":"IFERROR(SUMIFS(D_D[BL],D_D[MT],3,D_D[CAT],TA_34,D_D[EP],$F24),0)","v":0},0,2.2000000000000002,"HLRR - Pension",{"$f":"IFERROR(SUMIFS(D_D[INV],D_D[MT],12,D_D[CAT],9000,D_D[EP],$K24),0)","v":470},{"$f":"IFERROR(SUMIFS(D_D[ADP],D_D[MT],12,D_D[CAT],9000,D_D[EP],$K24),0)","v":179.88723404255299}]
["600G","EP 600 - Due process",{"$f":"IFERROR(SUMIFS(D_D[INV],D_D[MT],3,D_D[CAT],TA_22,D_D[EP],$A25),0)","v":146162},{"$f":"IFERROR(SUMIFS(D_D[BL],D_D[MT],3,D_D[CAT],TA_22,D_D[EP],$A25),0)","v":84236},0.57631942638989619,"967","EP 967 - Correction of errors",{"$f":"IFERROR(SUMIFS(D_D[INV],D_D[MT],3,D_D[CAT],TA_34,D_D[EP],$F25),0)","v":0},{"$f":"IFERROR(SUMIFS(D_D[BL],D_D[MT],3,D_D[CAT],TA_34,D_D[EP],$F25),0)","v":0},0,3,"EP 040 - Board AMA Returns (Remands)",{"$f":"IFERROR(SUMIFS(D_D[INV],D_D[MT],12,D_D[CAT],9000,D_D[EP],$K25),0)","v":7804},{"$f":"IFERROR(SUMIFS(D_D[ADP],D_D[MT],12,D_D[CAT],9000,D_D[EP],$K25),0)","v":148.390184520758}]
[null,"Program Reviews ",{"$f":"SUM(C27:C33)","v":177},{"$f":"SUM(D27:D33)","v":78},{"$f":"IFERROR(D26/C26,0)","v":0.44067796610169491},null,"Pension Burial/Accrued",{"$f":"SUM(H27:H29)","v":2622},{"$f":"SUM(I27:I29)","v":1434},{"$f":"IFERROR(I26/H26,0)","v":0.54691075514874143},3.1,"Remands - Compensation",{"$f":"IFERROR(SUMIFS(D_D[INV],D_D[MT],12,D_D[CAT],9000,D_D[EP],$K26),0)","v":7603},{"$f":"IFERROR(SUMIFS(D_D[ADP],D_D[MT],12,D_D[CAT],9000,D_D[EP],$K26),0)","v":148.04235170327499}]
["314","EP 314 - Income verification for unemployability",{"$f":"IFERROR(SUMIFS(D_D[INV],D_D[MT],3,D_D[CAT],TA_23,D_D[EP],$A27),0)","v":0},{"$f":"IFERROR(SUMIFS(D_D[BL],D_D[MT],3,D_D[CAT],TA_23,D_D[EP],$A27),0)","v":0},0,"167","EP 167 - Burials",{"$f":"IFERROR(SUMIFS(D_D[INV],D_D[MT],3,D_D[CAT],TA_35,D_D[EP],$F27),0)","v":0},{"$f":"IFERROR(SUMIFS(D_D[BL],D_D[MT],3,D_D[CAT],TA_35,D_D[EP],$F27),0)","v":0},0,3.2,"Remands - Pension",{"$f":"IFERROR(SUMIFS(D_D[INV],D_D[MT],12,D_D[CAT],9000,D_D[EP],$K27),0)","v":201},{"$f":"IFERROR(SUMIFS(D_D[ADP],D_D[MT],12,D_D[CAT],9000,D_D[EP],$K27),0)","v":161.547263681592}]
["680G","EP 680 - Review of Hemodialysis related cases/conditions ",{"$f":"IFERROR(SUMIFS(D_D[INV],D_D[MT],3,D_D[CAT],TA_23,D_D[EP],$A28),0)","v":2},{"$f":"IFERROR(SUMIFS(D_D[BL],D_D[MT],3,D_D[CAT],TA_23,D_D[EP],$A28),0)","v":0},0,"165","EP 165 - Accrued",{"$f":"IFERROR(SUMIFS(D_D[INV],D_D[MT],3,D_D[CAT],TA_36,D_D[EP],$F28),0)","v":2622},{"$f":"IFERROR(SUMIFS(D_D[BL],D_D[MT],3,D_D[CAT],TA_36,D_D[EP],$F28),0)","v":1434},0.54691075514874143,4,"EP 030 - Board AMA Full Grants",{"$f":"IFERROR(SUMIFS(D_D[INV],D_D[MT],12,D_D[CAT],9000,D_D[EP],$K28),0)","v":1112},{"$f":"IFERROR(SUMIFS(D_D[ADP],D_D[MT],12,D_D[CAT],9000,D_D[EP],$K28),0)","v":39.987410071942399}]
["682","EP 682 - Review of Radiation related cases/conditions",{"$f":"IFERROR(SUMIFS(D_D[INV],D_D[MT],3,D_D[CAT],TA_23,D_D[EP],$A29),0)","v":0},{"$f":"IFERROR(SUMIFS(D_D[BL],D_D[MT],3,D_D[CAT],TA_23,D_D[EP],$A29),0)","v":0},0,null,null,null,null,null,4.0999999999999996,"Grants - Compensation",{"$f":"IFERROR(SUMIFS(D_D[INV],D_D[MT],12,D_D[CAT],9000,D_D[EP],$K29),0)","v":1068},{"$f":"IFERROR(SUMIFS(D_D[ADP],D_D[MT],12,D_D[CAT],9000,D_D[EP],$K29),0)","v":39.800561797752799}]
["684","EP 684 - Review of Misc cases referred to central office",{"$f":"IFERROR(SUMIFS(D_D[INV],D_D[MT],3,D_D[CAT],TA_23,D_D[EP],$A30),0)","v":0},{"$f":"IFERROR(SUMIFS(D_D[BL],D_D[MT],3,D_D[CAT],TA_23,D_D[EP],$A30),0)","v":0},0,null,null,null,null,null,4.2,"Grants - Pension",{"$f":"IFERROR(SUMIFS(D_D[INV],D_D[MT],12,D_D[CAT],9000,D_D[EP],$K30),0)","v":44},{"$f":"IFERROR(SUMIFS(D_D[ADP],D_D[MT],12,D_D[CAT],9000,D_D[EP],$K30),0)","v":44.522727272727202}]
["685","EP 685 - Review of effective date related to herbicide exposure",{"$f":"IFERROR(SUMIFS(D_D[INV],D_D[MT],3,D_D[CAT],TA_23,D_D[EP],$A31),0)","v":0},{"$f":"IFERROR(SUMIFS(D_D[BL],D_D[MT],3,D_D[CAT],TA_23,D_D[EP],$A31),0)","v":0},0]
["690G","EP 690 - Cost of Living Adjustments (COLAs) and other reviews",{"$f":"IFERROR(SUMIFS(D_D[INV],D_D[MT],3,D_D[CAT],TA_23,D_D[EP],$A32),0)","v":169},{"$f":"IFERROR(SUMIFS(D_D[BL],D_D[MT],3,D_D[CAT],TA_23,D_D[EP],$A32),0)","v":78},0.46153846153846156,null,null,null,null,null,null,"Integrated Disability Evaluation System (IDES)"]
["690","EP 690 - Social Security number verification",{"$f":"IFERROR(SUMIFS(D_D[INV],D_D[MT],3,D_D[CAT],TA_23,D_D[EP],$A33),0)","v":6},{"$f":"IFERROR(SUMIFS(D_D[BL],D_D[MT],3,D_D[CAT],TA_23,D_D[EP],$A33),0)","v":0},0,null,null,null,null,null,null,"Number of IDES claims pending",null,{"$f":"IFERROR(SUMIFS(D_D[INV],D_D[MT],10,D_D[CAT],1,D_D[EP],-1),0)","v":24364}]
[null,"Compensation Other",{"$f":"SUM(C35:C45)","v":103212},{"$f":"SUM(D35:D45)","v":39968},{"$f":"IFERROR(D34/C34,0)","v":0.38724179358989264}]
["335","EP 335 - Blue Water Navy (Agent Orange)",{"$f":"IFERROR(SUMIFS(D_D[INV],D_D[MT],3,D_D[CAT],TA_24,D_D[EP],$A35),0)","v":8269},{"$f":"IFERROR(SUMIFS(D_D[BL],D_D[MT],3,D_D[CAT],TA_24,D_D[EP],$A35),0)","v":7179},{"$f":"IFERROR(D35/C35,0)","v":0.86818236788003389}]
["400G","EP 400 - Correspondence ",{"$f":"IFERROR(SUMIFS(D_D[INV],D_D[MT],3,D_D[CAT],TA_24,D_D[EP],$A36),0)","v":19364},{"$f":"IFERROR(SUMIFS(D_D[BL],D_D[MT],3,D_D[CAT],TA_24,D_D[EP],$A36),0)","v":1924},9.9359636438752327E-2]
["500G","EP 500 - Congressional correspondence",{"$f":"IFERROR(SUMIFS(D_D[INV],D_D[MT],3,D_D[CAT],TA_24,D_D[EP],$A37),0)","v":456},{"$f":"IFERROR(SUMIFS(D_D[BL],D_D[MT],3,D_D[CAT],TA_24,D_D[EP],$A37),0)","v":9},1.9736842105263157E-2]
["510","EP 510 - Freedom of Information Act (FOIA) requests",{"$f":"IFERROR(SUMIFS(D_D[INV],D_D[MT],3,D_D[CAT],TA_24,D_D[EP],$A38),0)","v":53420},{"$f":"IFERROR(SUMIFS(D_D[BL],D_D[MT],3,D_D[CAT],TA_24,D_D[EP],$A38),0)","v":14730},0.27573942343691499]
["930G","EP 930 - Review, including quality assurance",{"$f":"IFERROR(SUMIFS(D_D[INV],D_D[MT],3,D_D[CAT],TA_24,D_D[EP],$A39),0)","v":20186},{"$f":"IFERROR(SUMIFS(D_D[BL],D_D[MT],3,D_D[CAT],TA_24,D_D[EP],$A39),0)","v":15147},0.75037154463489553]
["960G","EP 960 - Correction of errors",{"$f":"IFERROR(SUMIFS(D_D[INV],D_D[MT],3,D_D[CAT],TA_24,D_D[EP],$A40),0)","v":596},{"$f":"IFERROR(SUMIFS(D_D[BL],D_D[MT],3,D_D[CAT],TA_24,D_D[EP],$A40),0)","v":151},0.25335570469798657]
["681","EP 681 - Used to control claims under the Nehmer Agent Orange stipulation",{"$f":"IFERROR(SUMIFS(D_D[INV],D_D[MT],3,D_D[CAT],TA_24,D_D[EP],$A41),0)","v":133},{"$f":"IFERROR(SUMIFS(D_D[BL],D_D[MT],3,D_D[CAT],TA_24,D_D[EP],$A41),0)","v":70},{"$f":"IFERROR(D41/C41,0)","v":0.52631578947368418}]
["687","EP 687 - Blue Water Navy Agent Orange Nehmer Reviews",{"$f":"IFERROR(SUMIFS(D_D[INV],D_D[MT],3,D_D[CAT],TA_24,D_D[EP],$A42),0)","v":1},{"$f":"IFERROR(SUMIFS(D_D[BL],D_D[MT],3,D_D[CAT],TA_24,D_D[EP],$A42),0)","v":1},{"$f":"IFERROR(D42/C42,0)","v":1}]
["688","EP 688 - NDAA Agent Orange Nehmer Reviews (3 new authorized AO disabilities)",{"$f":"IFERROR(SUMIFS(D_D[INV],D_D[MT],3,D_D[CAT],TA_24,D_D[EP],$A43),0)","v":777},{"$f":"IFERROR(SUMIFS(D_D[BL],D_D[MT],3,D_D[CAT],TA_24,D_D[EP],$A43),0)","v":757},{"$f":"IFERROR(D43/C43,0)","v":0.97425997425997424}]
["405","EP 405 - Reopened or new Agent Orange claims between 9/01/10 and 10/24/2011",{"$f":"IFERROR(SUMIFS(D_D[INV],D_D[MT],3,D_D[CAT],TA_24,D_D[EP],$A44),0)","v":0},{"$f":"IFERROR(SUMIFS(D_D[BL],D_D[MT],3,D_D[CAT],TA_24,D_D[EP],$A44),0)","v":0},{"$f":"IFERROR(D44/C44,0)","v":0}]
["409","EP 409 - Agent Orange claims where an interim decision was provided; No longer used as of 10/24/2011",{"$f":"IFERROR(SUMIFS(D_D[INV],D_D[MT],3,D_D[CAT],TA_24,D_D[EP],$A45),0)","v":10},{"$f":"IFERROR(SUMIFS(D_D[BL],D_D[MT],3,D_D[CAT],TA_24,D_D[EP],$A45),0)","v":0},{"$f":"IFERROR(D45/C45,0)","v":0}]
[null,"Compensation Burial/Accrued",{"$f":"SUM(C47:C49)","v":13357},{"$f":"SUM(D47:D49)","v":3635},{"$f":"IFERROR(D46/C46,0)","v":0.27214194804222502}]
["160G","EP 160 - Burials",{"$f":"IFERROR(SUMIFS(D_D[INV],D_D[MT],3,D_D[CAT],TA_25,D_D[EP],$A47),0)","v":12022},{"$f":"IFERROR(SUMIFS(D_D[BL],D_D[MT],3,D_D[CAT],TA_25,D_D[EP],$A47),0)","v":3024},0.25153884545000832]
["165","EP 165 - Accrued",{"$f":"IFERROR(SUMIFS(D_D[INV],D_D[MT],3,D_D[CAT],TA_26,D_D[EP],$A48),0)","v":1335},{"$f":"IFERROR(SUMIFS(D_D[BL],D_D[MT],3,D_D[CAT],TA_26,D_D[EP],$A48),0)","v":611},0.45767790262172287]

{"sheet":"Diarys and Future Claims","index":11,"n_rows":47,"n_cols":6,"rows_kept":47,"cut":false,"hidden":false,"merged":[[29,4,29,5],[0,1,0,4],[2,1,2,2],[2,4,2,5],[1,1,1,5]]}
[null,"Compensation and Pension Diary and Future Claims - Historical Reporting Bundles* - Data through ",null,null,null,{"$f":"D_DT[]","v":"2023-08-05"}]
[null,"The data on this page represents future claims that VA is aware of.  A portion of these claims roll into the traditional Rating Bundle group of end-products (EP) once the date of claim matures.\t\t\t\t"]
[null,"Compensation Entitlement",null,null,"Pension Entitlement"]
[null,"Measurement","Claims Pending",null,"Measurement","Claims Pending"]
[null,"Original Entitlement - Veterans1",{"$f":"SUM(C6:C8)","v":17761},null,"Original Entitlement ",{"$f":"SUM(F6:F8)","v":0}]
["095","EP 095 - Initial entitlement decisions for Voc Rehab",{"$f":"IFERROR(SUMIFS(D_D[INV],D_D[MT],11,D_D[CAT],TA_21,D_D[EP],$A6),0)","v":0},180,"EP 180 - Initial entitlement - Veteran ",{"$f":"IFERROR(SUMIFS(D_D[INV],D_D[MT],11,D_D[CAT],TA_31,D_D[EP],$D6),0)","v":0}]
["010","EP 010 - Initial entitlement for service-connected disability (=>8)",{"$f":"IFERROR(SUMIFS(D_D[INV],D_D[MT],11,D_D[CAT],TA_21,D_D[EP],$A7),0)","v":15548},120,"EP 120 - Increased entitlement and/or reconsideration ",{"$f":"IFERROR(SUMIFS(D_D[INV],D_D[MT],11,D_D[CAT],TA_31,D_D[EP],$D7),0)","v":0}]
["110","EP 110 - Initial entitlement for service-connected disability (<=7)",{"$f":"IFERROR(SUMIFS(D_D[INV],D_D[MT],11,D_D[CAT],TA_21,D_D[EP],$A8),0)","v":2213},190,"EP 190 - Initial entitlement - Survivor ",{"$f":"IFERROR(SUMIFS(D_D[INV],D_D[MT],11,D_D[CAT],TA_31,D_D[EP],$D8),0)","v":0}]
[null,"Original Entitlement - Survivors2",{"$f":"SUM(C10:C11)","v":0},null,"Pension Award Adjustments",{"$f":"SUM(F10:F15)","v":0}]
["140","EP 140 - Initial claims from surviving spouses, children or parents",{"$f":"IFERROR(SUMIFS(D_D[INV],D_D[MT],11,D_D[CAT],TA_21,D_D[EP],$A10),0)","v":0},135,"EP 135 - Hospitalization adjustment (non-rating)",{"$f":"IFERROR(SUMIFS(D_D[INV],D_D[MT],11,D_D[CAT],TA_31,D_D[EP],$D10),0)","v":0}]
["410","EP 410 - Initial claims from Veterans' children with Spina bifida and/or birth defects",{"$f":"IFERROR(SUMIFS(D_D[INV],D_D[MT],11,D_D[CAT],TA_21,D_D[EP],$A11),0)","v":0},137,"EP 137 - Dependency",{"$f":"IFERROR(SUMIFS(D_D[INV],D_D[MT],11,D_D[CAT],TA_31,D_D[EP],$D11),0)","v":0}]
[null,"Supplemental Entitlement",{"$f":"SUM(C13:C16)","v":649},"150G","EP 150 - Income adjustments",{"$f":"IFERROR(SUMIFS(D_D[INV],D_D[MT],11,D_D[CAT],TA_31,D_D[EP],$D12),0)","v":0}]
["040","EP 040 - Decision Review Request",{"$f":"IFERROR(SUMIFS(D_D[INV],D_D[MT],11,D_D[CAT],TA_21,D_D[EP],$A13),0)","v":0},155,"EP 155 - Annual eligibility verification reporting (EVRs)",{"$f":"IFERROR(SUMIFS(D_D[INV],D_D[MT],11,D_D[CAT],TA_31,D_D[EP],$D13),0)","v":0}]
["020","EP 020 - Increased evaluation and/or additional claimed conditions",{"$f":"IFERROR(SUMIFS(D_D[INV],D_D[MT],11,D_D[CAT],TA_21,D_D[EP],$A14),0)","v":649},297,"EP 297 - Misc determinations",{"$f":"IFERROR(SUMIFS(D_D[INV],D_D[MT],11,D_D[CAT],TA_31,D_D[EP],$D14),0)","v":0}]
["320","EP 320 -Increased entitlement due to hospitalization or surgery",{"$f":"IFERROR(SUMIFS(D_D[INV],D_D[MT],11,D_D[CAT],TA_21,D_D[EP],$A15),0)","v":0},607,"EP 607 - Due process",{"$f":"IFERROR(SUMIFS(D_D[INV],D_D[MT],11,D_D[CAT],TA_31,D_D[EP],$D15),0)","v":0}]
["420","EP 420 - Spina bifida and/or birth defects reconsideration",{"$f":"IFERROR(SUMIFS(D_D[INV],D_D[MT],11,D_D[CAT],TA_21,D_D[EP],$A16),0)","v":0},null,"Program Reviews",{"$f":"SUM(F17:F19)","v":0}]
["12","Award Adjustments",{"$f":"SUM(C18:C24)","v":142},"154","EP 154 - Income Verification Match",{"$f":"IFERROR(SUMIFS(D_D[INV],D_D[MT],11,D_D[CAT],TA_31,D_D[EP],$D17),0)","v":0}]
["130G","EP 130 - Dependency",{"$f":"IFERROR(SUMIFS(D_D[INV],D_D[MT],11,D_D[CAT],TA_22,D_D[EP],$A18),0)","v":135},"696","EP 696 - Cost of Living Adjustments",{"$f":"IFERROR(SUMIFS(D_D[INV],D_D[MT],11,D_D[CAT],TA_31,D_D[EP],$D18),0)","v":0}]
["133","EP 133 - Survivor restored entitlement",{"$f":"IFERROR(SUMIFS(D_D[INV],D_D[MT],11,D_D[CAT],TA_22,D_D[EP],$A19),0)","v":0},"697","EP 697 - Non-entitlement reviews",{"$f":"IFERROR(SUMIFS(D_D[INV],D_D[MT],11,D_D[CAT],TA_31,D_D[EP],$D19),0)","v":0}]
["135","EP 135 - Hospitalization adjustment (non-rating)",{"$f":"IFERROR(SUMIFS(D_D[INV],D_D[MT],11,D_D[CAT],TA_22,D_D[EP],$A20),0)","v":0},null,"Pension Other",{"$f":"SUM(F21:F24)","v":0}]
["290G","EP 290 - Misc determinations",{"$f":"IFERROR(SUMIFS(D_D[INV],D_D[MT],11,D_D[CAT],TA_22,D_D[EP],$A21),0)","v":7},"407","EP 407 - Correspondence ",{"$f":"IFERROR(SUMIFS(D_D[INV],D_D[MT],11,D_D[CAT],TA_31,D_D[EP],$D21),0)","v":0}]
["450","EP 450 - Spina bifida and/or birth defects adjustments",{"$f":"IFERROR(SUMIFS(D_D[INV],D_D[MT],11,D_D[CAT],TA_22,D_D[EP],$A22),0)","v":0},"507","EP 507 - Congressional correspondence ",{"$f":"IFERROR(SUMIFS(D_D[INV],D_D[MT],11,D_D[CAT],TA_31,D_D[EP],$D22),0)","v":0}]
["310G","EP 310 -Future examination for disabilities",{"$f":"IFERROR(SUMIFS(D_D[INV],D_D[MT],11,D_D[CAT],TA_22,D_D[EP],$A23),0)","v":0},"937","EP 937 - Internal quality reviews",{"$f":"IFERROR(SUMIFS(D_D[INV],D_D[MT],11,D_D[CAT],TA_31,D_D[EP],$D23),0)","v":0}]
["600G","EP 600 - Due process",{"$f":"IFERROR(SUMIFS(D_D[INV],D_D[MT],11,D_D[CAT],TA_22,D_D[EP],$A24),0)","v":0},"967","EP 967 - Correction of errors",{"$f":"IFERROR(SUMIFS(D_D[INV],D_D[MT],11,D_D[CAT],TA_31,D_D[EP],$D24),0)","v":0}]
[null,"Program Reviews ",{"$f":"SUM(C26:C33)","v":2827},null,"Pension Burial/Accrued",{"$f":"SUM(F26:F27)","v":0}]
["314","EP 314 - Income verification for unemployability",{"$f":"IFERROR(SUMIFS(D_D[INV],D_D[MT],11,D_D[CAT],TA_23,D_D[EP],$A26),0)","v":0},"167","EP 167 - Burials",{"$f":"IFERROR(SUMIFS(D_D[INV],D_D[MT],11,D_D[CAT],TA_31,D_D[EP],$D26),0)","v":0}]
["330","EP 330 - Reviews",{"$f":"IFERROR(SUMIFS(D_D[INV],D_D[MT],11,D_D[CAT],TA_23,D_D[EP],$A27),0)","v":2827},"165","EP 165 - Accrued",{"$f":"IFERROR(SUMIFS(D_D[INV],D_D[MT],11,D_D[CAT],TA_31,D_D[EP],$D27),0)","v":0}]
["680G","EP 680 - Review of Hemodialysis related cases/conditions ",{"$f":"IFERROR(SUMIFS(D_D[INV],D_D[MT],11,D_D[CAT],TA_23,D_D[EP],$A28),0)","v":0}]
["682","EP 682 - Review of Radiation related cases/conditions",{"$f":"IFERROR(SUMIFS(D_D[INV],D_D[MT],11,D_D[CAT],TA_23,D_D[EP],$A29),0)","v":0}]
["684","EP 684 - Review of Misc cases referred to central office",{"$f":"IFERROR(SUMIFS(D_D[INV],D_D[MT],11,D_D[CAT],TA_23,D_D[EP],$A30),0)","v":0},null,"Integrated Disability Evaluation System (IDES)"]
["685","EP 685 - Review of effective date related to herbicide exposure",{"$f":"IFERROR(SUMIFS(D_D[INV],D_D[MT],11,D_D[CAT],TA_23,D_D[EP],$A31),0)","v":0},null,"EP 689 - IDES",{"$f":"IFERROR(SUMIFS(D_D[INV],D_D[MT],11,D_D[CAT],1,D_D[EP],-1),0)","v":1}]
["690G","EP 690 - Cost of Living Adjustments (COLAs) and other reviews",{"$f":"IFERROR(SUMIFS(D_D[INV],D_D[MT],11,D_D[CAT],TA_23,D_D[EP],$A32),0)","v":0}]
["690","EP 690 - Social Security number verification",{"$f":"IFERROR(SUMIFS(D_D[INV],D_D[MT],11,D_D[CAT],TA_23,D_D[EP],$A33),0)","v":0}]
[null,"Compensation Other",{"$f":"SUM(C35:C44)","v":56}]
["335","EP 335 - Blue Water Navy (Agent Orange)",{"$f":"IFERROR(SUMIFS(D_D[INV],D_D[MT],11,D_D[CAT],TA_24,D_D[EP],$A35),0)","v":0}]
["400G","EP 400 - Correspondence ",{"$f":"IFERROR(SUMIFS(D_D[INV],D_D[MT],11,D_D[CAT],TA_24,D_D[EP],$A36),0)","v":54}]
["500G","EP 500 - Congressional correspondence",{"$f":"IFERROR(SUMIFS(D_D[INV],D_D[MT],11,D_D[CAT],TA_24,D_D[EP],$A37),0)","v":0}]
["510","EP 510 - Freedom of Information Act (FOIA) requests",{"$f":"IFERROR(SUMIFS(D_D[INV],D_D[MT],11,D_D[CAT],TA_24,D_D[EP],$A38),0)","v":0}]
["930G","EP 930 - Review, including quality assurance",{"$f":"IFERROR(SUMIFS(D_D[INV],D_D[MT],11,D_D[CAT],TA_24,D_D[EP],$A39),0)","v":2}]
["960G","EP 960 - Correction of errors",{"$f":"IFERROR(SUMIFS(D_D[INV],D_D[MT],11,D_D[CAT],TA_24,D_D[EP],$A40),0)","v":0}]
["681","EP 681 - Used to control claims under the Nehmer Agent Orange stipulation",{"$f":"IFERROR(SUMIFS(D_D[INV],D_D[MT],11,D_D[CAT],TA_24,D_D[EP],$A41),0)","v":0}]
["687","EP 687 - Previously used for Nehmer Agent Orange presumptive issues",{"$f":"IFERROR(SUMIFS(D_D[INV],D_D[MT],11,D_D[CAT],TA_24,D_D[EP],$A42),0)","v":0}]
["405","EP 405 - Reopened or new Agent Orange claims between 9/01/10 and 10/24/2011",{"$f":"IFERROR(SUMIFS(D_D[INV],D_D[MT],11,D_D[CAT],TA_24,D_D[EP],$A43),0)","v":0}]
["409","EP 409 - Agent Orange claims where an interim decision was provided; No longer used as of 10/24/2011",{"$f":"IFERROR(SUMIFS(D_D[INV],D_D[MT],11,D_D[CAT],TA_24,D_D[EP],$A44),0)","v":0}]
[null,"Compensation Burial/Accrued",{"$f":"SUM(C46:C47)","v":0}]
["160G","EP 160 - Burials",{"$f":"IFERROR(SUMIFS(D_D[INV],D_D[MT],11,D_D[CAT],TA_25,D_D[EP],$A46),0)","v":0}]
["165","EP 165 - Accrued",{"$f":"IFERROR(SUMIFS(D_D[INV],D_D[MT],11,D_D[CAT],TA_25,D_D[EP],$A47),0)","v":0}]

{"sheet":"TA-Regional Office","index":12,"n_rows":80,"n_cols":19,"rows_kept":80,"cut":false,"hidden":false,"merged":[[1,1,3,1],[5,2,5,18],[72,2,72,18],[73,2,73,3],[73,4,73,6],[73,7,73,9],[73,10,73,12],[73,13,73,15],[3,2,3,3],[3,4,3,6],[3,7,3,9],[3,10,3,12],[3,13,3,15],[1,2,1,5],[1,6,1,9],[2,2,2,18]]}
[null,null,2000,2000,11,11,null,12,12,null,13,13,null,14,14,null,15,16,1]
[null,"Scroll down to see Pension",{"$f":"(\"Inventory by Regional Office - Data through \")","v":"Inventory by Regional Office - Data through "},null,null,null,{"$f":"D_DT[]","v":"2023-08-05"}]
[null,null,"*The claims pending under 'Non-Rating' are a subset of claims listed under the 'Award Adjustment' column and should not be counted twice when computing totals"]
[null,null,"Non-Rating",null,"Entitlement   ",null,null,"Award Adjustment ",null,null,"Program Review ",null,null,"Other",null,null,"Burial  ","Accrued  ","Legacy Appeals"]
[null,null,"Claims Pending","Avg. Days Pending","Claims Pending","Pending over 125 days","Percent Pending over 125 days","Claims Pending","Pending over 125 days","Percent Pending over 125 days","Claims Pending","Pending over 125 days","Percent Pending over 125 days","Claims Pending","Pending over 125 days","Percent Pending over 125 days","Claims Pending","Claims Pending","Appeals Pending"]
[null,null,"Compensation"]
[100,"USA Compensation",{"$f":"IFERROR(SUMIFS(D_D[INV],D_D[MT],1,D_D[CAT],TA_20,D_D[EP],-1, D_D[LOC],$A7),0)","v":195615},{"$f":"IFERROR(SUMIFS(D_D[ADP],D_D[MT],1,D_D[CAT],D$1,D_D[EP],-1, D_D[LOC],$A7),0)","v":69.72},{"$f":"IFERROR(SUMIFS(D_D[INV],D_D[MT],2,D_D[CAT],TA_21,D_D[EP],-1, D_D[LOC],$A7),0)","v":909189},{"$f":"IFERROR(SUMIFS(D_D[BL],D_D[MT],2,D_D[CAT],TA_21,D_D[EP],-1, D_D[LOC],$A7),0)","v":260503},{"$f":"IFERROR(F7/E7,\"0%\")","v":0.28652238423474108},{"$f":"IFERROR(SUMIFS(D_D[INV],D_D[MT],2,D_D[CAT],TA_22,D_D[EP],-1, D_D[LOC],$A7),0)","v":351364},{"$f":"IFERROR(SUMIFS(D_D[BL],D_D[MT],2,D_D[CAT],TA_22,D_D[EP],-1, D_D[LOC],$A7),0)","v":109242},{"$f":"IFERROR(I7/H7,\"0%\")","v":0.31090834576109105},{"$f":"IFERROR(SUMIFS(D_D[INV],D_D[MT],2,D_D[CAT],TA_23,D_D[EP],-1, D_D[LOC],$A7),0)","v":13378},{"$f":"IFERROR(SUMIFS(D_D[BL],D_D[MT],2,D_D[CAT],TA_23,D_D[EP],-1, D_D[LOC],$A7),0)","v":1800},{"$f":"IFERROR(L7/K7,\"0%\")","v":0.13454925997907011},{"$f":"IFERROR(SUMIFS(D_D[INV],D_D[MT],2,D_D[CAT],TA_24,D_D[EP],-1, D_D[LOC],$A7),0) - 'Diarys and Future Claims'!C35","v":103216},{"$f":"IFERROR(SUMIFS(D_D[BL],D_D[MT],2,D_D[CAT],TA_24,D_D[EP],-1, D_D[LOC],$A7),0)","v":39970},{"$f":"IFERROR(O7/N7,\"0%\")","v":0.38724616338552165},{"$f":"IFERROR(SUMIFS(D_D[INV],D_D[MT],2,D_D[CAT],TA_25,D_D[EP],-1, D_D[LOC],$A7),0)","v":12022},{"$f":"IFERROR(SUMIFS(D_D[INV],D_D[MT],2,D_D[CAT],TA_26,D_D[EP],-1, D_D[LOC],$A7),0)","v":1335},{"$f":"IFERROR(SUMIFS(D_D[INV],D_D[MT],7,D_D[CAT],2,D_D[EP],TA_20, D_D[LOC],$A7),0)","v":31617}]
[394,"Northeast",{"$f":"IFERROR(SUMIFS(D_D[INV],D_D[MT],1,D_D[CAT],TA_20,D_D[EP],-1, D_D[LOC],$A8),0)","v":43419},{"$f":"IFERROR(SUMIFS(D_D[ADP],D_D[MT],1,D_D[CAT],D$1,D_D[EP],-1, D_D[LOC],$A8),0)","v":67.69},{"$f":"IFERROR(SUMIFS(D_D[INV],D_D[MT],2,D_D[CAT],TA_21,D_D[EP],-1, D_D[LOC],$A8),0)","v":184373},{"$f":"IFERROR(SUMIFS(D_D[BL],D_D[MT],2,D_D[CAT],TA_21,D_D[EP],-1, D_D[LOC],$A8),0)","v":51279},{"$f":"IFERROR(F8/E8,\"0%\")","v":0.27812640679492118},{"$f":"IFERROR(SUMIFS(D_D[INV],D_D[MT],2,D_D[CAT],TA_22,D_D[EP],-1, D_D[LOC],$A8),0)","v":95044},{"$f":"IFERROR(SUMIFS(D_D[BL],D_D[MT],2,D_D[CAT],TA_22,D_D[EP],-1, D_D[LOC],$A8),0)","v":35899},{"$f":"IFERROR(I8/H8,\"0%\")","v":0.37770927149530742},{"$f":"IFERROR(SUMIFS(D_D[INV],D_D[MT],2,D_D[CAT],TA_23,D_D[EP],-1, D_D[LOC],$A8),0)","v":3934},{"$f":"IFERROR(SUMIFS(D_D[BL],D_D[MT],2,D_D[CAT],TA_23,D_D[EP],-1, D_D[LOC],$A8),0)","v":370},{"$f":"IFERROR(L8/K8,\"0%\")","v":9.4051855617691915E-2},{"$f":"IFERROR(SUMIFS(D_D[INV],D_D[MT],2,D_D[CAT],TA_24,D_D[EP],-1, D_D[LOC],$A8),0)","v":47078},{"$f":"IFERROR(SUMIFS(D_D[BL],D_D[MT],2,D_D[CAT],TA_24,D_D[EP],-1, D_D[LOC],$A8),0)","v":14983},{"$f":"IFERROR(O8/N8,\"0%\")","v":0.31825905943328092},{"$f":"IFERROR(SUMIFS(D_D[INV],D_D[MT],2,D_D[CAT],TA_25,D_D[EP],-1, D_D[LOC],$A8),0)","v":2988},{"$f":"IFERROR(SUMIFS(D_D[INV],D_D[MT],2,D_D[CAT],TA_26,D_D[EP],-1, D_D[LOC],$A8),0)","v":76},{"$f":"IFERROR(SUMIFS(D_D[INV],D_D[MT],7,D_D[CAT],2,D_D[EP],TA_20, D_D[LOC],$A8),0)","v":16}]
["313","Baltimore",{"$f":"IFERROR(SUMIFS(D_D[INV],D_D[MT],1,D_D[CAT],TA_20,D_D[EP],-1, D_D[LOC],$A9),0)","v":2875},{"$f":"IFERROR(SUMIFS(D_D[ADP],D_D[MT],1,D_D[CAT],D$1,D_D[EP],-1, D_D[LOC],$A9),0)","v":67.19},{"$f":"IFERROR(SUMIFS(D_D[INV],D_D[MT],2,D_D[CAT],TA_21,D_D[EP],-1, D_D[LOC],$A9),0)","v":14437},{"$f":"IFERROR(SUMIFS(D_D[BL],D_D[MT],2,D_D[CAT],TA_21,D_D[EP],-1, D_D[LOC],$A9),0)","v":3697},0.25607813257601997,{"$f":"IFERROR(SUMIFS(D_D[INV],D_D[MT],2,D_D[CAT],TA_22,D_D[EP],-1, D_D[LOC],$A9),0)","v":4018},{"$f":"IFERROR(SUMIFS(D_D[BL],D_D[MT],2,D_D[CAT],TA_22,D_D[EP],-1, D_D[LOC],$A9),0)","v":1076},0.26779492284718764,{"$f":"IFERROR(SUMIFS(D_D[INV],D_D[MT],2,D_D[CAT],TA_23,D_D[EP],-1, D_D[LOC],$A9),0)","v":233},{"$f":"IFERROR(SUMIFS(D_D[BL],D_D[MT],2,D_D[CAT],TA_23,D_D[EP],-1, D_D[LOC],$A9),0)","v":43},0.18454935622317598,{"$f":"IFERROR(SUMIFS(D_D[INV],D_D[MT],2,D_D[CAT],TA_24,D_D[EP],-1, D_D[LOC],$A9),0)","v":722},{"$f":"IFERROR(SUMIFS(D_D[BL],D_D[MT],2,D_D[CAT],TA_24,D_D[EP],-1, D_D[LOC],$A9),0)","v":269},0.37257617728531855,{"$f":"IFERROR(SUMIFS(D_D[INV],D_D[MT],2,D_D[CAT],TA_25,D_D[EP],-1, D_D[LOC],$A9),0)","v":71},{"$f":"IFERROR(SUMIFS(D_D[INV],D_D[MT],2,D_D[CAT],TA_26,D_D[EP],-1, D_D[LOC],$A9),0)","v":1},{"$f":"IFERROR(SUMIFS(D_D[INV],D_D[MT],7,D_D[CAT],2,D_D[EP],TA_20, D_D[LOC],$A9),0)","v":2}]
["301","Boston",{"$f":"IFERROR(SUMIFS(D_D[INV],D_D[MT],1,D_D[CAT],TA_20,D_D[EP],-1, D_D[LOC],$A10),0)","v":1116},{"$f":"IFERROR(SUMIFS(D_D[ADP],D_D[MT],1,D_D[CAT],D$1,D_D[EP],-1, D_D[LOC],$A10),0)","v":64.349999999999994},{"$f":"IFERROR(SUMIFS(D_D[INV],D_D[MT],2,D_D[CAT],TA_21,D_D[EP],-1, D_D[LOC],$A10),0)","v":5892},{"$f":"IFERROR(SUMIFS(D_D[BL],D_D[MT],2,D_D[CAT],TA_21,D_D[EP],-1, D_D[LOC],$A10),0)","v":1670},{"$f":"IFERROR(F10/E10,\"0%\")","v":0.28343516632722338},{"$f":"IFERROR(SUMIFS(D_D[INV],D_D[MT],2,D_D[CAT],TA_22,D_D[EP],-1, D_D[LOC],$A10),0)","v":1860},{"$f":"IFERROR(SUMIFS(D_D[BL],D_D[MT],2,D_D[CAT],TA_22,D_D[EP],-1, D_D[LOC],$A10),0)","v":536},{"$f":"IFERROR(I10/H10,\"0%\")","v":0.28817204301075267},{"$f":"IFERROR(SUMIFS(D_D[INV],D_D[MT],2,D_D[CAT],TA_23,D_D[EP],-1, D_D[LOC],$A10),0)","v":176},{"$f":"IFERROR(SUMIFS(D_D[BL],D_D[MT],2,D_D[CAT],TA_23,D_D[EP],-1, D_D[LOC],$A10),0)","v":6},{"$f":"IFERROR(L10/K10,\"0%\")","v":3.4090909090909088E-2},{"$f":"IFERROR(SUMIFS(D_D[INV],D_D[MT],2,D_D[CAT],TA_24,D_D[EP],-1, D_D[LOC],$A10),0)","v":259},{"$f":"IFERROR(SUMIFS(D_D[BL],D_D[MT],2,D_D[CAT],TA_24,D_D[EP],-1, D_D[LOC],$A10),0)","v":129},{"$f":"IFERROR(O10/N10,\"0%\")","v":0.49806949806949807},{"$f":"IFERROR(SUMIFS(D_D[INV],D_D[MT],2,D_D[CAT],TA_25,D_D[EP],-1, D_D[LOC],$A10),0)","v":70},{"$f":"IFERROR(SUMIFS(D_D[INV],D_D[MT],2,D_D[CAT],TA_26,D_D[EP],-1, D_D[LOC],$A10),0)","v":3},{"$f":"IFERROR(SUMIFS(D_D[INV],D_D[MT],7,D_D[CAT],2,D_D[EP],TA_20, D_D[LOC],$A10),0)","v":0}]
["307","Buffalo",{"$f":"IFERROR(SUMIFS(D_D[INV],D_D[MT],1,D_D[CAT],TA_20,D_D[EP],-1, D_D[LOC],$A11),0)","v":1607},{"$f":"IFERROR(SUMIFS(D_D[ADP],D_D[MT],1,D_D[CAT],D$1,D_D[EP],-1, D_D[LOC],$A11),0)","v":62.99},{"$f":"IFERROR(SUMIFS(D_D[INV],D_D[MT],2,D_D[CAT],TA_21,D_D[EP],-1, D_D[LOC],$A11),0)","v":7800},{"$f":"IFERROR(SUMIFS(D_D[BL],D_D[MT],2,D_D[CAT],TA_21,D_D[EP],-1, D_D[LOC],$A11),0)","v":2158},0.27666666666666667,{"$f":"IFERROR(SUMIFS(D_D[INV],D_D[MT],2,D_D[CAT],TA_22,D_D[EP],-1, D_D[LOC],$A11),0)","v":2440},{"$f":"IFERROR(SUMIFS(D_D[BL],D_D[MT],2,D_D[CAT],TA_22,D_D[EP],-1, D_D[LOC],$A11),0)","v":553},0.22663934426229509,{"$f":"IFERROR(SUMIFS(D_D[INV],D_D[MT],2,D_D[CAT],TA_23,D_D[EP],-1, D_D[LOC],$A11),0)","v":199},{"$f":"IFERROR(SUMIFS(D_D[BL],D_D[MT],2,D_D[CAT],TA_23,D_D[EP],-1, D_D[LOC],$A11),0)","v":14},7.0351758793969849E-2,{"$f":"IFERROR(SUMIFS(D_D[INV],D_D[MT],2,D_D[CAT],TA_24,D_D[EP],-1, D_D[LOC],$A11),0)","v":315},{"$f":"IFERROR(SUMIFS(D_D[BL],D_D[MT],2,D_D[CAT],TA_24,D_D[EP],-1, D_D[LOC],$A11),0)","v":167},0.53015873015873016,{"$f":"IFERROR(SUMIFS(D_D[INV],D_D[MT],2,D_D[CAT],TA_25,D_D[EP],-1, D_D[LOC],$A11),0)","v":90},{"$f":"IFERROR(SUMIFS(D_D[INV],D_D[MT],2,D_D[CAT],TA_26,D_D[EP],-1, D_D[LOC],$A11),0)","v":0},{"$f":"IFERROR(SUMIFS(D_D[INV],D_D[MT],7,D_D[CAT],2,D_D[EP],TA_20, D_D[LOC],$A11),0)","v":2}]
["328","Chicago",{"$f":"IFERROR(SUMIFS(D_D[INV],D_D[MT],1,D_D[CAT],TA_20,D_D[EP],-1, D_D[LOC],$A12),0)","v":2883},{"$f":"IFERROR(SUMIFS(D_D[ADP],D_D[MT],1,D_D[CAT],D$1,D_D[EP],-1, D_D[LOC],$A12),0)","v":67.39},{"$f":"IFERROR(SUMIFS(D_D[INV],D_D[MT],2,D_D[CAT],TA_21,D_D[EP],-1, D_D[LOC],$A12),0)","v":17296},{"$f":"IFERROR(SUMIFS(D_D[BL],D_D[MT],2,D_D[CAT],TA_21,D_D[EP],-1, D_D[LOC],$A12),0)","v":4881},0.28220397779833489,{"$f":"IFERROR(SUMIFS(D_D[INV],D_D[MT],2,D_D[CAT],TA_22,D_D[EP],-1, D_D[LOC],$A12),0)","v":4145},{"$f":"IFERROR(SUMIFS(D_D[BL],D_D[MT],2,D_D[CAT],TA_22,D_D[EP],-1, D_D[LOC],$A12),0)","v":993},0.23956574185765983,{"$f":"IFERROR(SUMIFS(D_D[INV],D_D[MT],2,D_D[CAT],TA_23,D_D[EP],-1, D_D[LOC],$A12),0)","v":407},{"$f":"IFERROR(SUMIFS(D_D[BL],D_D[MT],2,D_D[CAT],TA_23,D_D[EP],-1, D_D[LOC],$A12),0)","v":40},9.8280098280098274E-2,{"$f":"IFERROR(SUMIFS(D_D[INV],D_D[MT],2,D_D[CAT],TA_24,D_D[EP],-1, D_D[LOC],$A12),0)","v":785},{"$f":"IFERROR(SUMIFS(D_D[BL],D_D[MT],2,D_D[CAT],TA_24,D_D[EP],-1, D_D[LOC],$A12),0)","v":372},0.47388535031847134,{"$f":"IFERROR(SUMIFS(D_D[INV],D_D[MT],2,D_D[CAT],TA_25,D_D[EP],-1, D_D[LOC],$A12),0)","v":167},{"$f":"IFERROR(SUMIFS(D_D[INV],D_D[MT],2,D_D[CAT],TA_26,D_D[EP],-1, D_D[LOC],$A12),0)","v":2},{"$f":"IFERROR(SUMIFS(D_D[INV],D_D[MT],7,D_D[CAT],2,D_D[EP],TA_20, D_D[LOC],$A12),0)","v":1}]
["325","Cleveland",{"$f":"IFERROR(SUMIFS(D_D[INV],D_D[MT],1,D_D[CAT],TA_20,D_D[EP],-1, D_D[LOC],$A13),0)","v":4256},{"$f":"IFERROR(SUMIFS(D_D[ADP],D_D[MT],1,D_D[CAT],D$1,D_D[EP],-1, D_D[LOC],$A13),0)","v":70.83},{"$f":"IFERROR(SUMIFS(D_D[INV],D_D[MT],2,D_D[CAT],TA_21,D_D[EP],-1, D_D[LOC],$A13),0)","v":20539},{"$f":"IFERROR(SUMIFS(D_D[BL],D_D[MT],2,D_D[CAT],TA_21,D_D[EP],-1, D_D[LOC],$A13),0)","v":5631},0.27416135157505234,{"$f":"IFERROR(SUMIFS(D_D[INV],D_D[MT],2,D_D[CAT],TA_22,D_D[EP],-1, D_D[LOC],$A13),0)","v":6139},{"$f":"IFERROR(SUMIFS(D_D[BL],D_D[MT],2,D_D[CAT],TA_22,D_D[EP],-1, D_D[LOC],$A13),0)","v":1413},0.23016777976869196,{"$f":"IFERROR(SUMIFS(D_D[INV],D_D[MT],2,D_D[CAT],TA_23,D_D[EP],-1, D_D[LOC],$A13),0)","v":355},{"$f":"IFERROR(SUMIFS(D_D[BL],D_D[MT],2,D_D[CAT],TA_23,D_D[EP],-1, D_D[LOC],$A13),0)","v":39},0.10985915492957747,{"$f":"IFERROR(SUMIFS(D_D[INV],D_D[MT],2,D_D[CAT],TA_24,D_D[EP],-1, D_D[LOC],$A13),0)","v":1123},{"$f":"IFERROR(SUMIFS(D_D[BL],D_D[MT],2,D_D[CAT],TA_24,D_D[EP],-1, D_D[LOC],$A13),0)","v":668},0.59483526268922526,{"$f":"IFERROR(SUMIFS(D_D[INV],D_D[MT],2,D_D[CAT],TA_25,D_D[EP],-1, D_D[LOC],$A13),0)","v":195},{"$f":"IFERROR(SUMIFS(D_D[INV],D_D[MT],2,D_D[CAT],TA_26,D_D[EP],-1, D_D[LOC],$A13),0)","v":9},{"$f":"IFERROR(SUMIFS(D_D[INV],D_D[MT],7,D_D[CAT],2,D_D[EP],TA_20, D_D[LOC],$A13),0)","v":2}]
["329","Detroit",{"$f":"IFERROR(SUMIFS(D_D[INV],D_D[MT],1,D_D[CAT],TA_20,D_D[EP],-1, D_D[LOC],$A14),0)","v":4135},{"$f":"IFERROR(SUMIFS(D_D[ADP],D_D[MT],1,D_D[CAT],D$1,D_D[EP],-1, D_D[LOC],$A14),0)","v":67.98},{"$f":"IFERROR(SUMIFS(D_D[INV],D_D[MT],2,D_D[CAT],TA_21,D_D[EP],-1, D_D[LOC],$A14),0)","v":14740},{"$f":"IFERROR(SUMIFS(D_D[BL],D_D[MT],2,D_D[CAT],TA_21,D_D[EP],-1, D_D[LOC],$A14),0)","v":3896},0.26431478968792399,{"$f":"IFERROR(SUMIFS(D_D[INV],D_D[MT],2,D_D[CAT],TA_22,D_D[EP],-1, D_D[LOC],$A14),0)","v":13289},{"$f":"IFERROR(SUMIFS(D_D[BL],D_D[MT],2,D_D[CAT],TA_22,D_D[EP],-1, D_D[LOC],$A14),0)","v":4132},0.31093385506810145,{"$f":"IFERROR(SUMIFS(D_D[INV],D_D[MT],2,D_D[CAT],TA_23,D_D[EP],-1, D_D[LOC],$A14),0)","v":236},{"$f":"IFERROR(SUMIFS(D_D[BL],D_D[MT],2,D_D[CAT],TA_23,D_D[EP],-1, D_D[LOC],$A14),0)","v":30},0.1271186440677966,{"$f":"IFERROR(SUMIFS(D_D[INV],D_D[MT],2,D_D[CAT],TA_24,D_D[EP],-1, D_D[LOC],$A14),0)","v":963},{"$f":"IFERROR(SUMIFS(D_D[BL],D_D[MT],2,D_D[CAT],TA_24,D_D[EP],-1, D_D[LOC],$A14),0)","v":462},0.47975077881619937,{"$f":"IFERROR(SUMIFS(D_D[INV],D_D[MT],2,D_D[CAT],TA_25,D_D[EP],-1, D_D[LOC],$A14),0)","v":234},{"$f":"IFERROR(SUMIFS(D_D[INV],D_D[MT],2,D_D[CAT],TA_26,D_D[EP],-1, D_D[LOC],$A14),0)","v":7},{"$f":"IFERROR(SUMIFS(D_D[INV],D_D[MT],7,D_D[CAT],2,D_D[EP],TA_20, D_D[LOC],$A14),0)","v":1}]
["308","Hartford",{"$f":"IFERROR(SUMIFS(D_D[INV],D_D[MT],1,D_D[CAT],TA_20,D_D[EP],-1, D_D[LOC],$A15),0)","v":684},{"$f":"IFERROR(SUMIFS(D_D[ADP],D_D[MT],1,D_D[CAT],D$1,D_D[EP],-1, D_D[LOC],$A15),0)","v":62.55},{"$f":"IFERROR(SUMIFS(D_D[INV],D_D[MT],2,D_D[CAT],TA_21,D_D[EP],-1, D_D[LOC],$A15),0)","v":3990},{"$f":"IFERROR(SUMIFS(D_D[BL],D_D[MT],2,D_D[CAT],TA_21,D_D[EP],-1, D_D[LOC],$A15),0)","v":1125},0.28195488721804512,{"$f":"IFERROR(SUMIFS(D_D[INV],D_D[MT],2,D_D[CAT],TA_22,D_D[EP],-1, D_D[LOC],$A15),0)","v":1216},{"$f":"IFERROR(SUMIFS(D_D[BL],D_D[MT],2,D_D[CAT],TA_22,D_D[EP],-1, D_D[LOC],$A15),0)","v":357},0.29358552631578949,{"$f":"IFERROR(SUMIFS(D_D[INV],D_D[MT],2,D_D[CAT],TA_23,D_D[EP],-1, D_D[LOC],$A15),0)","v":110},{"$f":"IFERROR(SUMIFS(D_D[BL],D_D[MT],2,D_D[CAT],TA_23,D_D[EP],-1, D_D[LOC],$A15),0)","v":12},0.10909090909090909,{"$f":"IFERROR(SUMIFS(D_D[INV],D_D[MT],2,D_D[CAT],TA_24,D_D[EP],-1, D_D[LOC],$A15),0)","v":381},{"$f":"IFERROR(SUMIFS(D_D[BL],D_D[MT],2,D_D[CAT],TA_24,D_D[EP],-1, D_D[LOC],$A15),0)","v":164},0.43044619422572178,{"$f":"IFERROR(SUMIFS(D_D[INV],D_D[MT],2,D_D[CAT],TA_25,D_D[EP],-1, D_D[LOC],$A15),0)","v":42},{"$f":"IFERROR(SUMIFS(D_D[INV],D_D[MT],2,D_D[CAT],TA_26,D_D[EP],-1, D_D[LOC],$A15),0)","v":3},{"$f":"IFERROR(SUMIFS(D_D[INV],D_D[MT],7,D_D[CAT],2,D_D[EP],TA_20, D_D[LOC],$A15),0)","v":0}]
["326","Indianapolis",{"$f":"IFERROR(SUMIFS(D_D[INV],D_D[MT],1,D_D[CAT],TA_20,D_D[EP],-1, D_D[LOC],$A16),0)","v":4941},{"$f":"IFERROR(SUMIFS(D_D[ADP],D_D[MT],1,D_D[CAT],D$1,D_D[EP],-1, D_D[LOC],$A16),0)","v":65.91},{"$f":"IFERROR(SUMIFS(D_D[INV],D_D[MT],2,D_D[CAT],TA_21,D_D[EP],-1, D_D[LOC],$A16),0)","v":13011},{"$f":"IFERROR(SUMIFS(D_D[BL],D_D[MT],2,D_D[CAT],TA_21,D_D[EP],-1, D_D[LOC],$A16),0)","v":3500},0.26900315117977097,{"$f":"IFERROR(SUMIFS(D_D[INV],D_D[MT],2,D_D[CAT],TA_22,D_D[EP],-1, D_D[LOC],$A16),0)","v":6076},{"$f":"IFERROR(SUMIFS(D_D[BL],D_D[MT],2,D_D[CAT],TA_22,D_D[EP],-1, D_D[LOC],$A16),0)","v":1221},0.2009545753785385,{"$f":"IFERROR(SUMIFS(D_D[INV],D_D[MT],2,D_D[CAT],TA_23,D_D[EP],-1, D_D[LOC],$A16),0)","v":221},{"$f":"IFERROR(SUMIFS(D_D[BL],D_D[MT],2,D_D[CAT],TA_23,D_D[EP],-1, D_D[LOC],$A16),0)","v":14},6.3348416289592757E-2,{"$f":"IFERROR(SUMIFS(D_D[INV],D_D[MT],2,D_D[CAT],TA_24,D_D[EP],-1, D_D[LOC],$A16),0)","v":731},{"$f":"IFERROR(SUMIFS(D_D[BL],D_D[MT],2,D_D[CAT],TA_24,D_D[EP],-1, D_D[LOC],$A16),0)","v":249},0.34062927496580025,{"$f":"IFERROR(SUMIFS(D_D[INV],D_D[MT],2,D_D[CAT],TA_25,D_D[EP],-1, D_D[LOC],$A16),0)","v":126},{"$f":"IFERROR(SUMIFS(D_D[INV],D_D[MT],2,D_D[CAT],TA_26,D_D[EP],-1, D_D[LOC],$A16),0)","v":4},{"$f":"IFERROR(SUMIFS(D_D[INV],D_D[MT],7,D_D[CAT],2,D_D[EP],TA_20, D_D[LOC],$A16),0)","v":0}]
["373","Manchester",{"$f":"IFERROR(SUMIFS(D_D[INV],D_D[MT],1,D_D[CAT],TA_20,D_D[EP],-1, D_D[LOC],$A17),0)","v":443},{"$f":"IFERROR(SUMIFS(D_D[ADP],D_D[MT],1,D_D[CAT],D$1,D_D[EP],-1, D_D[LOC],$A17),0)","v":67.47},{"$f":"IFERROR(SUMIFS(D_D[INV],D_D[MT],2,D_D[CAT],TA_21,D_D[EP],-1, D_D[LOC],$A17),0)","v":2247},{"$f":"IFERROR(SUMIFS(D_D[BL],D_D[MT],2,D_D[CAT],TA_21,D_D[EP],-1, D_D[LOC],$A17),0)","v":611},0.27191811303960839,{"$f":"IFERROR(SUMIFS(D_D[INV],D_D[MT],2,D_D[CAT],TA_22,D_D[EP],-1, D_D[LOC],$A17),0)","v":717},{"$f":"IFERROR(SUMIFS(D_D[BL],D_D[MT],2,D_D[CAT],TA_22,D_D[EP],-1, D_D[LOC],$A17),0)","v":200},0.2789400278940028,{"$f":"IFERROR(SUMIFS(D_D[INV],D_D[MT],2,D_D[CAT],TA_23,D_D[EP],-1, D_D[LOC],$A17),0)","v":33},{"$f":"IFERROR(SUMIFS(D_D[BL],D_D[MT],2,D_D[CAT],TA_23,D_D[EP],-1, D_D[LOC],$A17),0)","v":4},0.12121212121212122,{"$f":"IFERROR(SUMIFS(D_D[INV],D_D[MT],2,D_D[CAT],TA_24,D_D[EP],-1, D_D[LOC],$A17),0)","v":87},{"$f":"IFERROR(SUMIFS(D_D[BL],D_D[MT],2,D_D[CAT],TA_24,D_D[EP],-1, D_D[LOC],$A17),0)","v":51},0.58620689655172409,{"$f":"IFERROR(SUMIFS(D_D[INV],D_D[MT],2,D_D[CAT],TA_25,D_D[EP],-1, D_D[LOC],$A17),0)","v":18},{"$f":"IFERROR(SUMIFS(D_D[INV],D_D[MT],2,D_D[CAT],TA_26,D_D[EP],-1, D_D[LOC],$A17),0)","v":3},{"$f":"IFERROR(SUMIFS(D_D[INV],D_D[MT],7,D_D[CAT],2,D_D[EP],TA_20, D_D[LOC],$A17),0)","v":1}]
["330","Milwaukee",{"$f":"IFERROR(SUMIFS(D_D[INV],D_D[MT],1,D_D[CAT],TA_20,D_D[EP],-1, D_D[LOC],$A18),0)","v":6015},{"$f":"IFERROR(SUMIFS(D_D[ADP],D_D[MT],1,D_D[CAT],D$1,D_D[EP],-1, D_D[LOC],$A18),0)","v":68.05},{"$f":"IFERROR(SUMIFS(D_D[INV],D_D[MT],2,D_D[CAT],TA_21,D_D[EP],-1, D_D[LOC],$A18),0)","v":12827},{"$f":"IFERROR(SUMIFS(D_D[BL],D_D[MT],2,D_D[CAT],TA_21,D_D[EP],-1, D_D[LOC],$A18),0)","v":3741},0.2916504248850082,{"$f":"IFERROR(SUMIFS(D_D[INV],D_D[MT],2,D_D[CAT],TA_22,D_D[EP],-1, D_D[LOC],$A18),0)","v":29491},{"$f":"IFERROR(SUMIFS(D_D[BL],D_D[MT],2,D_D[CAT],TA_22,D_D[EP],-1, D_D[LOC],$A18),0)","v":16282},0.55210064087348687,{"$f":"IFERROR(SUMIFS(D_D[INV],D_D[MT],2,D_D[CAT],TA_23,D_D[EP],-1, D_D[LOC],$A18),0)","v":469},{"$f":"IFERROR(SUMIFS(D_D[BL],D_D[MT],2,D_D[CAT],TA_23,D_D[EP],-1, D_D[LOC],$A18),0)","v":27},5.7569296375266525E-2,{"$f":"IFERROR(SUMIFS(D_D[INV],D_D[MT],2,D_D[CAT],TA_24,D_D[EP],-1, D_D[LOC],$A18),0)","v":937},{"$f":"IFERROR(SUMIFS(D_D[BL],D_D[MT],2,D_D[CAT],TA_24,D_D[EP],-1, D_D[LOC],$A18),0)","v":552},0.58911419423692635,{"$f":"IFERROR(SUMIFS(D_D[INV],D_D[MT],2,D_D[CAT],TA_25,D_D[EP],-1, D_D[LOC],$A18),0)","v":612},{"$f":"IFERROR(SUMIFS(D_D[INV],D_D[MT],2,D_D[CAT],TA_26,D_D[EP],-1, D_D[LOC],$A18),0)","v":0},{"$f":"IFERROR(SUMIFS(D_D[INV],D_D[MT],7,D_D[CAT],2,D_D[EP],TA_20, D_D[LOC],$A18),0)","v":1}]
["306","New York",{"$f":"IFERROR(SUMIFS(D_D[INV],D_D[MT],1,D_D[CAT],TA_20,D_D[EP],-1, D_D[LOC],$A19),0)","v":1835},{"$f":"IFERROR(SUMIFS(D_D[ADP],D_D[MT],1,D_D[CAT],D$1,D_D[EP],-1, D_D[LOC],$A19),0)","v":65.44},{"$f":"IFERROR(SUMIFS(D_D[INV],D_D[MT],2,D_D[CAT],TA_21,D_D[EP],-1, D_D[LOC],$A19),0)","v":10611},{"$f":"IFERROR(SUMIFS(D_D[BL],D_D[MT],2,D_D[CAT],TA_21,D_D[EP],-1, D_D[LOC],$A19),0)","v":3056},0.28800301573838472,{"$f":"IFERROR(SUMIFS(D_D[INV],D_D[MT],2,D_D[CAT],TA_22,D_D[EP],-1, D_D[LOC],$A19),0)","v":3001},{"$f":"IFERROR(SUMIFS(D_D[BL],D_D[MT],2,D_D[CAT],TA_22,D_D[EP],-1, D_D[LOC],$A19),0)","v":869},0.28957014328557146,{"$f":"IFERROR(SUMIFS(D_D[INV],D_D[MT],2,D_D[CAT],TA_23,D_D[EP],-1, D_D[LOC],$A19),0)","v":277},{"$f":"IFERROR(SUMIFS(D_D[BL],D_D[MT],2,D_D[CAT],TA_23,D_D[EP],-1, D_D[LOC],$A19),0)","v":20},7.2202166064981949E-2,{"$f":"IFERROR(SUMIFS(D_D[INV],D_D[MT],2,D_D[CAT],TA_24,D_D[EP],-1, D_D[LOC],$A19),0)","v":350},{"$f":"IFERROR(SUMIFS(D_D[BL],D_D[MT],2,D_D[CAT],TA_24,D_D[EP],-1, D_D[LOC],$A19),0)","v":168},0.48,{"$f":"IFERROR(SUMIFS(D_D[INV],D_D[MT],2,D_D[CAT],TA_25,D_D[EP],-1, D_D[LOC],$A19),0)","v":109},{"$f":"IFERROR(SUMIFS(D_D[INV],D_D[MT],2,D_D[CAT],TA_26,D_D[EP],-1, D_D[LOC],$A19),0)","v":5},{"$f":"IFERROR(SUMIFS(D_D[INV],D_D[MT],7,D_D[CAT],2,D_D[EP],TA_20, D_D[LOC],$A19),0)","v":0}]
["309","Newark",{"$f":"IFERROR(SUMIFS(D_D[INV],D_D[MT],1,D_D[CAT],TA_20,D_D[EP],-1, D_D[LOC],$A20),0)","v":1057},{"$f":"IFERROR(SUMIFS(D_D[ADP],D_D[MT],1,D_D[CAT],D$1,D_D[EP],-1, D_D[LOC],$A20),0)","v":69.83},{"$f":"IFERROR(SUMIFS(D_D[INV],D_D[MT],2,D_D[CAT],TA_21,D_D[EP],-1, D_D[LOC],$A20),0)","v":6476},{"$f":"IFERROR(SUMIFS(D_D[BL],D_D[MT],2,D_D[CAT],TA_21,D_D[EP],-1, D_D[LOC],$A20),0)","v":1756},0.27115503397158741,{"$f":"IFERROR(SUMIFS(D_D[INV],D_D[MT],2,D_D[CAT],TA_22,D_D[EP],-1, D_D[LOC],$A20),0)","v":1767},{"$f":"IFERROR(SUMIFS(D_D[BL],D_D[MT],2,D_D[CAT],TA_22,D_D[EP],-1, D_D[LOC],$A20),0)","v":503},0.28466327108092815,{"$f":"IFERROR(SUMIFS(D_D[INV],D_D[MT],2,D_D[CAT],TA_23,D_D[EP],-1, D_D[LOC],$A20),0)","v":91},{"$f":"IFERROR(SUMIFS(D_D[BL],D_D[MT],2,D_D[CAT],TA_23,D_D[EP],-1, D_D[LOC],$A20),0)","v":9},9.8901098901098897E-2,{"$f":"IFERROR(SUMIFS(D_D[INV],D_D[MT],2,D_D[CAT],TA_24,D_D[EP],-1, D_D[LOC],$A20),0)","v":325},{"$f":"IFERROR(SUMIFS(D_D[BL],D_D[MT],2,D_D[CAT],TA_24,D_D[EP],-1, D_D[LOC],$A20),0)","v":128},0.39384615384615385,{"$f":"IFERROR(SUMIFS(D_D[INV],D_D[MT],2,D_D[CAT],TA_25,D_D[EP],-1, D_D[LOC],$A20),0)","v":49},{"$f":"IFERROR(SUMIFS(D_D[INV],D_D[MT],2,D_D[CAT],TA_26,D_D[EP],-1, D_D[LOC],$A20),0)","v":3},{"$f":"IFERROR(SUMIFS(D_D[INV],D_D[MT],7,D_D[CAT],2,D_D[EP],TA_20, D_D[LOC],$A20),0)","v":2}]
["310","Philadelphia",{"$f":"IFERROR(SUMIFS(D_D[INV],D_D[MT],1,D_D[CAT],TA_20,D_D[EP],-1, D_D[LOC],$A21),0)","v":4329},{"$f":"IFERROR(SUMIFS(D_D[ADP],D_D[MT],1,D_D[CAT],D$1,D_D[EP],-1, D_D[LOC],$A21),0)","v":67.14},{"$f":"IFERROR(SUMIFS(D_D[INV],D_D[MT],2,D_D[CAT],TA_21,D_D[EP],-1, D_D[LOC],$A21),0)","v":17272},{"$f":"IFERROR(SUMIFS(D_D[BL],D_D[MT],2,D_D[CAT],TA_21,D_D[EP],-1, D_D[LOC],$A21),0)","v":5055},0.29267021769337659,{"$f":"IFERROR(SUMIFS(D_D[INV],D_D[MT],2,D_D[CAT],TA_22,D_D[EP],-1, D_D[LOC],$A21),0)","v":9637},{"$f":"IFERROR(SUMIFS(D_D[BL],D_D[MT],2,D_D[CAT],TA_22,D_D[EP],-1, D_D[LOC],$A21),0)","v":4778},0.49579744733838332,{"$f":"IFERROR(SUMIFS(D_D[INV],D_D[MT],2,D_D[CAT],TA_23,D_D[EP],-1, D_D[LOC],$A21),0)","v":395},{"$f":"IFERROR(SUMIFS(D_D[BL],D_D[MT],2,D_D[CAT],TA_23,D_D[EP],-1, D_D[LOC],$A21),0)","v":37},9.3670886075949367E-2,{"$f":"IFERROR(SUMIFS(D_D[INV],D_D[MT],2,D_D[CAT],TA_24,D_D[EP],-1, D_D[LOC],$A21),0)","v":1082},{"$f":"IFERROR(SUMIFS(D_D[BL],D_D[MT],2,D_D[CAT],TA_24,D_D[EP],-1, D_D[LOC],$A21),0)","v":662},0.61182994454713491,{"$f":"IFERROR(SUMIFS(D_D[INV],D_D[MT],2,D_D[CAT],TA_25,D_D[EP],-1, D_D[LOC],$A21),0)","v":823},{"$f":"IFERROR(SUMIFS(D_D[INV],D_D[MT],2,D_D[CAT],TA_26,D_D[EP],-1, D_D[LOC],$A21),0)","v":0},{"$f":"IFERROR(SUMIFS(D_D[INV],D_D[MT],7,D_D[CAT],2,D_D[EP],TA_20, D_D[LOC],$A21),0)","v":3}]
["311","Pittsburgh",{"$f":"IFERROR(SUMIFS(D_D[INV],D_D[MT],1,D_D[CAT],TA_20,D_D[EP],-1, D_D[LOC],$A22),0)","v":1996},{"$f":"IFERROR(SUMIFS(D_D[ADP],D_D[MT],1,D_D[CAT],D$1,D_D[EP],-1, D_D[LOC],$A22),0)","v":62.68},{"$f":"IFERROR(SUMIFS(D_D[INV],D_D[MT],2,D_D[CAT],TA_21,D_D[EP],-1, D_D[LOC],$A22),0)","v":12923},{"$f":"IFERROR(SUMIFS(D_D[BL],D_D[MT],2,D_D[CAT],TA_21,D_D[EP],-1, D_D[LOC],$A22),0)","v":4070},0.31494235084732647,{"$f":"IFERROR(SUMIFS(D_D[INV],D_D[MT],2,D_D[CAT],TA_22,D_D[EP],-1, D_D[LOC],$A22),0)","v":3443},{"$f":"IFERROR(SUMIFS(D_D[BL],D_D[MT],2,D_D[CAT],TA_22,D_D[EP],-1, D_D[LOC],$A22),0)","v":1009},0.29305837932036016,{"$f":"IFERROR(SUMIFS(D_D[INV],D_D[MT],2,D_D[CAT],TA_23,D_D[EP],-1, D_D[LOC],$A22),0)","v":181},{"$f":"IFERROR(SUMIFS(D_D[BL],D_D[MT],2,D_D[CAT],TA_23,D_D[EP],-1, D_D[LOC],$A22),0)","v":22},0.12154696132596685,{"$f":"IFERROR(SUMIFS(D_D[INV],D_D[MT],2,D_D[CAT],TA_24,D_D[EP],-1, D_D[LOC],$A22),0)","v":793},{"$f":"IFERROR(SUMIFS(D_D[BL],D_D[MT],2,D_D[CAT],TA_24,D_D[EP],-1, D_D[LOC],$A22),0)","v":312},0.39344262295081966,{"$f":"IFERROR(SUMIFS(D_D[INV],D_D[MT],2,D_D[CAT],TA_25,D_D[EP],-1, D_D[LOC],$A22),0)","v":98},{"$f":"IFERROR(SUMIFS(D_D[INV],D_D[MT],2,D_D[CAT],TA_26,D_D[EP],-1, D_D[LOC],$A22),0)","v":1},{"$f":"IFERROR(SUMIFS(D_D[INV],D_D[MT],7,D_D[CAT],2,D_D[EP],TA_20, D_D[LOC],$A22),0)","v":0}]
["304","Providence",{"$f":"IFERROR(SUMIFS(D_D[INV],D_D[MT],1,D_D[CAT],TA_20,D_D[EP],-1, D_D[LOC],$A23),0)","v":653},{"$f":"IFERROR(SUMIFS(D_D[ADP],D_D[MT],1,D_D[CAT],D$1,D_D[EP],-1, D_D[LOC],$A23),0)","v":66.16},{"$f":"IFERROR(SUMIFS(D_D[INV],D_D[MT],2,D_D[CAT],TA_21,D_D[EP],-1, D_D[LOC],$A23),0)","v":3579},{"$f":"IFERROR(SUMIFS(D_D[BL],D_D[MT],2,D_D[CAT],TA_21,D_D[EP],-1, D_D[LOC],$A23),0)","v":892},0.24923162894663314,{"$f":"IFERROR(SUMIFS(D_D[INV],D_D[MT],2,D_D[CAT],TA_22,D_D[EP],-1, D_D[LOC],$A23),0)","v":1114},{"$f":"IFERROR(SUMIFS(D_D[BL],D_D[MT],2,D_D[CAT],TA_22,D_D[EP],-1, D_D[LOC],$A23),0)","v":347},0.31149012567324957,{"$f":"IFERROR(SUMIFS(D_D[INV],D_D[MT],2,D_D[CAT],TA_23,D_D[EP],-1, D_D[LOC],$A23),0)","v":71},{"$f":"IFERROR(SUMIFS(D_D[BL],D_D[MT],2,D_D[CAT],TA_23,D_D[EP],-1, D_D[LOC],$A23),0)","v":5},7.0422535211267609E-2,{"$f":"IFERROR(SUMIFS(D_D[INV],D_D[MT],2,D_D[CAT],TA_24,D_D[EP],-1, D_D[LOC],$A23),0)","v":155},{"$f":"IFERROR(SUMIFS(D_D[BL],D_D[MT],2,D_D[CAT],TA_24,D_D[EP],-1, D_D[LOC],$A23),0)","v":81},0.52258064516129032,{"$f":"IFERROR(SUMIFS(D_D[INV],D_D[MT],2,D_D[CAT],TA_25,D_D[EP],-1, D_D[LOC],$A23),0)","v":36},{"$f":"IFERROR(SUMIFS(D_D[INV],D_D[MT],2,D_D[CAT],TA_26,D_D[EP],-1, D_D[LOC],$A23),0)","v":3},{"$f":"IFERROR(SUMIFS(D_D[INV],D_D[MT],7,D_D[CAT],2,D_D[EP],TA_20, D_D[LOC],$A23),0)","v":0}]
["376","St. Louis RMC",{"$f":"IFERROR(SUMIFS(D_D[INV],D_D[MT],1,D_D[CAT],TA_20,D_D[EP],-1, D_D[LOC],$A24),0)","v":14},{"$f":"IFERROR(SUMIFS(D_D[ADP],D_D[MT],1,D_D[CAT],D$1,D_D[EP],-1, D_D[LOC],$A24),0)","v":130.36000000000001},{"$f":"IFERROR(SUMIFS(D_D[INV],D_D[MT],2,D_D[CAT],TA_21,D_D[EP],-1, D_D[LOC],$A24),0)","v":8},{"$f":"IFERROR(SUMIFS(D_D[BL],D_D[MT],2,D_D[CAT],TA_21,D_D[EP],-1, D_D[LOC],$A24),0)","v":8},1,{"$f":"IFERROR(SUMIFS(D_D[INV],D_D[MT],2,D_D[CAT],TA_22,D_D[EP],-1, D_D[LOC],$A24),0)","v":14},{"$f":"IFERROR(SUMIFS(D_D[BL],D_D[MT],2,D_D[CAT],TA_22,D_D[EP],-1, D_D[LOC],$A24),0)","v":2},0.14285714285714285,{"$f":"IFERROR(SUMIFS(D_D[INV],D_D[MT],2,D_D[CAT],TA_23,D_D[EP],-1, D_D[LOC],$A24),0)","v":0},{"$f":"IFERROR(SUMIFS(D_D[BL],D_D[MT],2,D_D[CAT],TA_23,D_D[EP],-1, D_D[LOC],$A24),0)","v":0},"0%",{"$f":"IFERROR(SUMIFS(D_D[INV],D_D[MT],2,D_D[CAT],TA_24,D_D[EP],-1, D_D[LOC],$A24),0)","v":36866},{"$f":"IFERROR(SUMIFS(D_D[BL],D_D[MT],2,D_D[CAT],TA_24,D_D[EP],-1, D_D[LOC],$A24),0)","v":9948},0.26984213096077686,{"$f":"IFERROR(SUMIFS(D_D[INV],D_D[MT],2,D_D[CAT],TA_25,D_D[EP],-1, D_D[LOC],$A24),0)","v":0},{"$f":"IFERROR(SUMIFS(D_D[INV],D_D[MT],2,D_D[CAT],TA_26,D_D[EP],-1, D_D[LOC],$A24),0)","v":1},{"$f":"IFERROR(SUMIFS(D_D[INV],D_D[MT],7,D_D[CAT],2,D_D[EP],TA_20, D_D[LOC],$A24),0)","v":0}]
["331","St. Louis",{"$f":"IFERROR(SUMIFS(D_D[INV],D_D[MT],1,D_D[CAT],TA_20,D_D[EP],-1, D_D[LOC],$A25),0)","v":2645},{"$f":"IFERROR(SUMIFS(D_D[ADP],D_D[MT],1,D_D[CAT],D$1,D_D[EP],-1, D_D[LOC],$A25),0)","v":67.33},{"$f":"IFERROR(SUMIFS(D_D[INV],D_D[MT],2,D_D[CAT],TA_21,D_D[EP],-1, D_D[LOC],$A25),0)","v":13926},{"$f":"IFERROR(SUMIFS(D_D[BL],D_D[MT],2,D_D[CAT],TA_21,D_D[EP],-1, D_D[LOC],$A25),0)","v":3736},0.2682751687491024,{"$f":"IFERROR(SUMIFS(D_D[INV],D_D[MT],2,D_D[CAT],TA_22,D_D[EP],-1, D_D[LOC],$A25),0)","v":3837},{"$f":"IFERROR(SUMIFS(D_D[BL],D_D[MT],2,D_D[CAT],TA_22,D_D[EP],-1, D_D[LOC],$A25),0)","v":905},0.23586135001303102,{"$f":"IFERROR(SUMIFS(D_D[INV],D_D[MT],2,D_D[CAT],TA_23,D_D[EP],-1, D_D[LOC],$A25),0)","v":333},{"$f":"IFERROR(SUMIFS(D_D[BL],D_D[MT],2,D_D[CAT],TA_23,D_D[EP],-1, D_D[LOC],$A25),0)","v":40},0.12012012012012012,{"$f":"IFERROR(SUMIFS(D_D[INV],D_D[MT],2,D_D[CAT],TA_24,D_D[EP],-1, D_D[LOC],$A25),0)","v":734},{"$f":"IFERROR(SUMIFS(D_D[BL],D_D[MT],2,D_D[CAT],TA_24,D_D[EP],-1, D_D[LOC],$A25),0)","v":375},0.51089918256130795,{"$f":"IFERROR(SUMIFS(D_D[INV],D_D[MT],2,D_D[CAT],TA_25,D_D[EP],-1, D_D[LOC],$A25),0)","v":171},{"$f":"IFERROR(SUMIFS(D_D[INV],D_D[MT],2,D_D[CAT],TA_26,D_D[EP],-1, D_D[LOC],$A25),0)","v":1},{"$f":"IFERROR(SUMIFS(D_D[INV],D_D[MT],7,D_D[CAT],2,D_D[EP],TA_20, D_D[LOC],$A25),0)","v":1}]
["402","Togus",{"$f":"IFERROR(SUMIFS(D_D[INV],D_D[MT],1,D_D[CAT],TA_20,D_D[EP],-1, D_D[LOC],$A26),0)","v":709},{"$f":"IFERROR(SUMIFS(D_D[ADP],D_D[MT],1,D_D[CAT],D$1,D_D[EP],-1, D_D[LOC],$A26),0)","v":64.61},{"$f":"IFERROR(SUMIFS(D_D[INV],D_D[MT],2,D_D[CAT],TA_21,D_D[EP],-1, D_D[LOC],$A26),0)","v":3369},{"$f":"IFERROR(SUMIFS(D_D[BL],D_D[MT],2,D_D[CAT],TA_21,D_D[EP],-1, D_D[LOC],$A26),0)","v":895},0.26565746512318195,{"$f":"IFERROR(SUMIFS(D_D[INV],D_D[MT],2,D_D[CAT],TA_22,D_D[EP],-1, D_D[LOC],$A26),0)","v":1232},{"$f":"IFERROR(SUMIFS(D_D[BL],D_D[MT],2,D_D[CAT],TA_22,D_D[EP],-1, D_D[LOC],$A26),0)","v":293},0.23782467532467533,{"$f":"IFERROR(SUMIFS(D_D[INV],D_D[MT],2,D_D[CAT],TA_23,D_D[EP],-1, D_D[LOC],$A26),0)","v":55},{"$f":"IFERROR(SUMIFS(D_D[BL],D_D[MT],2,D_D[CAT],TA_23,D_D[EP],-1, D_D[LOC],$A26),0)","v":4},7.2727272727272724E-2,{"$f":"IFERROR(SUMIFS(D_D[INV],D_D[MT],2,D_D[CAT],TA_24,D_D[EP],-1, D_D[LOC],$A26),0)","v":248},{"$f":"IFERROR(SUMIFS(D_D[BL],D_D[MT],2,D_D[CAT],TA_24,D_D[EP],-1, D_D[LOC],$A26),0)","v":137},0.55241935483870963,{"$f":"IFERROR(SUMIFS(D_D[INV],D_D[MT],2,D_D[CAT],TA_25,D_D[EP],-1, D_D[LOC],$A26),0)","v":50},{"$f":"IFERROR(SUMIFS(D_D[INV],D_D[MT],2,D_D[CAT],TA_26,D_D[EP],-1, D_D[LOC],$A26),0)","v":26},{"$f":"IFERROR(SUMIFS(D_D[INV],D_D[MT],7,D_D[CAT],2,D_D[EP],TA_20, D_D[LOC],$A26),0)","v":0}]
["372","Washington",{"$f":"IFERROR(SUMIFS(D_D[INV],D_D[MT],1,D_D[CAT],TA_20,D_D[EP],-1, D_D[LOC],$A27),0)","v":666},{"$f":"IFERROR(SUMIFS(D_D[ADP],D_D[MT],1,D_D[CAT],D$1,D_D[EP],-1, D_D[LOC],$A27),0)","v":109.89},{"$f":"IFERROR(SUMIFS(D_D[INV],D_D[MT],2,D_D[CAT],TA_21,D_D[EP],-1, D_D[LOC],$A27),0)","v":382},{"$f":"IFERROR(SUMIFS(D_D[BL],D_D[MT],2,D_D[CAT],TA_21,D_D[EP],-1, D_D[LOC],$A27),0)","v":95},0.2486910994764398,{"$f":"IFERROR(SUMIFS(D_D[INV],D_D[MT],2,D_D[CAT],TA_22,D_D[EP],-1, D_D[LOC],$A27),0)","v":731},{"$f":"IFERROR(SUMIFS(D_D[BL],D_D[MT],2,D_D[CAT],TA_22,D_D[EP],-1, D_D[LOC],$A27),0)","v":188},0.25718194254445964,{"$f":"IFERROR(SUMIFS(D_D[INV],D_D[MT],2,D_D[CAT],TA_23,D_D[EP],-1, D_D[LOC],$A27),0)","v":18},{"$f":"IFERROR(SUMIFS(D_D[BL],D_D[MT],2,D_D[CAT],TA_23,D_D[EP],-1, D_D[LOC],$A27),0)","v":0},0,{"$f":"IFERROR(SUMIFS(D_D[INV],D_D[MT],2,D_D[CAT],TA_24,D_D[EP],-1, D_D[LOC],$A27),0)","v":112},{"$f":"IFERROR(SUMIFS(D_D[BL],D_D[MT],2,D_D[CAT],TA_24,D_D[EP],-1, D_D[LOC],$A27),0)","v":18},0.16071428571428573,{"$f":"IFERROR(SUMIFS(D_D[INV],D_D[MT],2,D_D[CAT],TA_25,D_D[EP],-1, D_D[LOC],$A27),0)","v":1},{"$f":"IFERROR(SUMIFS(D_D[INV],D_D[MT],2,D_D[CAT],TA_26,D_D[EP],-1, D_D[LOC],$A27),0)","v":0},{"$f":"IFERROR(SUMIFS(D_D[INV],D_D[MT],7,D_D[CAT],2,D_D[EP],TA_20, D_D[LOC],$A27),0)","v":0}]
["405","White River Junction",{"$f":"IFERROR(SUMIFS(D_D[INV],D_D[MT],1,D_D[CAT],TA_20,D_D[EP],-1, D_D[LOC],$A28),0)","v":168},{"$f":"IFERROR(SUMIFS(D_D[ADP],D_D[MT],1,D_D[CAT],D$1,D_D[EP],-1, D_D[LOC],$A28),0)","v":62.89},{"$f":"IFERROR(SUMIFS(D_D[INV],D_D[MT],2,D_D[CAT],TA_21,D_D[EP],-1, D_D[LOC],$A28),0)","v":839},{"$f":"IFERROR(SUMIFS(D_D[BL],D_D[MT],2,D_D[CAT],TA_21,D_D[EP],-1, D_D[LOC],$A28),0)","v":263},0.31346841477949938,{"$f":"IFERROR(SUMIFS(D_D[INV],D_D[MT],2,D_D[CAT],TA_22,D_D[EP],-1, D_D[LOC],$A28),0)","v":301},{"$f":"IFERROR(SUMIFS(D_D[BL],D_D[MT],2,D_D[CAT],TA_22,D_D[EP],-1, D_D[LOC],$A28),0)","v":96},0.31893687707641194,{"$f":"IFERROR(SUMIFS(D_D[INV],D_D[MT],2,D_D[CAT],TA_23,D_D[EP],-1, D_D[LOC],$A28),0)","v":33},{"$f":"IFERROR(SUMIFS(D_D[BL],D_D[MT],2,D_D[CAT],TA_23,D_D[EP],-1, D_D[LOC],$A28),0)","v":2},6.0606060606060608E-2,{"$f":"IFERROR(SUMIFS(D_D[INV],D_D[MT],2,D_D[CAT],TA_24,D_D[EP],-1, D_D[LOC],$A28),0)","v":32},{"$f":"IFERROR(SUMIFS(D_D[BL],D_D[MT],2,D_D[CAT],TA_24,D_D[EP],-1, D_D[LOC],$A28),0)","v":20},0.625,{"$f":"IFERROR(SUMIFS(D_D[INV],D_D[MT],2,D_D[CAT],TA_25,D_D[EP],-1, D_D[LOC],$A28),0)","v":9},{"$f":"IFERROR(SUMIFS(D_D[INV],D_D[MT],2,D_D[CAT],TA_26,D_D[EP],-1, D_D[LOC],$A28),0)","v":3},{"$f":"IFERROR(SUMIFS(D_D[INV],D_D[MT],7,D_D[CAT],2,D_D[EP],TA_20, D_D[LOC],$A28),0)","v":0}]
["460","Wilmington",{"$f":"IFERROR(SUMIFS(D_D[INV],D_D[MT],1,D_D[CAT],TA_20,D_D[EP],-1, D_D[LOC],$A29),0)","v":392},{"$f":"IFERROR(SUMIFS(D_D[ADP],D_D[MT],1,D_D[CAT],D$1,D_D[EP],-1, D_D[LOC],$A29),0)","v":66.38},{"$f":"IFERROR(SUMIFS(D_D[INV],D_D[MT],2,D_D[CAT],TA_21,D_D[EP],-1, D_D[LOC],$A29),0)","v":2209},{"$f":"IFERROR(SUMIFS(D_D[BL],D_D[MT],2,D_D[CAT],TA_21,D_D[EP],-1, D_D[LOC],$A29),0)","v":543},0.24581258488003621,{"$f":"IFERROR(SUMIFS(D_D[INV],D_D[MT],2,D_D[CAT],TA_22,D_D[EP],-1, D_D[LOC],$A29),0)","v":576},{"$f":"IFERROR(SUMIFS(D_D[BL],D_D[MT],2,D_D[CAT],TA_22,D_D[EP],-1, D_D[LOC],$A29),0)","v":146},0.25347222222222221,{"$f":"IFERROR(SUMIFS(D_D[INV],D_D[MT],2,D_D[CAT],TA_23,D_D[EP],-1, D_D[LOC],$A29),0)","v":41},{"$f":"IFERROR(SUMIFS(D_D[BL],D_D[MT],2,D_D[CAT],TA_23,D_D[EP],-1, D_D[LOC],$A29),0)","v":2},4.878048780487805E-2,{"$f":"IFERROR(SUMIFS(D_D[INV],D_D[MT],2,D_D[CAT],TA_24,D_D[EP],-1, D_D[LOC],$A29),0)","v":78},{"$f":"IFERROR(SUMIFS(D_D[BL],D_D[MT],2,D_D[CAT],TA_24,D_D[EP],-1, D_D[LOC],$A29),0)","v":51},0.65384615384615385,{"$f":"IFERROR(SUMIFS(D_D[INV],D_D[MT],2,D_D[CAT],TA_25,D_D[EP],-1, D_D[LOC],$A29),0)","v":17},{"$f":"IFERROR(SUMIFS(D_D[INV],D_D[MT],2,D_D[CAT],TA_26,D_D[EP],-1, D_D[LOC],$A29),0)","v":1},{"$f":"IFERROR(SUMIFS(D_D[INV],D_D[MT],7,D_D[CAT],2,D_D[EP],TA_20, D_D[LOC],$A29),0)","v":0}]
[393,"Southeast",{"$f":"IFERROR(SUMIFS(D_D[INV],D_D[MT],1,D_D[CAT],TA_20,D_D[EP],-1, D_D[LOC],$A30),0)","v":58233},{"$f":"IFERROR(SUMIFS(D_D[ADP],D_D[MT],1,D_D[CAT],D$1,D_D[EP],-1, D_D[LOC],$A30),0)","v":66.430000000000007},{"$f":"IFERROR(SUMIFS(D_D[INV],D_D[MT],2,D_D[CAT],TA_21,D_D[EP],-1, D_D[LOC],$A30),0)","v":280169},{"$f":"IFERROR(SUMIFS(D_D[BL],D_D[MT],2,D_D[CAT],TA_21,D_D[EP],-1, D_D[LOC],$A30),0)","v":73323},0.26170989652673921,{"$f":"IFERROR(SUMIFS(D_D[INV],D_D[MT],2,D_D[CAT],TA_22,D_D[EP],-1, D_D[LOC],$A30),0)","v":95066},{"$f":"IFERROR(SUMIFS(D_D[BL],D_D[MT],2,D_D[CAT],TA_22,D_D[EP],-1, D_D[LOC],$A30),0)","v":23833},0.25069951402183743,{"$f":"IFERROR(SUMIFS(D_D[INV],D_D[MT],2,D_D[CAT],TA_23,D_D[EP],-1, D_D[LOC],$A30),0)","v":3909},{"$f":"IFERROR(SUMIFS(D_D[BL],D_D[MT],2,D_D[CAT],TA_23,D_D[EP],-1, D_D[LOC],$A30),0)","v":715},0.18291123049373242,{"$f":"IFERROR(SUMIFS(D_D[INV],D_D[MT],2,D_D[CAT],TA_24,D_D[EP],-1, D_D[LOC],$A30),0)","v":14953},{"$f":"IFERROR(SUMIFS(D_D[BL],D_D[MT],2,D_D[CAT],TA_24,D_D[EP],-1, D_D[LOC],$A30),0)","v":7338},0.49073764461980873,{"$f":"IFERROR(SUMIFS(D_D[INV],D_D[MT],2,D_D[CAT],TA_25,D_D[EP],-1, D_D[LOC],$A30),0)","v":2177},{"$f":"IFERROR(SUMIFS(D_D[INV],D_D[MT],2,D_D[CAT],TA_26,D_D[EP],-1, D_D[LOC],$A30),0)","v":100},{"$f":"IFERROR(SUMIFS(D_D[INV],D_D[MT],7,D_D[CAT],2,D_D[EP],TA_20, D_D[LOC],$A30),0)","v":603}]
["316","Atlanta",{"$f":"IFERROR(SUMIFS(D_D[INV],D_D[MT],1,D_D[CAT],TA_20,D_D[EP],-1, D_D[LOC],$A31),0)","v":7060},{"$f":"IFERROR(SUMIFS(D_D[ADP],D_D[MT],1,D_D[CAT],D$1,D_D[EP],-1, D_D[LOC],$A31),0)","v":68.42},{"$f":"IFERROR(SUMIFS(D_D[INV],D_D[MT],2,D_D[CAT],TA_21,D_D[EP],-1, D_D[LOC],$A31),0)","v":38099},{"$f":"IFERROR(SUMIFS(D_D[BL],D_D[MT],2,D_D[CAT],TA_21,D_D[EP],-1, D_D[LOC],$A31),0)","v":9969},0.26166041103441035,{"$f":"IFERROR(SUMIFS(D_D[INV],D_D[MT],2,D_D[CAT],TA_22,D_D[EP],-1, D_D[LOC],$A31),0)","v":9425},{"$f":"IFERROR(SUMIFS(D_D[BL],D_D[MT],2,D_D[CAT],TA_22,D_D[EP],-1, D_D[LOC],$A31),0)","v":2074},0.22005305039787798,{"$f":"IFERROR(SUMIFS(D_D[INV],D_D[MT],2,D_D[CAT],TA_23,D_D[EP],-1, D_D[LOC],$A31),0)","v":423},{"$f":"IFERROR(SUMIFS(D_D[BL],D_D[MT],2,D_D[CAT],TA_23,D_D[EP],-1, D_D[LOC],$A31),0)","v":119},0.28132387706855794,{"$f":"IFERROR(SUMIFS(D_D[INV],D_D[MT],2,D_D[CAT],TA_24,D_D[EP],-1, D_D[LOC],$A31),0)","v":1684},{"$f":"IFERROR(SUMIFS(D_D[BL],D_D[MT],2,D_D[CAT],TA_24,D_D[EP],-1, D_D[LOC],$A31),0)","v":816},0.48456057007125891,{"$f":"IFERROR(SUMIFS(D_D[INV],D_D[MT],2,D_D[CAT],TA_25,D_D[EP],-1, D_D[LOC],$A31),0)","v":248},{"$f":"IFERROR(SUMIFS(D_D[INV],D_D[MT],2,D_D[CAT],TA_26,D_D[EP],-1, D_D[LOC],$A31),0)","v":4},{"$f":"IFERROR(SUMIFS(D_D[INV],D_D[MT],7,D_D[CAT],2,D_D[EP],TA_20, D_D[LOC],$A31),0)","v":3}]
["319","Columbia",{"$f":"IFERROR(SUMIFS(D_D[INV],D_D[MT],1,D_D[CAT],TA_20,D_D[EP],-1, D_D[LOC],$A32),0)","v":5203},{"$f":"IFERROR(SUMIFS(D_D[ADP],D_D[MT],1,D_D[CAT],D$1,D_D[EP],-1, D_D[LOC],$A32),0)","v":57.32},{"$f":"IFERROR(SUMIFS(D_D[INV],D_D[MT],2,D_D[CAT],TA_21,D_D[EP],-1, D_D[LOC],$A32),0)","v":19237},{"$f":"IFERROR(SUMIFS(D_D[BL],D_D[MT],2,D_D[CAT],TA_21,D_D[EP],-1, D_D[LOC],$A32),0)","v":5066},{"$f":"IFERROR(F32/E32,\"0%\")","v":0.26334667567708064},{"$f":"IFERROR(SUMIFS(D_D[INV],D_D[MT],2,D_D[CAT],TA_22,D_D[EP],-1, D_D[LOC],$A32),0)","v":6836},{"$f":"IFERROR(SUMIFS(D_D[BL],D_D[MT],2,D_D[CAT],TA_22,D_D[EP],-1, D_D[LOC],$A32),0)","v":1280},{"$f":"IFERROR(I32/H32,\"0%\")","v":0.18724400234055003},{"$f":"IFERROR(SUMIFS(D_D[INV],D_D[MT],2,D_D[CAT],TA_23,D_D[EP],-1, D_D[LOC],$A32),0)","v":245},{"$f":"IFERROR(SUMIFS(D_D[BL],D_D[MT],2,D_D[CAT],TA_23,D_D[EP],-1, D_D[LOC],$A32),0)","v":48},{"$f":"IFERROR(L32/K32,\"0%\")","v":0.19591836734693877},{"$f":"IFERROR(SUMIFS(D_D[INV],D_D[MT],2,D_D[CAT],TA_24,D_D[EP],-1, D_D[LOC],$A32),0)","v":927},{"$f":"IFERROR(SUMIFS(D_D[BL],D_D[MT],2,D_D[CAT],TA_24,D_D[EP],-1, D_D[LOC],$A32),0)","v":453},{"$f":"IFERROR(O32/N32,\"0%\")","v":0.48867313915857608},{"$f":"IFERROR(SUMIFS(D_D[INV],D_D[MT],2,D_D[CAT],TA_25,D_D[EP],-1, D_D[LOC],$A32),0)","v":131},{"$f":"IFERROR(SUMIFS(D_D[INV],D_D[MT],2,D_D[CAT],TA_26,D_D[EP],-1, D_D[LOC],$A32),0)","v":5},{"$f":"IFERROR(SUMIFS(D_D[INV],D_D[MT],7,D_D[CAT],2,D_D[EP],TA_20, D_D[LOC],$A32),0)","v":1}]
[315,"Huntington",{"$f":"IFERROR(SUMIFS(D_D[INV],D_D[MT],1,D_D[CAT],TA_20,D_D[EP],-1, D_D[LOC],$A33),0)","v":961},{"$f":"IFERROR(SUMIFS(D_D[ADP],D_D[MT],1,D_D[CAT],D$1,D_D[EP],-1, D_D[LOC],$A33),0)","v":72.94},{"$f":"IFERROR(SUMIFS(D_D[INV],D_D[MT],2,D_D[CAT],TA_21,D_D[EP],-1, D_D[LOC],$A33),0)","v":5269},{"$f":"IFERROR(SUMIFS(D_D[BL],D_D[MT],2,D_D[CAT],TA_21,D_D[EP],-1, D_D[LOC],$A33),0)","v":1385},0.26285822736762193,{"$f":"IFERROR(SUMIFS(D_D[INV],D_D[MT],2,D_D[CAT],TA_22,D_D[EP],-1, D_D[LOC],$A33),0)","v":1450},{"$f":"IFERROR(SUMIFS(D_D[BL],D_D[MT],2,D_D[CAT],TA_22,D_D[EP],-1, D_D[LOC],$A33),0)","v":386},0.26620689655172414,{"$f":"IFERROR(SUMIFS(D_D[INV],D_D[MT],2,D_D[CAT],TA_23,D_D[EP],-1, D_D[LOC],$A33),0)","v":115},{"$f":"IFERROR(SUMIFS(D_D[BL],D_D[MT],2,D_D[CAT],TA_23,D_D[EP],-1, D_D[LOC],$A33),0)","v":10},8.6956521739130432E-2,{"$f":"IFERROR(SUMIFS(D_D[INV],D_D[MT],2,D_D[CAT],TA_24,D_D[EP],-1, D_D[LOC],$A33),0)","v":369},{"$f":"IFERROR(SUMIFS(D_D[BL],D_D[MT],2,D_D[CAT],TA_24,D_D[EP],-1, D_D[LOC],$A33),0)","v":189},0.51219512195121952,{"$f":"IFERROR(SUMIFS(D_D[INV],D_D[MT],2,D_D[CAT],TA_25,D_D[EP],-1, D_D[LOC],$A33),0)","v":42},{"$f":"IFERROR(SUMIFS(D_D[INV],D_D[MT],2,D_D[CAT],TA_26,D_D[EP],-1, D_D[LOC],$A33),0)","v":15},{"$f":"IFERROR(SUMIFS(D_D[INV],D_D[MT],7,D_D[CAT],2,D_D[EP],TA_20, D_D[LOC],$A33),0)","v":0}]
["323","Jackson",{"$f":"IFERROR(SUMIFS(D_D[INV],D_D[MT],1,D_D[CAT],TA_20,D_D[EP],-1, D_D[LOC],$A34),0)","v":1604},{"$f":"IFERROR(SUMIFS(D_D[ADP],D_D[MT],1,D_D[CAT],D$1,D_D[EP],-1, D_D[LOC],$A34),0)","v":67.069999999999993},{"$f":"IFERROR(SUMIFS(D_D[INV],D_D[MT],2,D_D[CAT],TA_21,D_D[EP],-1, D_D[LOC],$A34),0)","v":10292},{"$f":"IFERROR(SUMIFS(D_D[BL],D_D[MT],2,D_D[CAT],TA_21,D_D[EP],-1, D_D[LOC],$A34),0)","v":2939},0.2855616012436844,{"$f":"IFERROR(SUMIFS(D_D[INV],D_D[MT],2,D_D[CAT],TA_22,D_D[EP],-1, D_D[LOC],$A34),0)","v":2578},{"$f":"IFERROR(SUMIFS(D_D[BL],D_D[MT],2,D_D[CAT],TA_22,D_D[EP],-1, D_D[LOC],$A34),0)","v":751},0.29131109387121801,{"$f":"IFERROR(SUMIFS(D_D[INV],D_D[MT],2,D_D[CAT],TA_23,D_D[EP],-1, D_D[LOC],$A34),0)","v":115},{"$f":"IFERROR(SUMIFS(D_D[BL],D_D[MT],2,D_D[CAT],TA_23,D_D[EP],-1, D_D[LOC],$A34),0)","v":28},0.24347826086956523,{"$f":"IFERROR(SUMIFS(D_D[INV],D_D[MT],2,D_D[CAT],TA_24,D_D[EP],-1, D_D[LOC],$A34),0)","v":617},{"$f":"IFERROR(SUMIFS(D_D[BL],D_D[MT],2,D_D[CAT],TA_24,D_D[EP],-1, D_D[LOC],$A34),0)","v":251},0.40680713128038898,{"$f":"IFERROR(SUMIFS(D_D[INV],D_D[MT],2,D_D[CAT],TA_25,D_D[EP],-1, D_D[LOC],$A34),0)","v":58},{"$f":"IFERROR(SUMIFS(D_D[INV],D_D[MT],2,D_D[CAT],TA_26,D_D[EP],-1, D_D[LOC],$A34),0)","v":2},{"$f":"IFERROR(SUMIFS(D_D[INV],D_D[MT],7,D_D[CAT],2,D_D[EP],TA_20, D_D[LOC],$A34),0)","v":265}]
["350","Little Rock",{"$f":"IFERROR(SUMIFS(D_D[INV],D_D[MT],1,D_D[CAT],TA_20,D_D[EP],-1, D_D[LOC],$A35),0)","v":1792},{"$f":"IFERROR(SUMIFS(D_D[ADP],D_D[MT],1,D_D[CAT],D$1,D_D[EP],-1, D_D[LOC],$A35),0)","v":66.400000000000006},{"$f":"IFERROR(SUMIFS(D_D[INV],D_D[MT],2,D_D[CAT],TA_21,D_D[EP],-1, D_D[LOC],$A35),0)","v":8917},{"$f":"IFERROR(SUMIFS(D_D[BL],D_D[MT],2,D_D[CAT],TA_21,D_D[EP],-1, D_D[LOC],$A35),0)","v":2297},0.25759784680946507,{"$f":"IFERROR(SUMIFS(D_D[INV],D_D[MT],2,D_D[CAT],TA_22,D_D[EP],-1, D_D[LOC],$A35),0)","v":4892},{"$f":"IFERROR(SUMIFS(D_D[BL],D_D[MT],2,D_D[CAT],TA_22,D_D[EP],-1, D_D[LOC],$A35),0)","v":1598},0.32665576451349143,{"$f":"IFERROR(SUMIFS(D_D[INV],D_D[MT],2,D_D[CAT],TA_23,D_D[EP],-1, D_D[LOC],$A35),0)","v":210},{"$f":"IFERROR(SUMIFS(D_D[BL],D_D[MT],2,D_D[CAT],TA_23,D_D[EP],-1, D_D[LOC],$A35),0)","v":25},0.11904761904761904,{"$f":"IFERROR(SUMIFS(D_D[INV],D_D[MT],2,D_D[CAT],TA_24,D_D[EP],-1, D_D[LOC],$A35),0)","v":409},{"$f":"IFERROR(SUMIFS(D_D[BL],D_D[MT],2,D_D[CAT],TA_24,D_D[EP],-1, D_D[LOC],$A35),0)","v":225},0.55012224938875309,{"$f":"IFERROR(SUMIFS(D_D[INV],D_D[MT],2,D_D[CAT],TA_25,D_D[EP],-1, D_D[LOC],$A35),0)","v":97},{"$f":"IFERROR(SUMIFS(D_D[INV],D_D[MT],2,D_D[CAT],TA_26,D_D[EP],-1, D_D[LOC],$A35),0)","v":8},{"$f":"IFERROR(SUMIFS(D_D[INV],D_D[MT],7,D_D[CAT],2,D_D[EP],TA_20, D_D[LOC],$A35),0)","v":0}]
["327","Louisville",{"$f":"IFERROR(SUMIFS(D_D[INV],D_D[MT],1,D_D[CAT],TA_20,D_D[EP],-1, D_D[LOC],$A36),0)","v":3653},{"$f":"IFERROR(SUMIFS(D_D[ADP],D_D[MT],1,D_D[CAT],D$1,D_D[EP],-1, D_D[LOC],$A36),0)","v":66.13},{"$f":"IFERROR(SUMIFS(D_D[INV],D_D[MT],2,D_D[CAT],TA_21,D_D[EP],-1, D_D[LOC],$A36),0)","v":10448},{"$f":"IFERROR(SUMIFS(D_D[BL],D_D[MT],2,D_D[CAT],TA_21,D_D[EP],-1, D_D[LOC],$A36),0)","v":3014},0.28847626339969373,{"$f":"IFERROR(SUMIFS(D_D[INV],D_D[MT],2,D_D[CAT],TA_22,D_D[EP],-1, D_D[LOC],$A36),0)","v":4711},{"$f":"IFERROR(SUMIFS(D_D[BL],D_D[MT],2,D_D[CAT],TA_22,D_D[EP],-1, D_D[LOC],$A36),0)","v":892},0.18934408830396943,{"$f":"IFERROR(SUMIFS(D_D[INV],D_D[MT],2,D_D[CAT],TA_23,D_D[EP],-1, D_D[LOC],$A36),0)","v":213},{"$f":"IFERROR(SUMIFS(D_D[BL],D_D[MT],2,D_D[CAT],TA_23,D_D[EP],-1, D_D[LOC],$A36),0)","v":23},0.107981220657277,{"$f":"IFERROR(SUMIFS(D_D[INV],D_D[MT],2,D_D[CAT],TA_24,D_D[EP],-1, D_D[LOC],$A36),0)","v":538},{"$f":"IFERROR(SUMIFS(D_D[BL],D_D[MT],2,D_D[CAT],TA_24,D_D[EP],-1, D_D[LOC],$A36),0)","v":269},0.5,{"$f":"IFERROR(SUMIFS(D_D[INV],D_D[MT],2,D_D[CAT],TA_25,D_D[EP],-1, D_D[LOC],$A36),0)","v":94},{"$f":"IFERROR(SUMIFS(D_D[INV],D_D[MT],2,D_D[CAT],TA_26,D_D[EP],-1, D_D[LOC],$A36),0)","v":16},{"$f":"IFERROR(SUMIFS(D_D[INV],D_D[MT],7,D_D[CAT],2,D_D[EP],TA_20, D_D[LOC],$A36),0)","v":294}]
["322","Montgomery",{"$f":"IFERROR(SUMIFS(D_D[INV],D_D[MT],1,D_D[CAT],TA_20,D_D[EP],-1, D_D[LOC],$A37),0)","v":3379},{"$f":"IFERROR(SUMIFS(D_D[ADP],D_D[MT],1,D_D[CAT],D$1,D_D[EP],-1, D_D[LOC],$A37),0)","v":65.2},{"$f":"IFERROR(SUMIFS(D_D[INV],D_D[MT],2,D_D[CAT],TA_21,D_D[EP],-1, D_D[LOC],$A37),0)","v":17680},{"$f":"IFERROR(SUMIFS(D_D[BL],D_D[MT],2,D_D[CAT],TA_21,D_D[EP],-1, D_D[LOC],$A37),0)","v":4668},0.26402714932126697,{"$f":"IFERROR(SUMIFS(D_D[INV],D_D[MT],2,D_D[CAT],TA_22,D_D[EP],-1, D_D[LOC],$A37),0)","v":4519},{"$f":"IFERROR(SUMIFS(D_D[BL],D_D[MT],2,D_D[CAT],TA_22,D_D[EP],-1, D_D[LOC],$A37),0)","v":1016},0.22482850188094711,{"$f":"IFERROR(SUMIFS(D_D[INV],D_D[MT],2,D_D[CAT],TA_23,D_D[EP],-1, D_D[LOC],$A37),0)","v":210},{"$f":"IFERROR(SUMIFS(D_D[BL],D_D[MT],2,D_D[CAT],TA_23,D_D[EP],-1, D_D[LOC],$A37),0)","v":59},0.28095238095238095,{"$f":"IFERROR(SUMIFS(D_D[INV],D_D[MT],2,D_D[CAT],TA_24,D_D[EP],-1, D_D[LOC],$A37),0)","v":645},{"$f":"IFERROR(SUMIFS(D_D[BL],D_D[MT],2,D_D[CAT],TA_24,D_D[EP],-1, D_D[LOC],$A37),0)","v":376},0.58294573643410852,{"$f":"IFERROR(SUMIFS(D_D[INV],D_D[MT],2,D_D[CAT],TA_25,D_D[EP],-1, D_D[LOC],$A37),0)","v":143},{"$f":"IFERROR(SUMIFS(D_D[INV],D_D[MT],2,D_D[CAT],TA_26,D_D[EP],-1, D_D[LOC],$A37),0)","v":2},{"$f":"IFERROR(SUMIFS(D_D[INV],D_D[MT],7,D_D[CAT],2,D_D[EP],TA_20, D_D[LOC],$A37),0)","v":2}]
["320","Nashville",{"$f":"IFERROR(SUMIFS(D_D[INV],D_D[MT],1,D_D[CAT],TA_20,D_D[EP],-1, D_D[LOC],$A38),0)","v":4449},{"$f":"IFERROR(SUMIFS(D_D[ADP],D_D[MT],1,D_D[CAT],D$1,D_D[EP],-1, D_D[LOC],$A38),0)","v":73},{"$f":"IFERROR(SUMIFS(D_D[INV],D_D[MT],2,D_D[CAT],TA_21,D_D[EP],-1, D_D[LOC],$A38),0)","v":19028},{"$f":"IFERROR(SUMIFS(D_D[BL],D_D[MT],2,D_D[CAT],TA_21,D_D[EP],-1, D_D[LOC],$A38),0)","v":4935},0.25935463527433256,{"$f":"IFERROR(SUMIFS(D_D[INV],D_D[MT],2,D_D[CAT],TA_22,D_D[EP],-1, D_D[LOC],$A38),0)","v":13768},{"$f":"IFERROR(SUMIFS(D_D[BL],D_D[MT],2,D_D[CAT],TA_22,D_D[EP],-1, D_D[LOC],$A38),0)","v":4634},0.33657757117954679,{"$f":"IFERROR(SUMIFS(D_D[INV],D_D[MT],2,D_D[CAT],TA_23,D_D[EP],-1, D_D[LOC],$A38),0)","v":322},{"$f":"IFERROR(SUMIFS(D_D[BL],D_D[MT],2,D_D[CAT],TA_23,D_D[EP],-1, D_D[LOC],$A38),0)","v":28},8.6956521739130432E-2,{"$f":"IFERROR(SUMIFS(D_D[INV],D_D[MT],2,D_D[CAT],TA_24,D_D[EP],-1, D_D[LOC],$A38),0)","v":885},{"$f":"IFERROR(SUMIFS(D_D[BL],D_D[MT],2,D_D[CAT],TA_24,D_D[EP],-1, D_D[LOC],$A38),0)","v":534},0.60338983050847461,{"$f":"IFERROR(SUMIFS(D_D[INV],D_D[MT],2,D_D[CAT],TA_25,D_D[EP],-1, D_D[LOC],$A38),0)","v":222},{"$f":"IFERROR(SUMIFS(D_D[INV],D_D[MT],2,D_D[CAT],TA_26,D_D[EP],-1, D_D[LOC],$A38),0)","v":6},{"$f":"IFERROR(SUMIFS(D_D[INV],D_D[MT],7,D_D[CAT],2,D_D[EP],TA_20, D_D[LOC],$A38),0)","v":7}]
["321","New Orleans",{"$f":"IFERROR(SUMIFS(D_D[INV],D_D[MT],1,D_D[CAT],TA_20,D_D[EP],-1, D_D[LOC],$A39),0)","v":2281},{"$f":"IFERROR(SUMIFS(D_D[ADP],D_D[MT],1,D_D[CAT],D$1,D_D[EP],-1, D_D[LOC],$A39),0)","v":63.19},{"$f":"IFERROR(SUMIFS(D_D[INV],D_D[MT],2,D_D[CAT],TA_21,D_D[EP],-1, D_D[LOC],$A39),0)","v":14463},{"$f":"IFERROR(SUMIFS(D_D[BL],D_D[MT],2,D_D[CAT],TA_21,D_D[EP],-1, D_D[LOC],$A39),0)","v":4012},0.27739749706146721,{"$f":"IFERROR(SUMIFS(D_D[INV],D_D[MT],2,D_D[CAT],TA_22,D_D[EP],-1, D_D[LOC],$A39),0)","v":3183},{"$f":"IFERROR(SUMIFS(D_D[BL],D_D[MT],2,D_D[CAT],TA_22,D_D[EP],-1, D_D[LOC],$A39),0)","v":778},0.24442349984291548,{"$f":"IFERROR(SUMIFS(D_D[INV],D_D[MT],2,D_D[CAT],TA_23,D_D[EP],-1, D_D[LOC],$A39),0)","v":168},{"$f":"IFERROR(SUMIFS(D_D[BL],D_D[MT],2,D_D[CAT],TA_23,D_D[EP],-1, D_D[LOC],$A39),0)","v":33},0.19642857142857142,{"$f":"IFERROR(SUMIFS(D_D[INV],D_D[MT],2,D_D[CAT],TA_24,D_D[EP],-1, D_D[LOC],$A39),0)","v":724},{"$f":"IFERROR(SUMIFS(D_D[BL],D_D[MT],2,D_D[CAT],TA_24,D_D[EP],-1, D_D[LOC],$A39),0)","v":291},0.40193370165745856,{"$f":"IFERROR(SUMIFS(D_D[INV],D_D[MT],2,D_D[CAT],TA_25,D_D[EP],-1, D_D[LOC],$A39),0)","v":110},{"$f":"IFERROR(SUMIFS(D_D[INV],D_D[MT],2,D_D[CAT],TA_26,D_D[EP],-1, D_D[LOC],$A39),0)","v":0},{"$f":"IFERROR(SUMIFS(D_D[INV],D_D[MT],7,D_D[CAT],2,D_D[EP],TA_20, D_D[LOC],$A39),0)","v":2}]
["314","Roanoke",{"$f":"IFERROR(SUMIFS(D_D[INV],D_D[MT],1,D_D[CAT],TA_20,D_D[EP],-1, D_D[LOC],$A40),0)","v":7034},{"$f":"IFERROR(SUMIFS(D_D[ADP],D_D[MT],1,D_D[CAT],D$1,D_D[EP],-1, D_D[LOC],$A40),0)","v":67.13},{"$f":"IFERROR(SUMIFS(D_D[INV],D_D[MT],2,D_D[CAT],TA_21,D_D[EP],-1, D_D[LOC],$A40),0)","v":31972},{"$f":"IFERROR(SUMIFS(D_D[BL],D_D[MT],2,D_D[CAT],TA_21,D_D[EP],-1, D_D[LOC],$A40),0)","v":8214},0.25691229826097833,{"$f":"IFERROR(SUMIFS(D_D[INV],D_D[MT],2,D_D[CAT],TA_22,D_D[EP],-1, D_D[LOC],$A40),0)","v":9570},{"$f":"IFERROR(SUMIFS(D_D[BL],D_D[MT],2,D_D[CAT],TA_22,D_D[EP],-1, D_D[LOC],$A40),0)","v":2255},0.23563218390804597,{"$f":"IFERROR(SUMIFS(D_D[INV],D_D[MT],2,D_D[CAT],TA_23,D_D[EP],-1, D_D[LOC],$A40),0)","v":374},{"$f":"IFERROR(SUMIFS(D_D[BL],D_D[MT],2,D_D[CAT],TA_23,D_D[EP],-1, D_D[LOC],$A40),0)","v":85},0.22727272727272727,{"$f":"IFERROR(SUMIFS(D_D[INV],D_D[MT],2,D_D[CAT],TA_24,D_D[EP],-1, D_D[LOC],$A40),0)","v":1098},{"$f":"IFERROR(SUMIFS(D_D[BL],D_D[MT],2,D_D[CAT],TA_24,D_D[EP],-1, D_D[LOC],$A40),0)","v":690},0.62841530054644812,{"$f":"IFERROR(SUMIFS(D_D[INV],D_D[MT],2,D_D[CAT],TA_25,D_D[EP],-1, D_D[LOC],$A40),0)","v":234},{"$f":"IFERROR(SUMIFS(D_D[INV],D_D[MT],2,D_D[CAT],TA_26,D_D[EP],-1, D_D[LOC],$A40),0)","v":4},{"$f":"IFERROR(SUMIFS(D_D[INV],D_D[MT],7,D_D[CAT],2,D_D[EP],TA_20, D_D[LOC],$A40),0)","v":1}]
["355","San Juan",{"$f":"IFERROR(SUMIFS(D_D[INV],D_D[MT],1,D_D[CAT],TA_20,D_D[EP],-1, D_D[LOC],$A41),0)","v":958},{"$f":"IFERROR(SUMIFS(D_D[ADP],D_D[MT],1,D_D[CAT],D$1,D_D[EP],-1, D_D[LOC],$A41),0)","v":69.48},{"$f":"IFERROR(SUMIFS(D_D[INV],D_D[MT],2,D_D[CAT],TA_21,D_D[EP],-1, D_D[LOC],$A41),0)","v":6009},{"$f":"IFERROR(SUMIFS(D_D[BL],D_D[MT],2,D_D[CAT],TA_21,D_D[EP],-1, D_D[LOC],$A41),0)","v":1890},0.31452820768846729,{"$f":"IFERROR(SUMIFS(D_D[INV],D_D[MT],2,D_D[CAT],TA_22,D_D[EP],-1, D_D[LOC],$A41),0)","v":2271},{"$f":"IFERROR(SUMIFS(D_D[BL],D_D[MT],2,D_D[CAT],TA_22,D_D[EP],-1, D_D[LOC],$A41),0)","v":1005},0.44253632760898282,{"$f":"IFERROR(SUMIFS(D_D[INV],D_D[MT],2,D_D[CAT],TA_23,D_D[EP],-1, D_D[LOC],$A41),0)","v":67},{"$f":"IFERROR(SUMIFS(D_D[BL],D_D[MT],2,D_D[CAT],TA_23,D_D[EP],-1, D_D[LOC],$A41),0)","v":10},0.14925373134328357,{"$f":"IFERROR(SUMIFS(D_D[INV],D_D[MT],2,D_D[CAT],TA_24,D_D[EP],-1, D_D[LOC],$A41),0)","v":424},{"$f":"IFERROR(SUMIFS(D_D[BL],D_D[MT],2,D_D[CAT],TA_24,D_D[EP],-1, D_D[LOC],$A41),0)","v":201},0.47405660377358488,{"$f":"IFERROR(SUMIFS(D_D[INV],D_D[MT],2,D_D[CAT],TA_25,D_D[EP],-1, D_D[LOC],$A41),0)","v":58},{"$f":"IFERROR(SUMIFS(D_D[INV],D_D[MT],2,D_D[CAT],TA_26,D_D[EP],-1, D_D[LOC],$A41),0)","v":2},{"$f":"IFERROR(SUMIFS(D_D[INV],D_D[MT],7,D_D[CAT],2,D_D[EP],TA_20, D_D[LOC],$A41),0)","v":0}]
["317","St. Petersburg",{"$f":"IFERROR(SUMIFS(D_D[INV],D_D[MT],1,D_D[CAT],TA_20,D_D[EP],-1, D_D[LOC],$A42),0)","v":10821},{"$f":"IFERROR(SUMIFS(D_D[ADP],D_D[MT],1,D_D[CAT],D$1,D_D[EP],-1, D_D[LOC],$A42),0)","v":65.81},{"$f":"IFERROR(SUMIFS(D_D[INV],D_D[MT],2,D_D[CAT],TA_21,D_D[EP],-1, D_D[LOC],$A42),0)","v":62771},{"$f":"IFERROR(SUMIFS(D_D[BL],D_D[MT],2,D_D[CAT],TA_21,D_D[EP],-1, D_D[LOC],$A42),0)","v":15711},0.25029073935416035,{"$f":"IFERROR(SUMIFS(D_D[INV],D_D[MT],2,D_D[CAT],TA_22,D_D[EP],-1, D_D[LOC],$A42),0)","v":14762},{"$f":"IFERROR(SUMIFS(D_D[BL],D_D[MT],2,D_D[CAT],TA_22,D_D[EP],-1, D_D[LOC],$A42),0)","v":2930},0.19848259043490041,{"$f":"IFERROR(SUMIFS(D_D[INV],D_D[MT],2,D_D[CAT],TA_23,D_D[EP],-1, D_D[LOC],$A42),0)","v":945},{"$f":"IFERROR(SUMIFS(D_D[BL],D_D[MT],2,D_D[CAT],TA_23,D_D[EP],-1, D_D[LOC],$A42),0)","v":147},0.15555555555555556,{"$f":"IFERROR(SUMIFS(D_D[INV],D_D[MT],2,D_D[CAT],TA_24,D_D[EP],-1, D_D[LOC],$A42),0)","v":5072},{"$f":"IFERROR(SUMIFS(D_D[BL],D_D[MT],2,D_D[CAT],TA_24,D_D[EP],-1, D_D[LOC],$A42),0)","v":2265},0.44656940063091483,{"$f":"IFERROR(SUMIFS(D_D[INV],D_D[MT],2,D_D[CAT],TA_25,D_D[EP],-1, D_D[LOC],$A42),0)","v":432},{"$f":"IFERROR(SUMIFS(D_D[INV],D_D[MT],2,D_D[CAT],TA_26,D_D[EP],-1, D_D[LOC],$A42),0)","v":26},{"$f":"IFERROR(SUMIFS(D_D[INV],D_D[MT],7,D_D[CAT],2,D_D[EP],TA_20, D_D[LOC],$A42),0)","v":27}]
["318","Winston-Salem",{"$f":"IFERROR(SUMIFS(D_D[INV],D_D[MT],1,D_D[CAT],TA_20,D_D[EP],-1, D_D[LOC],$A43),0)","v":9038},{"$f":"IFERROR(SUMIFS(D_D[ADP],D_D[MT],1,D_D[CAT],D$1,D_D[EP],-1, D_D[LOC],$A43),0)","v":67.349999999999994},{"$f":"IFERROR(SUMIFS(D_D[INV],D_D[MT],2,D_D[CAT],TA_21,D_D[EP],-1, D_D[LOC],$A43),0)","v":35984},{"$f":"IFERROR(SUMIFS(D_D[BL],D_D[MT],2,D_D[CAT],TA_21,D_D[EP],-1, D_D[LOC],$A43),0)","v":9223},0.25630835927078699,{"$f":"IFERROR(SUMIFS(D_D[INV],D_D[MT],2,D_D[CAT],TA_22,D_D[EP],-1, D_D[LOC],$A43),0)","v":17101},{"$f":"IFERROR(SUMIFS(D_D[BL],D_D[MT],2,D_D[CAT],TA_22,D_D[EP],-1, D_D[LOC],$A43),0)","v":4234},0.24758786035904334,{"$f":"IFERROR(SUMIFS(D_D[INV],D_D[MT],2,D_D[CAT],TA_23,D_D[EP],-1, D_D[LOC],$A43),0)","v":502},{"$f":"IFERROR(SUMIFS(D_D[BL],D_D[MT],2,D_D[CAT],TA_23,D_D[EP],-1, D_D[LOC],$A43),0)","v":100},0.19920318725099601,{"$f":"IFERROR(SUMIFS(D_D[INV],D_D[MT],2,D_D[CAT],TA_24,D_D[EP],-1, D_D[LOC],$A43),0)","v":1561},{"$f":"IFERROR(SUMIFS(D_D[BL],D_D[MT],2,D_D[CAT],TA_24,D_D[EP],-1, D_D[LOC],$A43),0)","v":778},0.49839846252402309,{"$f":"IFERROR(SUMIFS(D_D[INV],D_D[MT],2,D_D[CAT],TA_25,D_D[EP],-1, D_D[LOC],$A43),0)","v":308},{"$f":"IFERROR(SUMIFS(D_D[INV],D_D[MT],2,D_D[CAT],TA_26,D_D[EP],-1, D_D[LOC],$A43),0)","v":10},{"$f":"IFERROR(SUMIFS(D_D[INV],D_D[MT],7,D_D[CAT],2,D_D[EP],TA_20, D_D[LOC],$A43),0)","v":1}]
[384,"Continental",{"$f":"IFERROR(SUMIFS(D_D[INV],D_D[MT],1,D_D[CAT],TA_20,D_D[EP],-1, D_D[LOC],$A44),0)","v":35617},{"$f":"IFERROR(SUMIFS(D_D[ADP],D_D[MT],1,D_D[CAT],D$1,D_D[EP],-1, D_D[LOC],$A44),0)","v":65.75},{"$f":"IFERROR(SUMIFS(D_D[INV],D_D[MT],2,D_D[CAT],TA_21,D_D[EP],-1, D_D[LOC],$A44),0)","v":157309},{"$f":"IFERROR(SUMIFS(D_D[BL],D_D[MT],2,D_D[CAT],TA_21,D_D[EP],-1, D_D[LOC],$A44),0)","v":41378},0.2630364441958184,{"$f":"IFERROR(SUMIFS(D_D[INV],D_D[MT],2,D_D[CAT],TA_22,D_D[EP],-1, D_D[LOC],$A44),0)","v":79315},{"$f":"IFERROR(SUMIFS(D_D[BL],D_D[MT],2,D_D[CAT],TA_22,D_D[EP],-1, D_D[LOC],$A44),0)","v":28545},0.35989409317279203,{"$f":"IFERROR(SUMIFS(D_D[INV],D_D[MT],2,D_D[CAT],TA_23,D_D[EP],-1, D_D[LOC],$A44),0)","v":2698},{"$f":"IFERROR(SUMIFS(D_D[BL],D_D[MT],2,D_D[CAT],TA_23,D_D[EP],-1, D_D[LOC],$A44),0)","v":331},0.12268346923647146,{"$f":"IFERROR(SUMIFS(D_D[INV],D_D[MT],2,D_D[CAT],TA_24,D_D[EP],-1, D_D[LOC],$A44),0)","v":9368},{"$f":"IFERROR(SUMIFS(D_D[BL],D_D[MT],2,D_D[CAT],TA_24,D_D[EP],-1, D_D[LOC],$A44),0)","v":4908},0.52391118701964134,{"$f":"IFERROR(SUMIFS(D_D[INV],D_D[MT],2,D_D[CAT],TA_25,D_D[EP],-1, D_D[LOC],$A44),0)","v":1905},{"$f":"IFERROR(SUMIFS(D_D[INV],D_D[MT],2,D_D[CAT],TA_26,D_D[EP],-1, D_D[LOC],$A44),0)","v":139},{"$f":"IFERROR(SUMIFS(D_D[INV],D_D[MT],7,D_D[CAT],2,D_D[EP],TA_20, D_D[LOC],$A44),0)","v":245}]
["442","Cheyenne ",{"$f":"IFERROR(SUMIFS(D_D[INV],D_D[MT],1,D_D[CAT],TA_20,D_D[EP],-1, D_D[LOC],$A45),0)","v":282},{"$f":"IFERROR(SUMIFS(D_D[ADP],D_D[MT],1,D_D[CAT],D$1,D_D[EP],-1, D_D[LOC],$A45),0)","v":68.48},{"$f":"IFERROR(SUMIFS(D_D[INV],D_D[MT],2,D_D[CAT],TA_21,D_D[EP],-1, D_D[LOC],$A45),0)","v":1875},{"$f":"IFERROR(SUMIFS(D_D[BL],D_D[MT],2,D_D[CAT],TA_21,D_D[EP],-1, D_D[LOC],$A45),0)","v":477},0.25440000000000002,{"$f":"IFERROR(SUMIFS(D_D[INV],D_D[MT],2,D_D[CAT],TA_22,D_D[EP],-1, D_D[LOC],$A45),0)","v":427},{"$f":"IFERROR(SUMIFS(D_D[BL],D_D[MT],2,D_D[CAT],TA_22,D_D[EP],-1, D_D[LOC],$A45),0)","v":118},0.27634660421545665,{"$f":"IFERROR(SUMIFS(D_D[INV],D_D[MT],2,D_D[CAT],TA_23,D_D[EP],-1, D_D[LOC],$A45),0)","v":24},{"$f":"IFERROR(SUMIFS(D_D[BL],D_D[MT],2,D_D[CAT],TA_23,D_D[EP],-1, D_D[LOC],$A45),0)","v":5},0.20833333333333334,{"$f":"IFERROR(SUMIFS(D_D[INV],D_D[MT],2,D_D[CAT],TA_24,D_D[EP],-1, D_D[LOC],$A45),0)","v":70},{"$f":"IFERROR(SUMIFS(D_D[BL],D_D[MT],2,D_D[CAT],TA_24,D_D[EP],-1, D_D[LOC],$A45),0)","v":42},0.6,{"$f":"IFERROR(SUMIFS(D_D[INV],D_D[MT],2,D_D[CAT],TA_25,D_D[EP],-1, D_D[LOC],$A45),0)","v":18},{"$f":"IFERROR(SUMIFS(D_D[INV],D_D[MT],2,D_D[CAT],TA_26,D_D[EP],-1, D_D[LOC],$A45),0)","v":5},{"$f":"IFERROR(SUMIFS(D_D[INV],D_D[MT],7,D_D[CAT],2,D_D[EP],TA_20, D_D[LOC],$A45),0)","v":0}]
["339","Denver",{"$f":"IFERROR(SUMIFS(D_D[INV],D_D[MT],1,D_D[CAT],TA_20,D_D[EP],-1, D_D[LOC],$A46),0)","v":3230},{"$f":"IFERROR(SUMIFS(D_D[ADP],D_D[MT],1,D_D[CAT],D$1,D_D[EP],-1, D_D[LOC],$A46),0)","v":61.94},{"$f":"IFERROR(SUMIFS(D_D[INV],D_D[MT],2,D_D[CAT],TA_21,D_D[EP],-1, D_D[LOC],$A46),0)","v":14904},{"$f":"IFERROR(SUMIFS(D_D[BL],D_D[MT],2,D_D[CAT],TA_21,D_D[EP],-1, D_D[LOC],$A46),0)","v":3478},0.23336017176596888,{"$f":"IFERROR(SUMIFS(D_D[INV],D_D[MT],2,D_D[CAT],TA_22,D_D[EP],-1, D_D[LOC],$A46),0)","v":4878},{"$f":"IFERROR(SUMIFS(D_D[BL],D_D[MT],2,D_D[CAT],TA_22,D_D[EP],-1, D_D[LOC],$A46),0)","v":1195},0.24497744977449776,{"$f":"IFERROR(SUMIFS(D_D[INV],D_D[MT],2,D_D[CAT],TA_23,D_D[EP],-1, D_D[LOC],$A46),0)","v":207},{"$f":"IFERROR(SUMIFS(D_D[BL],D_D[MT],2,D_D[CAT],TA_23,D_D[EP],-1, D_D[LOC],$A46),0)","v":23},0.1111111111111111,{"$f":"IFERROR(SUMIFS(D_D[INV],D_D[MT],2,D_D[CAT],TA_24,D_D[EP],-1, D_D[LOC],$A46),0)","v":538},{"$f":"IFERROR(SUMIFS(D_D[BL],D_D[MT],2,D_D[CAT],TA_24,D_D[EP],-1, D_D[LOC],$A46),0)","v":318},0.59107806691449816,{"$f":"IFERROR(SUMIFS(D_D[INV],D_D[MT],2,D_D[CAT],TA_25,D_D[EP],-1, D_D[LOC],$A46),0)","v":112},{"$f":"IFERROR(SUMIFS(D_D[INV],D_D[MT],2,D_D[CAT],TA_26,D_D[EP],-1, D_D[LOC],$A46),0)","v":3},{"$f":"IFERROR(SUMIFS(D_D[INV],D_D[MT],7,D_D[CAT],2,D_D[EP],TA_20, D_D[LOC],$A46),0)","v":8}]
["333","Des Moines",{"$f":"IFERROR(SUMIFS(D_D[INV],D_D[MT],1,D_D[CAT],TA_20,D_D[EP],-1, D_D[LOC],$A47),0)","v":1055},{"$f":"IFERROR(SUMIFS(D_D[ADP],D_D[MT],1,D_D[CAT],D$1,D_D[EP],-1, D_D[LOC],$A47),0)","v":69.819999999999993},{"$f":"IFERROR(SUMIFS(D_D[INV],D_D[MT],2,D_D[CAT],TA_21,D_D[EP],-1, D_D[LOC],$A47),0)","v":5871},{"$f":"IFERROR(SUMIFS(D_D[BL],D_D[MT],2,D_D[CAT],TA_21,D_D[EP],-1, D_D[LOC],$A47),0)","v":1661},0.28291602793391246,{"$f":"IFERROR(SUMIFS(D_D[INV],D_D[MT],2,D_D[CAT],TA_22,D_D[EP],-1, D_D[LOC],$A47),0)","v":1648},{"$f":"IFERROR(SUMIFS(D_D[BL],D_D[MT],2,D_D[CAT],TA_22,D_D[EP],-1, D_D[LOC],$A47),0)","v":472},0.28640776699029125,{"$f":"IFERROR(SUMIFS(D_D[INV],D_D[MT],2,D_D[CAT],TA_23,D_D[EP],-1, D_D[LOC],$A47),0)","v":101},{"$f":"IFERROR(SUMIFS(D_D[BL],D_D[MT],2,D_D[CAT],TA_23,D_D[EP],-1, D_D[LOC],$A47),0)","v":5},4.9504950495049507E-2,{"$f":"IFERROR(SUMIFS(D_D[INV],D_D[MT],2,D_D[CAT],TA_24,D_D[EP],-1, D_D[LOC],$A47),0)","v":327},{"$f":"IFERROR(SUMIFS(D_D[BL],D_D[MT],2,D_D[CAT],TA_24,D_D[EP],-1, D_D[LOC],$A47),0)","v":179},0.54740061162079512,{"$f":"IFERROR(SUMIFS(D_D[INV],D_D[MT],2,D_D[CAT],TA_25,D_D[EP],-1, D_D[LOC],$A47),0)","v":92},{"$f":"IFERROR(SUMIFS(D_D[INV],D_D[MT],2,D_D[CAT],TA_26,D_D[EP],-1, D_D[LOC],$A47),0)","v":9},{"$f":"IFERROR(SUMIFS(D_D[INV],D_D[MT],7,D_D[CAT],2,D_D[EP],TA_20, D_D[LOC],$A47),0)","v":0}]
["437","Fargo",{"$f":"IFERROR(SUMIFS(D_D[INV],D_D[MT],1,D_D[CAT],TA_20,D_D[EP],-1, D_D[LOC],$A48),0)","v":453},{"$f":"IFERROR(SUMIFS(D_D[ADP],D_D[MT],1,D_D[CAT],D$1,D_D[EP],-1, D_D[LOC],$A48),0)","v":73.47},{"$f":"IFERROR(SUMIFS(D_D[INV],D_D[MT],2,D_D[CAT],TA_21,D_D[EP],-1, D_D[LOC],$A48),0)","v":2491},{"$f":"IFERROR(SUMIFS(D_D[BL],D_D[MT],2,D_D[CAT],TA_21,D_D[EP],-1, D_D[LOC],$A48),0)","v":775},0.31112003211561623,{"$f":"IFERROR(SUMIFS(D_D[INV],D_D[MT],2,D_D[CAT],TA_22,D_D[EP],-1, D_D[LOC],$A48),0)","v":755},{"$f":"IFERROR(SUMIFS(D_D[BL],D_D[MT],2,D_D[CAT],TA_22,D_D[EP],-1, D_D[LOC],$A48),0)","v":217},0.28741721854304636,{"$f":"IFERROR(SUMIFS(D_D[INV],D_D[MT],2,D_D[CAT],TA_23,D_D[EP],-1, D_D[LOC],$A48),0)","v":39},{"$f":"IFERROR(SUMIFS(D_D[BL],D_D[MT],2,D_D[CAT],TA_23,D_D[EP],-1, D_D[LOC],$A48),0)","v":5},0.12820512820512819,{"$f":"IFERROR(SUMIFS(D_D[INV],D_D[MT],2,D_D[CAT],TA_24,D_D[EP],-1, D_D[LOC],$A48),0)","v":97},{"$f":"IFERROR(SUMIFS(D_D[BL],D_D[MT],2,D_D[CAT],TA_24,D_D[EP],-1, D_D[LOC],$A48),0)","v":59},0.60824742268041232,{"$f":"IFERROR(SUMIFS(D_D[INV],D_D[MT],2,D_D[CAT],TA_25,D_D[EP],-1, D_D[LOC],$A48),0)","v":25},{"$f":"IFERROR(SUMIFS(D_D[INV],D_D[MT],2,D_D[CAT],TA_26,D_D[EP],-1, D_D[LOC],$A48),0)","v":2},{"$f":"IFERROR(SUMIFS(D_D[INV],D_D[MT],7,D_D[CAT],2,D_D[EP],TA_20, D_D[LOC],$A48),0)","v":0}]
["436","Fort Harrison ",{"$f":"IFERROR(SUMIFS(D_D[INV],D_D[MT],1,D_D[CAT],TA_20,D_D[EP],-1, D_D[LOC],$A49),0)","v":562},{"$f":"IFERROR(SUMIFS(D_D[ADP],D_D[MT],1,D_D[CAT],D$1,D_D[EP],-1, D_D[LOC],$A49),0)","v":65.16},{"$f":"IFERROR(SUMIFS(D_D[INV],D_D[MT],2,D_D[CAT],TA_21,D_D[EP],-1, D_D[LOC],$A49),0)","v":3462},{"$f":"IFERROR(SUMIFS(D_D[BL],D_D[MT],2,D_D[CAT],TA_21,D_D[EP],-1, D_D[LOC],$A49),0)","v":961},0.27758521086077415,{"$f":"IFERROR(SUMIFS(D_D[INV],D_D[MT],2,D_D[CAT],TA_22,D_D[EP],-1, D_D[LOC],$A49),0)","v":921},{"$f":"IFERROR(SUMIFS(D_D[BL],D_D[MT],2,D_D[CAT],TA_22,D_D[EP],-1, D_D[LOC],$A49),0)","v":232},0.25190010857763301,{"$f":"IFERROR(SUMIFS(D_D[INV],D_D[MT],2,D_D[CAT],TA_23,D_D[EP],-1, D_D[LOC],$A49),0)","v":39},{"$f":"IFERROR(SUMIFS(D_D[BL],D_D[MT],2,D_D[CAT],TA_23,D_D[EP],-1, D_D[LOC],$A49),0)","v":14},0.35897435897435898,{"$f":"IFERROR(SUMIFS(D_D[INV],D_D[MT],2,D_D[CAT],TA_24,D_D[EP],-1, D_D[LOC],$A49),0)","v":197},{"$f":"IFERROR(SUMIFS(D_D[BL],D_D[MT],2,D_D[CAT],TA_24,D_D[EP],-1, D_D[LOC],$A49),0)","v":105},0.53299492385786806,{"$f":"IFERROR(SUMIFS(D_D[INV],D_D[MT],2,D_D[CAT],TA_25,D_D[EP],-1, D_D[LOC],$A49),0)","v":27},{"$f":"IFERROR(SUMIFS(D_D[INV],D_D[MT],2,D_D[CAT],TA_26,D_D[EP],-1, D_D[LOC],$A49),0)","v":5},{"$f":"IFERROR(SUMIFS(D_D[INV],D_D[MT],7,D_D[CAT],2,D_D[EP],TA_20, D_D[LOC],$A49),0)","v":0}]
["362","Houston",{"$f":"IFERROR(SUMIFS(D_D[INV],D_D[MT],1,D_D[CAT],TA_20,D_D[EP],-1, D_D[LOC],$A50),0)","v":8533},{"$f":"IFERROR(SUMIFS(D_D[ADP],D_D[MT],1,D_D[CAT],D$1,D_D[EP],-1, D_D[LOC],$A50),0)","v":67.819999999999993},{"$f":"IFERROR(SUMIFS(D_D[INV],D_D[MT],2,D_D[CAT],TA_21,D_D[EP],-1, D_D[LOC],$A50),0)","v":42011},{"$f":"IFERROR(SUMIFS(D_D[BL],D_D[MT],2,D_D[CAT],TA_21,D_D[EP],-1, D_D[LOC],$A50),0)","v":10572},0.25164837780581278,{"$f":"IFERROR(SUMIFS(D_D[INV],D_D[MT],2,D_D[CAT],TA_22,D_D[EP],-1, D_D[LOC],$A50),0)","v":10987},{"$f":"IFERROR(SUMIFS(D_D[BL],D_D[MT],2,D_D[CAT],TA_22,D_D[EP],-1, D_D[LOC],$A50),0)","v":2262},0.20587967598070447,{"$f":"IFERROR(SUMIFS(D_D[INV],D_D[MT],2,D_D[CAT],TA_23,D_D[EP],-1, D_D[LOC],$A50),0)","v":552},{"$f":"IFERROR(SUMIFS(D_D[BL],D_D[MT],2,D_D[CAT],TA_23,D_D[EP],-1, D_D[LOC],$A50),0)","v":95},0.17210144927536231,{"$f":"IFERROR(SUMIFS(D_D[INV],D_D[MT],2,D_D[CAT],TA_24,D_D[EP],-1, D_D[LOC],$A50),0)","v":2294},{"$f":"IFERROR(SUMIFS(D_D[BL],D_D[MT],2,D_D[CAT],TA_24,D_D[EP],-1, D_D[LOC],$A50),0)","v":908},0.39581517000871841,{"$f":"IFERROR(SUMIFS(D_D[INV],D_D[MT],2,D_D[CAT],TA_25,D_D[EP],-1, D_D[LOC],$A50),0)","v":184},{"$f":"IFERROR(SUMIFS(D_D[INV],D_D[MT],2,D_D[CAT],TA_26,D_D[EP],-1, D_D[LOC],$A50),0)","v":7},{"$f":"IFERROR(SUMIFS(D_D[INV],D_D[MT],7,D_D[CAT],2,D_D[EP],TA_20, D_D[LOC],$A50),0)","v":1}]
["334","Lincoln",{"$f":"IFERROR(SUMIFS(D_D[INV],D_D[MT],1,D_D[CAT],TA_20,D_D[EP],-1, D_D[LOC],$A51),0)","v":2051},{"$f":"IFERROR(SUMIFS(D_D[ADP],D_D[MT],1,D_D[CAT],D$1,D_D[EP],-1, D_D[LOC],$A51),0)","v":49.38},{"$f":"IFERROR(SUMIFS(D_D[INV],D_D[MT],2,D_D[CAT],TA_21,D_D[EP],-1, D_D[LOC],$A51),0)","v":5157},{"$f":"IFERROR(SUMIFS(D_D[BL],D_D[MT],2,D_D[CAT],TA_21,D_D[EP],-1, D_D[LOC],$A51),0)","v":1394},0.27031219701376769,{"$f":"IFERROR(SUMIFS(D_D[INV],D_D[MT],2,D_D[CAT],TA_22,D_D[EP],-1, D_D[LOC],$A51),0)","v":2801},{"$f":"IFERROR(SUMIFS(D_D[BL],D_D[MT],2,D_D[CAT],TA_22,D_D[EP],-1, D_D[LOC],$A51),0)","v":487},0.17386647625847912,{"$f":"IFERROR(SUMIFS(D_D[INV],D_D[MT],2,D_D[CAT],TA_23,D_D[EP],-1, D_D[LOC],$A51),0)","v":106},{"$f":"IFERROR(SUMIFS(D_D[BL],D_D[MT],2,D_D[CAT],TA_23,D_D[EP],-1, D_D[LOC],$A51),0)","v":6},5.6603773584905662E-2,{"$f":"IFERROR(SUMIFS(D_D[INV],D_D[MT],2,D_D[CAT],TA_24,D_D[EP],-1, D_D[LOC],$A51),0)","v":359},{"$f":"IFERROR(SUMIFS(D_D[BL],D_D[MT],2,D_D[CAT],TA_24,D_D[EP],-1, D_D[LOC],$A51),0)","v":176},0.49025069637883006,{"$f":"IFERROR(SUMIFS(D_D[INV],D_D[MT],2,D_D[CAT],TA_25,D_D[EP],-1, D_D[LOC],$A51),0)","v":80},{"$f":"IFERROR(SUMIFS(D_D[INV],D_D[MT],2,D_D[CAT],TA_26,D_D[EP],-1, D_D[LOC],$A51),0)","v":8},{"$f":"IFERROR(SUMIFS(D_D[INV],D_D[MT],7,D_D[CAT],2,D_D[EP],TA_20, D_D[LOC],$A51),0)","v":0}]
["351","Muskogee",{"$f":"IFERROR(SUMIFS(D_D[INV],D_D[MT],1,D_D[CAT],TA_20,D_D[EP],-1, D_D[LOC],$A52),0)","v":3316},{"$f":"IFERROR(SUMIFS(D_D[ADP],D_D[MT],1,D_D[CAT],D$1,D_D[EP],-1, D_D[LOC],$A52),0)","v":71.69},{"$f":"IFERROR(SUMIFS(D_D[INV],D_D[MT],2,D_D[CAT],TA_21,D_D[EP],-1, D_D[LOC],$A52),0)","v":13553},{"$f":"IFERROR(SUMIFS(D_D[BL],D_D[MT],2,D_D[CAT],TA_21,D_D[EP],-1, D_D[LOC],$A52),0)","v":3419},0.25226887036080575,{"$f":"IFERROR(SUMIFS(D_D[INV],D_D[MT],2,D_D[CAT],TA_22,D_D[EP],-1, D_D[LOC],$A52),0)","v":12973},{"$f":"IFERROR(SUMIFS(D_D[BL],D_D[MT],2,D_D[CAT],TA_22,D_D[EP],-1, D_D[LOC],$A52),0)","v":4711},0.36313882679411086,{"$f":"IFERROR(SUMIFS(D_D[INV],D_D[MT],2,D_D[CAT],TA_23,D_D[EP],-1, D_D[LOC],$A52),0)","v":270},{"$f":"IFERROR(SUMIFS(D_D[BL],D_D[MT],2,D_D[CAT],TA_23,D_D[EP],-1, D_D[LOC],$A52),0)","v":31},0.11481481481481481,{"$f":"IFERROR(SUMIFS(D_D[INV],D_D[MT],2,D_D[CAT],TA_24,D_D[EP],-1, D_D[LOC],$A52),0)","v":966},{"$f":"IFERROR(SUMIFS(D_D[BL],D_D[MT],2,D_D[CAT],TA_24,D_D[EP],-1, D_D[LOC],$A52),0)","v":401},0.41511387163561075,{"$f":"IFERROR(SUMIFS(D_D[INV],D_D[MT],2,D_D[CAT],TA_25,D_D[EP],-1, D_D[LOC],$A52),0)","v":174},{"$f":"IFERROR(SUMIFS(D_D[INV],D_D[MT],2,D_D[CAT],TA_26,D_D[EP],-1, D_D[LOC],$A52),0)","v":14},{"$f":"IFERROR(SUMIFS(D_D[INV],D_D[MT],7,D_D[CAT],2,D_D[EP],TA_20, D_D[LOC],$A52),0)","v":14}]
["438","Sioux Falls",{"$f":"IFERROR(SUMIFS(D_D[INV],D_D[MT],1,D_D[CAT],TA_20,D_D[EP],-1, D_D[LOC],$A53),0)","v":407},{"$f":"IFERROR(SUMIFS(D_D[ADP],D_D[MT],1,D_D[CAT],D$1,D_D[EP],-1, D_D[LOC],$A53),0)","v":61.3},{"$f":"IFERROR(SUMIFS(D_D[INV],D_D[MT],2,D_D[CAT],TA_21,D_D[EP],-1, D_D[LOC],$A53),0)","v":2494},{"$f":"IFERROR(SUMIFS(D_D[BL],D_D[MT],2,D_D[CAT],TA_21,D_D[EP],-1, D_D[LOC],$A53),0)","v":751},0.30112269446672013,{"$f":"IFERROR(SUMIFS(D_D[INV],D_D[MT],2,D_D[CAT],TA_22,D_D[EP],-1, D_D[LOC],$A53),0)","v":809},{"$f":"IFERROR(SUMIFS(D_D[BL],D_D[MT],2,D_D[CAT],TA_22,D_D[EP],-1, D_D[LOC],$A53),0)","v":254},0.31396786155747836,{"$f":"IFERROR(SUMIFS(D_D[INV],D_D[MT],2,D_D[CAT],TA_23,D_D[EP],-1, D_D[LOC],$A53),0)","v":42},{"$f":"IFERROR(SUMIFS(D_D[BL],D_D[MT],2,D_D[CAT],TA_23,D_D[EP],-1, D_D[LOC],$A53),0)","v":4},9.5238095238095233E-2,{"$f":"IFERROR(SUMIFS(D_D[INV],D_D[MT],2,D_D[CAT],TA_24,D_D[EP],-1, D_D[LOC],$A53),0)","v":125},{"$f":"IFERROR(SUMIFS(D_D[BL],D_D[MT],2,D_D[CAT],TA_24,D_D[EP],-1, D_D[LOC],$A53),0)","v":77},0.61599999999999999,{"$f":"IFERROR(SUMIFS(D_D[INV],D_D[MT],2,D_D[CAT],TA_25,D_D[EP],-1, D_D[LOC],$A53),0)","v":38},{"$f":"IFERROR(SUMIFS(D_D[INV],D_D[MT],2,D_D[CAT],TA_26,D_D[EP],-1, D_D[LOC],$A53),0)","v":3},{"$f":"IFERROR(SUMIFS(D_D[INV],D_D[MT],7,D_D[CAT],2,D_D[EP],TA_20, D_D[LOC],$A53),0)","v":0}]
["335","St. Paul",{"$f":"IFERROR(SUMIFS(D_D[INV],D_D[MT],1,D_D[CAT],TA_20,D_D[EP],-1, D_D[LOC],$A54),0)","v":5477},{"$f":"IFERROR(SUMIFS(D_D[ADP],D_D[MT],1,D_D[CAT],D$1,D_D[EP],-1, D_D[LOC],$A54),0)","v":69.489999999999995},{"$f":"IFERROR(SUMIFS(D_D[INV],D_D[MT],2,D_D[CAT],TA_21,D_D[EP],-1, D_D[LOC],$A54),0)","v":12980},{"$f":"IFERROR(SUMIFS(D_D[BL],D_D[MT],2,D_D[CAT],TA_21,D_D[EP],-1, D_D[LOC],$A54),0)","v":3923},0.30223420647149463,{"$f":"IFERROR(SUMIFS(D_D[INV],D_D[MT],2,D_D[CAT],TA_22,D_D[EP],-1, D_D[LOC],$A54),0)","v":28660},{"$f":"IFERROR(SUMIFS(D_D[BL],D_D[MT],2,D_D[CAT],TA_22,D_D[EP],-1, D_D[LOC],$A54),0)","v":15441},0.538764829030007,{"$f":"IFERROR(SUMIFS(D_D[INV],D_D[MT],2,D_D[CAT],TA_23,D_D[EP],-1, D_D[LOC],$A54),0)","v":608},{"$f":"IFERROR(SUMIFS(D_D[BL],D_D[MT],2,D_D[CAT],TA_23,D_D[EP],-1, D_D[LOC],$A54),0)","v":28},4.6052631578947366E-2,{"$f":"IFERROR(SUMIFS(D_D[INV],D_D[MT],2,D_D[CAT],TA_24,D_D[EP],-1, D_D[LOC],$A54),0)","v":1522},{"$f":"IFERROR(SUMIFS(D_D[BL],D_D[MT],2,D_D[CAT],TA_24,D_D[EP],-1, D_D[LOC],$A54),0)","v":898},0.59001314060446786,{"$f":"IFERROR(SUMIFS(D_D[INV],D_D[MT],2,D_D[CAT],TA_25,D_D[EP],-1, D_D[LOC],$A54),0)","v":844},{"$f":"IFERROR(SUMIFS(D_D[INV],D_D[MT],2,D_D[CAT],TA_26,D_D[EP],-1, D_D[LOC],$A54),0)","v":0},{"$f":"IFERROR(SUMIFS(D_D[INV],D_D[MT],7,D_D[CAT],2,D_D[EP],TA_20, D_D[LOC],$A54),0)","v":218}]
["349","Waco",{"$f":"IFERROR(SUMIFS(D_D[INV],D_D[MT],1,D_D[CAT],TA_20,D_D[EP],-1, D_D[LOC],$A55),0)","v":8994},{"$f":"IFERROR(SUMIFS(D_D[ADP],D_D[MT],1,D_D[CAT],D$1,D_D[EP],-1, D_D[LOC],$A55),0)","v":63.61},{"$f":"IFERROR(SUMIFS(D_D[INV],D_D[MT],2,D_D[CAT],TA_21,D_D[EP],-1, D_D[LOC],$A55),0)","v":45425},{"$f":"IFERROR(SUMIFS(D_D[BL],D_D[MT],2,D_D[CAT],TA_21,D_D[EP],-1, D_D[LOC],$A55),0)","v":11846},0.26078150798018712,{"$f":"IFERROR(SUMIFS(D_D[INV],D_D[MT],2,D_D[CAT],TA_22,D_D[EP],-1, D_D[LOC],$A55),0)","v":12537},{"$f":"IFERROR(SUMIFS(D_D[BL],D_D[MT],2,D_D[CAT],TA_22,D_D[EP],-1, D_D[LOC],$A55),0)","v":2663},0.21241126266251895,{"$f":"IFERROR(SUMIFS(D_D[INV],D_D[MT],2,D_D[CAT],TA_23,D_D[EP],-1, D_D[LOC],$A55),0)","v":605},{"$f":"IFERROR(SUMIFS(D_D[BL],D_D[MT],2,D_D[CAT],TA_23,D_D[EP],-1, D_D[LOC],$A55),0)","v":107},0.17685950413223139,{"$f":"IFERROR(SUMIFS(D_D[INV],D_D[MT],2,D_D[CAT],TA_24,D_D[EP],-1, D_D[LOC],$A55),0)","v":2650},{"$f":"IFERROR(SUMIFS(D_D[BL],D_D[MT],2,D_D[CAT],TA_24,D_D[EP],-1, D_D[LOC],$A55),0)","v":1615},0.60943396226415092,{"$f":"IFERROR(SUMIFS(D_D[INV],D_D[MT],2,D_D[CAT],TA_25,D_D[EP],-1, D_D[LOC],$A55),0)","v":242},{"$f":"IFERROR(SUMIFS(D_D[INV],D_D[MT],2,D_D[CAT],TA_26,D_D[EP],-1, D_D[LOC],$A55),0)","v":78},{"$f":"IFERROR(SUMIFS(D_D[INV],D_D[MT],7,D_D[CAT],2,D_D[EP],TA_20, D_D[LOC],$A55),0)","v":4}]
["452","Wichita",{"$f":"IFERROR(SUMIFS(D_D[INV],D_D[MT],1,D_D[CAT],TA_20,D_D[EP],-1, D_D[LOC],$A56),0)","v":1257},{"$f":"IFERROR(SUMIFS(D_D[ADP],D_D[MT],1,D_D[CAT],D$1,D_D[EP],-1, D_D[LOC],$A56),0)","v":66.38},{"$f":"IFERROR(SUMIFS(D_D[INV],D_D[MT],2,D_D[CAT],TA_21,D_D[EP],-1, D_D[LOC],$A56),0)","v":7086},{"$f":"IFERROR(SUMIFS(D_D[BL],D_D[MT],2,D_D[CAT],TA_21,D_D[EP],-1, D_D[LOC],$A56),0)","v":2121},0.2993226079593565,{"$f":"IFERROR(SUMIFS(D_D[INV],D_D[MT],2,D_D[CAT],TA_22,D_D[EP],-1, D_D[LOC],$A56),0)","v":1919},{"$f":"IFERROR(SUMIFS(D_D[BL],D_D[MT],2,D_D[CAT],TA_22,D_D[EP],-1, D_D[LOC],$A56),0)","v":493},0.2569046378322043,{"$f":"IFERROR(SUMIFS(D_D[INV],D_D[MT],2,D_D[CAT],TA_23,D_D[EP],-1, D_D[LOC],$A56),0)","v":105},{"$f":"IFERROR(SUMIFS(D_D[BL],D_D[MT],2,D_D[CAT],TA_23,D_D[EP],-1, D_D[LOC],$A56),0)","v":8},7.6190476190476197E-2,{"$f":"IFERROR(SUMIFS(D_D[INV],D_D[MT],2,D_D[CAT],TA_24,D_D[EP],-1, D_D[LOC],$A56),0)","v":223},{"$f":"IFERROR(SUMIFS(D_D[BL],D_D[MT],2,D_D[CAT],TA_24,D_D[EP],-1, D_D[LOC],$A56),0)","v":130},0.5829596412556054,{"$f":"IFERROR(SUMIFS(D_D[INV],D_D[MT],2,D_D[CAT],TA_25,D_D[EP],-1, D_D[LOC],$A56),0)","v":69},{"$f":"IFERROR(SUMIFS(D_D[INV],D_D[MT],2,D_D[CAT],TA_26,D_D[EP],-1, D_D[LOC],$A56),0)","v":5},{"$f":"IFERROR(SUMIFS(D_D[INV],D_D[MT],7,D_D[CAT],2,D_D[EP],TA_20, D_D[LOC],$A56),0)","v":0}]
[395,"Pacific",{"$f":"IFERROR(SUMIFS(D_D[INV],D_D[MT],1,D_D[CAT],TA_20,D_D[EP],-1, D_D[LOC],$A57),0)","v":31671},{"$f":"IFERROR(SUMIFS(D_D[ADP],D_D[MT],1,D_D[CAT],D$1,D_D[EP],-1, D_D[LOC],$A57),0)","v":64.900000000000006},{"$f":"IFERROR(SUMIFS(D_D[INV],D_D[MT],2,D_D[CAT],TA_21,D_D[EP],-1, D_D[LOC],$A57),0)","v":147419},{"$f":"IFERROR(SUMIFS(D_D[BL],D_D[MT],2,D_D[CAT],TA_21,D_D[EP],-1, D_D[LOC],$A57),0)","v":41776},0.28338273899565186,{"$f":"IFERROR(SUMIFS(D_D[INV],D_D[MT],2,D_D[CAT],TA_22,D_D[EP],-1, D_D[LOC],$A57),0)","v":54437},{"$f":"IFERROR(SUMIFS(D_D[BL],D_D[MT],2,D_D[CAT],TA_22,D_D[EP],-1, D_D[LOC],$A57),0)","v":14685},0.26976137553502216,{"$f":"IFERROR(SUMIFS(D_D[INV],D_D[MT],2,D_D[CAT],TA_23,D_D[EP],-1, D_D[LOC],$A57),0)","v":2364},{"$f":"IFERROR(SUMIFS(D_D[BL],D_D[MT],2,D_D[CAT],TA_23,D_D[EP],-1, D_D[LOC],$A57),0)","v":357},0.15101522842639595,{"$f":"IFERROR(SUMIFS(D_D[INV],D_D[MT],2,D_D[CAT],TA_24,D_D[EP],-1, D_D[LOC],$A57),0)","v":11189},{"$f":"IFERROR(SUMIFS(D_D[BL],D_D[MT],2,D_D[CAT],TA_24,D_D[EP],-1, D_D[LOC],$A57),0)","v":5084},0.45437483242470283,{"$f":"IFERROR(SUMIFS(D_D[INV],D_D[MT],2,D_D[CAT],TA_25,D_D[EP],-1, D_D[LOC],$A57),0)","v":1120},{"$f":"IFERROR(SUMIFS(D_D[INV],D_D[MT],2,D_D[CAT],TA_26,D_D[EP],-1, D_D[LOC],$A57),0)","v":168},{"$f":"IFERROR(SUMIFS(D_D[INV],D_D[MT],7,D_D[CAT],2,D_D[EP],TA_20, D_D[LOC],$A57),0)","v":261}]
["340","Albuquerque",{"$f":"IFERROR(SUMIFS(D_D[INV],D_D[MT],1,D_D[CAT],TA_20,D_D[EP],-1, D_D[LOC],$A58),0)","v":1073},{"$f":"IFERROR(SUMIFS(D_D[ADP],D_D[MT],1,D_D[CAT],D$1,D_D[EP],-1, D_D[LOC],$A58),0)","v":61.8},{"$f":"IFERROR(SUMIFS(D_D[INV],D_D[MT],2,D_D[CAT],TA_21,D_D[EP],-1, D_D[LOC],$A58),0)","v":5790},{"$f":"IFERROR(SUMIFS(D_D[BL],D_D[MT],2,D_D[CAT],TA_21,D_D[EP],-1, D_D[LOC],$A58),0)","v":1721},0.29723661485319519,{"$f":"IFERROR(SUMIFS(D_D[INV],D_D[MT],2,D_D[CAT],TA_22,D_D[EP],-1, D_D[LOC],$A58),0)","v":1494},{"$f":"IFERROR(SUMIFS(D_D[BL],D_D[MT],2,D_D[CAT],TA_22,D_D[EP],-1, D_D[LOC],$A58),0)","v":291},0.19477911646586346,{"$f":"IFERROR(SUMIFS(D_D[INV],D_D[MT],2,D_D[CAT],TA_23,D_D[EP],-1, D_D[LOC],$A58),0)","v":117},{"$f":"IFERROR(SUMIFS(D_D[BL],D_D[MT],2,D_D[CAT],TA_23,D_D[EP],-1, D_D[LOC],$A58),0)","v":10},8.5470085470085472E-2,{"$f":"IFERROR(SUMIFS(D_D[INV],D_D[MT],2,D_D[CAT],TA_24,D_D[EP],-1, D_D[LOC],$A58),0)","v":200},{"$f":"IFERROR(SUMIFS(D_D[BL],D_D[MT],2,D_D[CAT],TA_24,D_D[EP],-1, D_D[LOC],$A58),0)","v":138},0.69,{"$f":"IFERROR(SUMIFS(D_D[INV],D_D[MT],2,D_D[CAT],TA_25,D_D[EP],-1, D_D[LOC],$A58),0)","v":48},{"$f":"IFERROR(SUMIFS(D_D[INV],D_D[MT],2,D_D[CAT],TA_26,D_D[EP],-1, D_D[LOC],$A58),0)","v":9},{"$f":"IFERROR(SUMIFS(D_D[INV],D_D[MT],7,D_D[CAT],2,D_D[EP],TA_20, D_D[LOC],$A58),0)","v":3}]
["463","Anchorage",{"$f":"IFERROR(SUMIFS(D_D[INV],D_D[MT],1,D_D[CAT],TA_20,D_D[EP],-1, D_D[LOC],$A59),0)","v":676},{"$f":"IFERROR(SUMIFS(D_D[ADP],D_D[MT],1,D_D[CAT],D$1,D_D[EP],-1, D_D[LOC],$A59),0)","v":66.709999999999994},{"$f":"IFERROR(SUMIFS(D_D[INV],D_D[MT],2,D_D[CAT],TA_21,D_D[EP],-1, D_D[LOC],$A59),0)","v":2587},{"$f":"IFERROR(SUMIFS(D_D[BL],D_D[MT],2,D_D[CAT],TA_21,D_D[EP],-1, D_D[LOC],$A59),0)","v":772},0.29841515268650948,{"$f":"IFERROR(SUMIFS(D_D[INV],D_D[MT],2,D_D[CAT],TA_22,D_D[EP],-1, D_D[LOC],$A59),0)","v":963},{"$f":"IFERROR(SUMIFS(D_D[BL],D_D[MT],2,D_D[CAT],TA_22,D_D[EP],-1, D_D[LOC],$A59),0)","v":216},0.22429906542056074,{"$f":"IFERROR(SUMIFS(D_D[INV],D_D[MT],2,D_D[CAT],TA_23,D_D[EP],-1, D_D[LOC],$A59),0)","v":22},{"$f":"IFERROR(SUMIFS(D_D[BL],D_D[MT],2,D_D[CAT],TA_23,D_D[EP],-1, D_D[LOC],$A59),0)","v":3},0.13636363636363635,{"$f":"IFERROR(SUMIFS(D_D[INV],D_D[MT],2,D_D[CAT],TA_24,D_D[EP],-1, D_D[LOC],$A59),0)","v":127},{"$f":"IFERROR(SUMIFS(D_D[BL],D_D[MT],2,D_D[CAT],TA_24,D_D[EP],-1, D_D[LOC],$A59),0)","v":62},0.48818897637795278,{"$f":"IFERROR(SUMIFS(D_D[INV],D_D[MT],2,D_D[CAT],TA_25,D_D[EP],-1, D_D[LOC],$A59),0)","v":12},{"$f":"IFERROR(SUMIFS(D_D[INV],D_D[MT],2,D_D[CAT],TA_26,D_D[EP],-1, D_D[LOC],$A59),0)","v":5},{"$f":"IFERROR(SUMIFS(D_D[INV],D_D[MT],7,D_D[CAT],2,D_D[EP],TA_20, D_D[LOC],$A59),0)","v":1}]
["347","Boise",{"$f":"IFERROR(SUMIFS(D_D[INV],D_D[MT],1,D_D[CAT],TA_20,D_D[EP],-1, D_D[LOC],$A60),0)","v":808},{"$f":"IFERROR(SUMIFS(D_D[ADP],D_D[MT],1,D_D[CAT],D$1,D_D[EP],-1, D_D[LOC],$A60),0)","v":72.38},{"$f":"IFERROR(SUMIFS(D_D[INV],D_D[MT],2,D_D[CAT],TA_21,D_D[EP],-1, D_D[LOC],$A60),0)","v":4312},{"$f":"IFERROR(SUMIFS(D_D[BL],D_D[MT],2,D_D[CAT],TA_21,D_D[EP],-1, D_D[LOC],$A60),0)","v":1160},0.26901669758812619,{"$f":"IFERROR(SUMIFS(D_D[INV],D_D[MT],2,D_D[CAT],TA_22,D_D[EP],-1, D_D[LOC],$A60),0)","v":1194},{"$f":"IFERROR(SUMIFS(D_D[BL],D_D[MT],2,D_D[CAT],TA_22,D_D[EP],-1, D_D[LOC],$A60),0)","v":349},0.29229480737018426,{"$f":"IFERROR(SUMIFS(D_D[INV],D_D[MT],2,D_D[CAT],TA_23,D_D[EP],-1, D_D[LOC],$A60),0)","v":66},{"$f":"IFERROR(SUMIFS(D_D[BL],D_D[MT],2,D_D[CAT],TA_23,D_D[EP],-1, D_D[LOC],$A60),0)","v":8},0.12121212121212122,{"$f":"IFERROR(SUMIFS(D_D[INV],D_D[MT],2,D_D[CAT],TA_24,D_D[EP],-1, D_D[LOC],$A60),0)","v":174},{"$f":"IFERROR(SUMIFS(D_D[BL],D_D[MT],2,D_D[CAT],TA_24,D_D[EP],-1, D_D[LOC],$A60),0)","v":115},0.66091954022988508,{"$f":"IFERROR(SUMIFS(D_D[INV],D_D[MT],2,D_D[CAT],TA_25,D_D[EP],-1, D_D[LOC],$A60),0)","v":49},{"$f":"IFERROR(SUMIFS(D_D[INV],D_D[MT],2,D_D[CAT],TA_26,D_D[EP],-1, D_D[LOC],$A60),0)","v":3},{"$f":"IFERROR(SUMIFS(D_D[INV],D_D[MT],7,D_D[CAT],2,D_D[EP],TA_20, D_D[LOC],$A60),0)","v":1}]
["459","Honolulu",{"$f":"IFERROR(SUMIFS(D_D[INV],D_D[MT],1,D_D[CAT],TA_20,D_D[EP],-1, D_D[LOC],$A61),0)","v":1253},{"$f":"IFERROR(SUMIFS(D_D[ADP],D_D[MT],1,D_D[CAT],D$1,D_D[EP],-1, D_D[LOC],$A61),0)","v":63.34},{"$f":"IFERROR(SUMIFS(D_D[INV],D_D[MT],2,D_D[CAT],TA_21,D_D[EP],-1, D_D[LOC],$A61),0)","v":7209},{"$f":"IFERROR(SUMIFS(D_D[BL],D_D[MT],2,D_D[CAT],TA_21,D_D[EP],-1, D_D[LOC],$A61),0)","v":2222},0.30822582882507976,{"$f":"IFERROR(SUMIFS(D_D[INV],D_D[MT],2,D_D[CAT],TA_22,D_D[EP],-1, D_D[LOC],$A61),0)","v":1917},{"$f":"IFERROR(SUMIFS(D_D[BL],D_D[MT],2,D_D[CAT],TA_22,D_D[EP],-1, D_D[LOC],$A61),0)","v":505},0.26343244653103809,{"$f":"IFERROR(SUMIFS(D_D[INV],D_D[MT],2,D_D[CAT],TA_23,D_D[EP],-1, D_D[LOC],$A61),0)","v":39},{"$f":"IFERROR(SUMIFS(D_D[BL],D_D[MT],2,D_D[CAT],TA_23,D_D[EP],-1, D_D[LOC],$A61),0)","v":11},0.28205128205128205,{"$f":"IFERROR(SUMIFS(D_D[INV],D_D[MT],2,D_D[CAT],TA_24,D_D[EP],-1, D_D[LOC],$A61),0)","v":303},{"$f":"IFERROR(SUMIFS(D_D[BL],D_D[MT],2,D_D[CAT],TA_24,D_D[EP],-1, D_D[LOC],$A61),0)","v":186},0.61386138613861385,{"$f":"IFERROR(SUMIFS(D_D[INV],D_D[MT],2,D_D[CAT],TA_25,D_D[EP],-1, D_D[LOC],$A61),0)","v":38},{"$f":"IFERROR(SUMIFS(D_D[INV],D_D[MT],2,D_D[CAT],TA_26,D_D[EP],-1, D_D[LOC],$A61),0)","v":0},{"$f":"IFERROR(SUMIFS(D_D[INV],D_D[MT],7,D_D[CAT],2,D_D[EP],TA_20, D_D[LOC],$A61),0)","v":0}]
["344","Los Angeles",{"$f":"IFERROR(SUMIFS(D_D[INV],D_D[MT],1,D_D[CAT],TA_20,D_D[EP],-1, D_D[LOC],$A62),0)","v":3696},{"$f":"IFERROR(SUMIFS(D_D[ADP],D_D[MT],1,D_D[CAT],D$1,D_D[EP],-1, D_D[LOC],$A62),0)","v":63.8},{"$f":"IFERROR(SUMIFS(D_D[INV],D_D[MT],2,D_D[CAT],TA_21,D_D[EP],-1, D_D[LOC],$A62),0)","v":21314},{"$f":"IFERROR(SUMIFS(D_D[BL],D_D[MT],2,D_D[CAT],TA_21,D_D[EP],-1, D_D[LOC],$A62),0)","v":5998},0.28141127897156798,{"$f":"IFERROR(SUMIFS(D_D[INV],D_D[MT],2,D_D[CAT],TA_22,D_D[EP],-1, D_D[LOC],$A62),0)","v":5162},{"$f":"IFERROR(SUMIFS(D_D[BL],D_D[MT],2,D_D[CAT],TA_22,D_D[EP],-1, D_D[LOC],$A62),0)","v":1222},0.23672994963192562,{"$f":"IFERROR(SUMIFS(D_D[INV],D_D[MT],2,D_D[CAT],TA_23,D_D[EP],-1, D_D[LOC],$A62),0)","v":387},{"$f":"IFERROR(SUMIFS(D_D[BL],D_D[MT],2,D_D[CAT],TA_23,D_D[EP],-1, D_D[LOC],$A62),0)","v":72},0.18604651162790697,{"$f":"IFERROR(SUMIFS(D_D[INV],D_D[MT],2,D_D[CAT],TA_24,D_D[EP],-1, D_D[LOC],$A62),0)","v":2034},{"$f":"IFERROR(SUMIFS(D_D[BL],D_D[MT],2,D_D[CAT],TA_24,D_D[EP],-1, D_D[LOC],$A62),0)","v":624},0.30678466076696165,{"$f":"IFERROR(SUMIFS(D_D[INV],D_D[MT],2,D_D[CAT],TA_25,D_D[EP],-1, D_D[LOC],$A62),0)","v":119},{"$f":"IFERROR(SUMIFS(D_D[INV],D_D[MT],2,D_D[CAT],TA_26,D_D[EP],-1, D_D[LOC],$A62),0)","v":6},{"$f":"IFERROR(SUMIFS(D_D[INV],D_D[MT],7,D_D[CAT],2,D_D[EP],TA_20, D_D[LOC],$A62),0)","v":4}]
["358","Manila",{"$f":"IFERROR(SUMIFS(D_D[INV],D_D[MT],1,D_D[CAT],TA_20,D_D[EP],-1, D_D[LOC],$A63),0)","v":324},{"$f":"IFERROR(SUMIFS(D_D[ADP],D_D[MT],1,D_D[CAT],D$1,D_D[EP],-1, D_D[LOC],$A63),0)","v":79.64},{"$f":"IFERROR(SUMIFS(D_D[INV],D_D[MT],2,D_D[CAT],TA_21,D_D[EP],-1, D_D[LOC],$A63),0)","v":958},{"$f":"IFERROR(SUMIFS(D_D[BL],D_D[MT],2,D_D[CAT],TA_21,D_D[EP],-1, D_D[LOC],$A63),0)","v":363},0.37891440501043844,{"$f":"IFERROR(SUMIFS(D_D[INV],D_D[MT],2,D_D[CAT],TA_22,D_D[EP],-1, D_D[LOC],$A63),0)","v":451},{"$f":"IFERROR(SUMIFS(D_D[BL],D_D[MT],2,D_D[CAT],TA_22,D_D[EP],-1, D_D[LOC],$A63),0)","v":91},0.20177383592017739,{"$f":"IFERROR(SUMIFS(D_D[INV],D_D[MT],2,D_D[CAT],TA_23,D_D[EP],-1, D_D[LOC],$A63),0)","v":9},{"$f":"IFERROR(SUMIFS(D_D[BL],D_D[MT],2,D_D[CAT],TA_23,D_D[EP],-1, D_D[LOC],$A63),0)","v":3},0.33333333333333331,{"$f":"IFERROR(SUMIFS(D_D[INV],D_D[MT],2,D_D[CAT],TA_24,D_D[EP],-1, D_D[LOC],$A63),0)","v":151},{"$f":"IFERROR(SUMIFS(D_D[BL],D_D[MT],2,D_D[CAT],TA_24,D_D[EP],-1, D_D[LOC],$A63),0)","v":71},0.47019867549668876,{"$f":"IFERROR(SUMIFS(D_D[INV],D_D[MT],2,D_D[CAT],TA_25,D_D[EP],-1, D_D[LOC],$A63),0)","v":30},{"$f":"IFERROR(SUMIFS(D_D[INV],D_D[MT],2,D_D[CAT],TA_26,D_D[EP],-1, D_D[LOC],$A63),0)","v":2},{"$f":"IFERROR(SUMIFS(D_D[INV],D_D[MT],7,D_D[CAT],2,D_D[EP],TA_20, D_D[LOC],$A63),0)","v":2}]
["343","Oakland",{"$f":"IFERROR(SUMIFS(D_D[INV],D_D[MT],1,D_D[CAT],TA_20,D_D[EP],-1, D_D[LOC],$A64),0)","v":3276},{"$f":"IFERROR(SUMIFS(D_D[ADP],D_D[MT],1,D_D[CAT],D$1,D_D[EP],-1, D_D[LOC],$A64),0)","v":63.34},{"$f":"IFERROR(SUMIFS(D_D[INV],D_D[MT],2,D_D[CAT],TA_21,D_D[EP],-1, D_D[LOC],$A64),0)","v":21352},{"$f":"IFERROR(SUMIFS(D_D[BL],D_D[MT],2,D_D[CAT],TA_21,D_D[EP],-1, D_D[LOC],$A64),0)","v":6016},0.28175346571749721,{"$f":"IFERROR(SUMIFS(D_D[INV],D_D[MT],2,D_D[CAT],TA_22,D_D[EP],-1, D_D[LOC],$A64),0)","v":5147},{"$f":"IFERROR(SUMIFS(D_D[BL],D_D[MT],2,D_D[CAT],TA_22,D_D[EP],-1, D_D[LOC],$A64),0)","v":1309},0.25432290654750339,{"$f":"IFERROR(SUMIFS(D_D[INV],D_D[MT],2,D_D[CAT],TA_23,D_D[EP],-1, D_D[LOC],$A64),0)","v":403},{"$f":"IFERROR(SUMIFS(D_D[BL],D_D[MT],2,D_D[CAT],TA_23,D_D[EP],-1, D_D[LOC],$A64),0)","v":49},0.12158808933002481,{"$f":"IFERROR(SUMIFS(D_D[INV],D_D[MT],2,D_D[CAT],TA_24,D_D[EP],-1, D_D[LOC],$A64),0)","v":932},{"$f":"IFERROR(SUMIFS(D_D[BL],D_D[MT],2,D_D[CAT],TA_24,D_D[EP],-1, D_D[LOC],$A64),0)","v":556},0.59656652360515017,{"$f":"IFERROR(SUMIFS(D_D[INV],D_D[MT],2,D_D[CAT],TA_25,D_D[EP],-1, D_D[LOC],$A64),0)","v":203},{"$f":"IFERROR(SUMIFS(D_D[INV],D_D[MT],2,D_D[CAT],TA_26,D_D[EP],-1, D_D[LOC],$A64),0)","v":2},{"$f":"IFERROR(SUMIFS(D_D[INV],D_D[MT],7,D_D[CAT],2,D_D[EP],TA_20, D_D[LOC],$A64),0)","v":4}]
["345","Phoenix",{"$f":"IFERROR(SUMIFS(D_D[INV],D_D[MT],1,D_D[CAT],TA_20,D_D[EP],-1, D_D[LOC],$A65),0)","v":2833},{"$f":"IFERROR(SUMIFS(D_D[ADP],D_D[MT],1,D_D[CAT],D$1,D_D[EP],-1, D_D[LOC],$A65),0)","v":66.48},{"$f":"IFERROR(SUMIFS(D_D[INV],D_D[MT],2,D_D[CAT],TA_21,D_D[EP],-1, D_D[LOC],$A65),0)","v":18002},{"$f":"IFERROR(SUMIFS(D_D[BL],D_D[MT],2,D_D[CAT],TA_21,D_D[EP],-1, D_D[LOC],$A65),0)","v":5062},0.28119097878013555,{"$f":"IFERROR(SUMIFS(D_D[INV],D_D[MT],2,D_D[CAT],TA_22,D_D[EP],-1, D_D[LOC],$A65),0)","v":4216},{"$f":"IFERROR(SUMIFS(D_D[BL],D_D[MT],2,D_D[CAT],TA_22,D_D[EP],-1, D_D[LOC],$A65),0)","v":987},0.23410815939278937,{"$f":"IFERROR(SUMIFS(D_D[INV],D_D[MT],2,D_D[CAT],TA_23,D_D[EP],-1, D_D[LOC],$A65),0)","v":297},{"$f":"IFERROR(SUMIFS(D_D[BL],D_D[MT],2,D_D[CAT],TA_23,D_D[EP],-1, D_D[LOC],$A65),0)","v":41},0.13804713804713806,{"$f":"IFERROR(SUMIFS(D_D[INV],D_D[MT],2,D_D[CAT],TA_24,D_D[EP],-1, D_D[LOC],$A65),0)","v":871},{"$f":"IFERROR(SUMIFS(D_D[BL],D_D[MT],2,D_D[CAT],TA_24,D_D[EP],-1, D_D[LOC],$A65),0)","v":596},0.68427095292766937,{"$f":"IFERROR(SUMIFS(D_D[INV],D_D[MT],2,D_D[CAT],TA_25,D_D[EP],-1, D_D[LOC],$A65),0)","v":127},{"$f":"IFERROR(SUMIFS(D_D[INV],D_D[MT],2,D_D[CAT],TA_26,D_D[EP],-1, D_D[LOC],$A65),0)","v":49},{"$f":"IFERROR(SUMIFS(D_D[INV],D_D[MT],7,D_D[CAT],2,D_D[EP],TA_20, D_D[LOC],$A65),0)","v":2}]
["348","Portland",{"$f":"IFERROR(SUMIFS(D_D[INV],D_D[MT],1,D_D[CAT],TA_20,D_D[EP],-1, D_D[LOC],$A66),0)","v":1482},{"$f":"IFERROR(SUMIFS(D_D[ADP],D_D[MT],1,D_D[CAT],D$1,D_D[EP],-1, D_D[LOC],$A66),0)","v":61.18},{"$f":"IFERROR(SUMIFS(D_D[INV],D_D[MT],2,D_D[CAT],TA_21,D_D[EP],-1, D_D[LOC],$A66),0)","v":7632},{"$f":"IFERROR(SUMIFS(D_D[BL],D_D[MT],2,D_D[CAT],TA_21,D_D[EP],-1, D_D[LOC],$A66),0)","v":2163},0.28341194968553457,{"$f":"IFERROR(SUMIFS(D_D[INV],D_D[MT],2,D_D[CAT],TA_22,D_D[EP],-1, D_D[LOC],$A66),0)","v":2125},{"$f":"IFERROR(SUMIFS(D_D[BL],D_D[MT],2,D_D[CAT],TA_22,D_D[EP],-1, D_D[LOC],$A66),0)","v":390},0.18352941176470589,{"$f":"IFERROR(SUMIFS(D_D[INV],D_D[MT],2,D_D[CAT],TA_23,D_D[EP],-1, D_D[LOC],$A66),0)","v":129},{"$f":"IFERROR(SUMIFS(D_D[BL],D_D[MT],2,D_D[CAT],TA_23,D_D[EP],-1, D_D[LOC],$A66),0)","v":25},0.19379844961240311,{"$f":"IFERROR(SUMIFS(D_D[INV],D_D[MT],2,D_D[CAT],TA_24,D_D[EP],-1, D_D[LOC],$A66),0)","v":370},{"$f":"IFERROR(SUMIFS(D_D[BL],D_D[MT],2,D_D[CAT],TA_24,D_D[EP],-1, D_D[LOC],$A66),0)","v":235},0.63513513513513509,{"$f":"IFERROR(SUMIFS(D_D[INV],D_D[MT],2,D_D[CAT],TA_25,D_D[EP],-1, D_D[LOC],$A66),0)","v":113},{"$f":"IFERROR(SUMIFS(D_D[INV],D_D[MT],2,D_D[CAT],TA_26,D_D[EP],-1, D_D[LOC],$A66),0)","v":5},{"$f":"IFERROR(SUMIFS(D_D[INV],D_D[MT],7,D_D[CAT],2,D_D[EP],TA_20, D_D[LOC],$A66),0)","v":1}]
["354","Reno",{"$f":"IFERROR(SUMIFS(D_D[INV],D_D[MT],1,D_D[CAT],TA_20,D_D[EP],-1, D_D[LOC],$A67),0)","v":1549},{"$f":"IFERROR(SUMIFS(D_D[ADP],D_D[MT],1,D_D[CAT],D$1,D_D[EP],-1, D_D[LOC],$A67),0)","v":63.98},{"$f":"IFERROR(SUMIFS(D_D[INV],D_D[MT],2,D_D[CAT],TA_21,D_D[EP],-1, D_D[LOC],$A67),0)","v":10006},{"$f":"IFERROR(SUMIFS(D_D[BL],D_D[MT],2,D_D[CAT],TA_21,D_D[EP],-1, D_D[LOC],$A67),0)","v":2940},0.29382370577653411,{"$f":"IFERROR(SUMIFS(D_D[INV],D_D[MT],2,D_D[CAT],TA_22,D_D[EP],-1, D_D[LOC],$A67),0)","v":2300},{"$f":"IFERROR(SUMIFS(D_D[BL],D_D[MT],2,D_D[CAT],TA_22,D_D[EP],-1, D_D[LOC],$A67),0)","v":546},0.2373913043478261,{"$f":"IFERROR(SUMIFS(D_D[INV],D_D[MT],2,D_D[CAT],TA_23,D_D[EP],-1, D_D[LOC],$A67),0)","v":168},{"$f":"IFERROR(SUMIFS(D_D[BL],D_D[MT],2,D_D[CAT],TA_23,D_D[EP],-1, D_D[LOC],$A67),0)","v":26},0.15476190476190477,{"$f":"IFERROR(SUMIFS(D_D[INV],D_D[MT],2,D_D[CAT],TA_24,D_D[EP],-1, D_D[LOC],$A67),0)","v":423},{"$f":"IFERROR(SUMIFS(D_D[BL],D_D[MT],2,D_D[CAT],TA_24,D_D[EP],-1, D_D[LOC],$A67),0)","v":260},0.61465721040189125,{"$f":"IFERROR(SUMIFS(D_D[INV],D_D[MT],2,D_D[CAT],TA_25,D_D[EP],-1, D_D[LOC],$A67),0)","v":60},{"$f":"IFERROR(SUMIFS(D_D[INV],D_D[MT],2,D_D[CAT],TA_26,D_D[EP],-1, D_D[LOC],$A67),0)","v":6},{"$f":"IFERROR(SUMIFS(D_D[INV],D_D[MT],7,D_D[CAT],2,D_D[EP],TA_20, D_D[LOC],$A67),0)","v":2}]
["341","Salt Lake City",{"$f":"IFERROR(SUMIFS(D_D[INV],D_D[MT],1,D_D[CAT],TA_20,D_D[EP],-1, D_D[LOC],$A68),0)","v":4120},{"$f":"IFERROR(SUMIFS(D_D[ADP],D_D[MT],1,D_D[CAT],D$1,D_D[EP],-1, D_D[LOC],$A68),0)","v":57.44},{"$f":"IFERROR(SUMIFS(D_D[INV],D_D[MT],2,D_D[CAT],TA_21,D_D[EP],-1, D_D[LOC],$A68),0)","v":5804},{"$f":"IFERROR(SUMIFS(D_D[BL],D_D[MT],2,D_D[CAT],TA_21,D_D[EP],-1, D_D[LOC],$A68),0)","v":1681},0.28962784286698828,{"$f":"IFERROR(SUMIFS(D_D[INV],D_D[MT],2,D_D[CAT],TA_22,D_D[EP],-1, D_D[LOC],$A68),0)","v":5331},{"$f":"IFERROR(SUMIFS(D_D[BL],D_D[MT],2,D_D[CAT],TA_22,D_D[EP],-1, D_D[LOC],$A68),0)","v":949},0.17801538172950665,{"$f":"IFERROR(SUMIFS(D_D[INV],D_D[MT],2,D_D[CAT],TA_23,D_D[EP],-1, D_D[LOC],$A68),0)","v":89},{"$f":"IFERROR(SUMIFS(D_D[BL],D_D[MT],2,D_D[CAT],TA_23,D_D[EP],-1, D_D[LOC],$A68),0)","v":6},6.741573033707865E-2,{"$f":"IFERROR(SUMIFS(D_D[INV],D_D[MT],2,D_D[CAT],TA_24,D_D[EP],-1, D_D[LOC],$A68),0)","v":455},{"$f":"IFERROR(SUMIFS(D_D[BL],D_D[MT],2,D_D[CAT],TA_24,D_D[EP],-1, D_D[LOC],$A68),0)","v":269},0.59120879120879122,{"$f":"IFERROR(SUMIFS(D_D[INV],D_D[MT],2,D_D[CAT],TA_25,D_D[EP],-1, D_D[LOC],$A68),0)","v":54},{"$f":"IFERROR(SUMIFS(D_D[INV],D_D[MT],2,D_D[CAT],TA_26,D_D[EP],-1, D_D[LOC],$A68),0)","v":50},{"$f":"IFERROR(SUMIFS(D_D[INV],D_D[MT],7,D_D[CAT],2,D_D[EP],TA_20, D_D[LOC],$A68),0)","v":0}]
["377","San Diego",{"$f":"IFERROR(SUMIFS(D_D[INV],D_D[MT],1,D_D[CAT],TA_20,D_D[EP],-1, D_D[LOC],$A69),0)","v":6071},{"$f":"IFERROR(SUMIFS(D_D[ADP],D_D[MT],1,D_D[CAT],D$1,D_D[EP],-1, D_D[LOC],$A69),0)","v":68.66},{"$f":"IFERROR(SUMIFS(D_D[INV],D_D[MT],2,D_D[CAT],TA_21,D_D[EP],-1, D_D[LOC],$A69),0)","v":22747},{"$f":"IFERROR(SUMIFS(D_D[BL],D_D[MT],2,D_D[CAT],TA_21,D_D[EP],-1, D_D[LOC],$A69),0)","v":6163},{"$f":"IFERROR(F69/E69,\"0%\")","v":0.27093682683430781},{"$f":"IFERROR(SUMIFS(D_D[INV],D_D[MT],2,D_D[CAT],TA_22,D_D[EP],-1, D_D[LOC],$A69),0)","v":17344},{"$f":"IFERROR(SUMIFS(D_D[BL],D_D[MT],2,D_D[CAT],TA_22,D_D[EP],-1, D_D[LOC],$A69),0)","v":6165},{"$f":"IFERROR(I69/H69,\"0%\")","v":0.35545433579335795},{"$f":"IFERROR(SUMIFS(D_D[INV],D_D[MT],2,D_D[CAT],TA_23,D_D[EP],-1, D_D[LOC],$A69),0)","v":409},{"$f":"IFERROR(SUMIFS(D_D[BL],D_D[MT],2,D_D[CAT],TA_23,D_D[EP],-1, D_D[LOC],$A69),0)","v":77},{"$f":"IFERROR(L69/K69,\"0%\")","v":0.18826405867970661},{"$f":"IFERROR(SUMIFS(D_D[INV],D_D[MT],2,D_D[CAT],TA_24,D_D[EP],-1, D_D[LOC],$A69),0)","v":1521},{"$f":"IFERROR(SUMIFS(D_D[BL],D_D[MT],2,D_D[CAT],TA_24,D_D[EP],-1, D_D[LOC],$A69),0)","v":796},{"$f":"IFERROR(O69/N69,\"0%\")","v":0.52333990795529262},{"$f":"IFERROR(SUMIFS(D_D[INV],D_D[MT],2,D_D[CAT],TA_25,D_D[EP],-1, D_D[LOC],$A69),0)","v":102},{"$f":"IFERROR(SUMIFS(D_D[INV],D_D[MT],2,D_D[CAT],TA_26,D_D[EP],-1, D_D[LOC],$A69),0)","v":7},{"$f":"IFERROR(SUMIFS(D_D[INV],D_D[MT],7,D_D[CAT],2,D_D[EP],TA_20, D_D[LOC],$A69),0)","v":4}]
["346","Seattle",{"$f":"IFERROR(SUMIFS(D_D[INV],D_D[MT],1,D_D[CAT],TA_20,D_D[EP],-1, D_D[LOC],$A70),0)","v":4510},{"$f":"IFERROR(SUMIFS(D_D[ADP],D_D[MT],1,D_D[CAT],D$1,D_D[EP],-1, D_D[LOC],$A70),0)","v":67.75},{"$f":"IFERROR(SUMIFS(D_D[INV],D_D[MT],2,D_D[CAT],TA_21,D_D[EP],-1, D_D[LOC],$A70),0)","v":19706},{"$f":"IFERROR(SUMIFS(D_D[BL],D_D[MT],2,D_D[CAT],TA_21,D_D[EP],-1, D_D[LOC],$A70),0)","v":5515},0.27986400081193546,{"$f":"IFERROR(SUMIFS(D_D[INV],D_D[MT],2,D_D[CAT],TA_22,D_D[EP],-1, D_D[LOC],$A70),0)","v":6793},{"$f":"IFERROR(SUMIFS(D_D[BL],D_D[MT],2,D_D[CAT],TA_22,D_D[EP],-1, D_D[LOC],$A70),0)","v":1665},0.24510525540998085,{"$f":"IFERROR(SUMIFS(D_D[INV],D_D[MT],2,D_D[CAT],TA_23,D_D[EP],-1, D_D[LOC],$A70),0)","v":229},{"$f":"IFERROR(SUMIFS(D_D[BL],D_D[MT],2,D_D[CAT],TA_23,D_D[EP],-1, D_D[LOC],$A70),0)","v":26},0.11353711790393013,{"$f":"IFERROR(SUMIFS(D_D[INV],D_D[MT],2,D_D[CAT],TA_24,D_D[EP],-1, D_D[LOC],$A70),0)","v":3628},{"$f":"IFERROR(SUMIFS(D_D[BL],D_D[MT],2,D_D[CAT],TA_24,D_D[EP],-1, D_D[LOC],$A70),0)","v":1176},0.32414553472987873,{"$f":"IFERROR(SUMIFS(D_D[INV],D_D[MT],2,D_D[CAT],TA_25,D_D[EP],-1, D_D[LOC],$A70),0)","v":165},{"$f":"IFERROR(SUMIFS(D_D[INV],D_D[MT],2,D_D[CAT],TA_26,D_D[EP],-1, D_D[LOC],$A70),0)","v":24},{"$f":"IFERROR(SUMIFS(D_D[INV],D_D[MT],7,D_D[CAT],2,D_D[EP],TA_20, D_D[LOC],$A70),0)","v":237}]
[35,"Other",{"$f":"IFERROR(SUMIFS(D_D[INV],D_D[MT],1,D_D[CAT],TA_20,D_D[EP],-1, D_D[LOC],$A71),0)","v":26675},{"$f":"IFERROR(SUMIFS(D_D[ADP],D_D[MT],1,D_D[CAT],D$1,D_D[EP],-1, D_D[LOC],$A71),0)","v":91.21},{"$f":"IFERROR(SUMIFS(D_D[INV],D_D[MT],2,D_D[CAT],TA_21,D_D[EP],-1, D_D[LOC],$A71),0)","v":139919},{"$f":"IFERROR(SUMIFS(D_D[BL],D_D[MT],2,D_D[CAT],TA_21,D_D[EP],-1, D_D[LOC],$A71),0)","v":52747},0.37698239695824015,{"$f":"IFERROR(SUMIFS(D_D[INV],D_D[MT],2,D_D[CAT],TA_22,D_D[EP],-1, D_D[LOC],$A71),0)","v":27502},{"$f":"IFERROR(SUMIFS(D_D[BL],D_D[MT],2,D_D[CAT],TA_22,D_D[EP],-1, D_D[LOC],$A71),0)","v":6280},0.22834702930695949,{"$f":"IFERROR(SUMIFS(D_D[INV],D_D[MT],2,D_D[CAT],TA_23,D_D[EP],-1, D_D[LOC],$A71),0)","v":473},{"$f":"IFERROR(SUMIFS(D_D[BL],D_D[MT],2,D_D[CAT],TA_23,D_D[EP],-1, D_D[LOC],$A71),0)","v":27},5.7082452431289642E-2,{"$f":"IFERROR(SUMIFS(D_D[INV],D_D[MT],2,D_D[CAT],TA_24,D_D[EP],-1, D_D[LOC],$A71),0)","v":20628},{"$f":"IFERROR(SUMIFS(D_D[BL],D_D[MT],2,D_D[CAT],TA_24,D_D[EP],-1, D_D[LOC],$A71),0)","v":7657},0.3711944929222416,{"$f":"IFERROR(SUMIFS(D_D[INV],D_D[MT],2,D_D[CAT],TA_25,D_D[EP],-1, D_D[LOC],$A71),0)","v":3832},{"$f":"IFERROR(SUMIFS(D_D[INV],D_D[MT],2,D_D[CAT],TA_26,D_D[EP],-1, D_D[LOC],$A71),0)","v":852},{"$f":"IFERROR(SUMIFS(D_D[INV],D_D[MT],7,D_D[CAT],2,D_D[EP],TA_20, D_D[LOC],$A71),0)","v":30492}]
[]
[null,null,"Pension"]
[null,null,"Non-Rating",null,"Entitlement   ",null,null,"Award Adjustment ",null,null,"Program Review ",null,null,"Other",null,null,"Burial  ","Accrued  ","Appeals"]
[null,null,"Claims Pending","Avg. Days Pending","Claims Pending","Pending over 125 days","Percent Pending over 125 days","Claims Pending","Pending over 125 days","Percent Pending over 125 days","Claims Pending","Pending over 125 days","Percent Pending over 125 days","Claims Pending","Pending over 125 days","Percent Pending over 125 days","Claims Pending","Claims Pending","Appeals Pending"]
[100,"USA Pension",{"$f":"IFERROR(SUMIFS(D_D[INV],D_D[MT],1,D_D[CAT],TA_30,D_D[EP],-1, D_D[LOC],$A76),0)","v":6946},{"$f":"IFERROR(SUMIFS(D_D[ADP],D_D[MT],1,D_D[CAT],TA_30,D_D[EP],-1, D_D[LOC],$A76),0)","v":117.53},{"$f":"IFERROR(SUMIFS(D_D[INV],D_D[MT],2,D_D[CAT],TA_31,D_D[EP],-1, D_D[LOC],$A76),0)","v":26003},{"$f":"IFERROR(SUMIFS(D_D[BL],D_D[MT],2,D_D[CAT],TA_31,D_D[EP],-1, D_D[LOC],$A76),0)","v":5278},{"$f":"IFERROR(F76/E76,\"0%\")","v":0.20297657962542784},{"$f":"IFERROR(SUMIFS(D_D[INV],D_D[MT],2,D_D[CAT],TA_32,D_D[EP],-1, D_D[LOC],$A76),0)","v":7055},{"$f":"IFERROR(SUMIFS(D_D[BL],D_D[MT],2,D_D[CAT],TA_32,D_D[EP],-1, D_D[LOC],$A76),0)","v":3219},{"$f":"IFERROR(I76/H76,\"0%\")","v":0.45627214741318212},{"$f":"IFERROR(SUMIFS(D_D[INV],D_D[MT],2,D_D[CAT],TA_33,D_D[EP],-1, D_D[LOC],$A76),0)","v":1285},{"$f":"IFERROR(SUMIFS(D_D[BL],D_D[MT],2,D_D[CAT],TA_33,D_D[EP],-1, D_D[LOC],$A76),0)","v":1060},{"$f":"IFERROR(L76/K76,\"0%\")","v":0.82490272373540852},{"$f":"IFERROR(SUMIFS(D_D[INV],D_D[MT],2,D_D[CAT],TA_34,D_D[EP],-1, D_D[LOC],$A76),0)","v":58},{"$f":"IFERROR(SUMIFS(D_D[BL],D_D[MT],2,D_D[CAT],TA_34,D_D[EP],-1, D_D[LOC],$A76),0)","v":0},{"$f":"IFERROR(O76/N76,\"0%\")","v":0},{"$f":"IFERROR(SUMIFS(D_D[INV],D_D[MT],2,D_D[CAT],TA_35,D_D[EP],-1, D_D[LOC],$A76),0)","v":0},{"$f":"IFERROR(SUMIFS(D_D[INV],D_D[MT],2,D_D[CAT],TA_36,D_D[EP],-1, D_D[LOC],$A76),0)","v":2622},{"$f":"IFERROR(SUMIFS(D_D[INV],D_D[MT],7,D_D[CAT],2,D_D[EP],TA_30, D_D[LOC],$A76),0)","v":301}]
["310","Philadelphia PMC",{"$f":"IFERROR(SUMIFS(D_D[INV],D_D[MT],1,D_D[CAT],TA_30,D_D[EP],-1, D_D[LOC],$A77),0)","v":915},{"$f":"IFERROR(SUMIFS(D_D[ADP],D_D[MT],1,D_D[CAT],TA_30,D_D[EP],-1, D_D[LOC],$A77),0)","v":140.30000000000001},{"$f":"IFERROR(SUMIFS(D_D[INV],D_D[MT],2,D_D[CAT],TA_31,D_D[EP],-1, D_D[LOC],$A77),0)","v":1738},{"$f":"IFERROR(SUMIFS(D_D[BL],D_D[MT],2,D_D[CAT],TA_31,D_D[EP],-1, D_D[LOC],$A77),0)","v":370},{"$f":"IFERROR(F77/E77,\"0%\")","v":0.21288837744533948},{"$f":"IFERROR(SUMIFS(D_D[INV],D_D[MT],2,D_D[CAT],TA_32,D_D[EP],-1, D_D[LOC],$A77),0)","v":941},{"$f":"IFERROR(SUMIFS(D_D[BL],D_D[MT],2,D_D[CAT],TA_32,D_D[EP],-1, D_D[LOC],$A77),0)","v":556},{"$f":"IFERROR(I77/H77,\"0%\")","v":0.59086078639744954},{"$f":"IFERROR(SUMIFS(D_D[INV],D_D[MT],2,D_D[CAT],TA_33,D_D[EP],-1, D_D[LOC],$A77),0)","v":341},{"$f":"IFERROR(SUMIFS(D_D[BL],D_D[MT],2,D_D[CAT],TA_33,D_D[EP],-1, D_D[LOC],$A77),0)","v":333},{"$f":"IFERROR(L77/K77,\"0%\")","v":0.97653958944281527},{"$f":"IFERROR(SUMIFS(D_D[INV],D_D[MT],2,D_D[CAT],TA_34,D_D[EP],-1, D_D[LOC],$A77),0)","v":0},{"$f":"IFERROR(SUMIFS(D_D[BL],D_D[MT],2,D_D[CAT],TA_34,D_D[EP],-1, D_D[LOC],$A77),0)","v":0},{"$f":"IFERROR(O77/N77,\"0%\")","v":"0%"},{"$f":"IFERROR(SUMIFS(D_D[INV],D_D[MT],2,D_D[CAT],TA_35,D_D[EP],-1, D_D[LOC],$A77),0)","v":0},{"$f":"IFERROR(SUMIFS(D_D[INV],D_D[MT],2,D_D[CAT],TA_36,D_D[EP],-1, D_D[LOC],$A77),0)","v":1416},{"$f":"IFERROR(SUMIFS(D_D[INV],D_D[MT],7,D_D[CAT],2,D_D[EP],TA_30, D_D[LOC],$A77),0)","v":1}]
["330","Milwaukee PMC",{"$f":"IFERROR(SUMIFS(D_D[INV],D_D[MT],1,D_D[CAT],TA_30,D_D[EP],-1, D_D[LOC],$A78),0)","v":1262},{"$f":"IFERROR(SUMIFS(D_D[ADP],D_D[MT],1,D_D[CAT],TA_30,D_D[EP],-1, D_D[LOC],$A78),0)","v":126.55},{"$f":"IFERROR(SUMIFS(D_D[INV],D_D[MT],2,D_D[CAT],TA_31,D_D[EP],-1, D_D[LOC],$A78),0)","v":1398},{"$f":"IFERROR(SUMIFS(D_D[BL],D_D[MT],2,D_D[CAT],TA_31,D_D[EP],-1, D_D[LOC],$A78),0)","v":334},0.23891273247496422,{"$f":"IFERROR(SUMIFS(D_D[INV],D_D[MT],2,D_D[CAT],TA_32,D_D[EP],-1, D_D[LOC],$A78),0)","v":1315},{"$f":"IFERROR(SUMIFS(D_D[BL],D_D[MT],2,D_D[CAT],TA_32,D_D[EP],-1, D_D[LOC],$A78),0)","v":664},0.50494296577946773,{"$f":"IFERROR(SUMIFS(D_D[INV],D_D[MT],2,D_D[CAT],TA_33,D_D[EP],-1, D_D[LOC],$A78),0)","v":338},{"$f":"IFERROR(SUMIFS(D_D[BL],D_D[MT],2,D_D[CAT],TA_33,D_D[EP],-1, D_D[LOC],$A78),0)","v":331},0.97928994082840237,{"$f":"IFERROR(SUMIFS(D_D[INV],D_D[MT],2,D_D[CAT],TA_34,D_D[EP],-1, D_D[LOC],$A78),0)","v":0},{"$f":"IFERROR(SUMIFS(D_D[BL],D_D[MT],2,D_D[CAT],TA_34,D_D[EP],-1, D_D[LOC],$A78),0)","v":0},"0%",{"$f":"IFERROR(SUMIFS(D_D[INV],D_D[MT],2,D_D[CAT],TA_35,D_D[EP],-1, D_D[LOC],$A78),0)","v":0},{"$f":"IFERROR(SUMIFS(D_D[INV],D_D[MT],2,D_D[CAT],TA_36,D_D[EP],-1, D_D[LOC],$A78),0)","v":519},{"$f":"IFERROR(SUMIFS(D_D[INV],D_D[MT],7,D_D[CAT],2,D_D[EP],TA_30, D_D[LOC],$A78),0)","v":1}]
["335","St. Paul PMC",{"$f":"IFERROR(SUMIFS(D_D[INV],D_D[MT],1,D_D[CAT],TA_30,D_D[EP],-1, D_D[LOC],$A79),0)","v":1421},{"$f":"IFERROR(SUMIFS(D_D[ADP],D_D[MT],1,D_D[CAT],TA_30,D_D[EP],-1, D_D[LOC],$A79),0)","v":121.83},{"$f":"IFERROR(SUMIFS(D_D[INV],D_D[MT],2,D_D[CAT],TA_31,D_D[EP],-1, D_D[LOC],$A79),0)","v":2035},{"$f":"IFERROR(SUMIFS(D_D[BL],D_D[MT],2,D_D[CAT],TA_31,D_D[EP],-1, D_D[LOC],$A79),0)","v":424},0.20835380835380835,{"$f":"IFERROR(SUMIFS(D_D[INV],D_D[MT],2,D_D[CAT],TA_32,D_D[EP],-1, D_D[LOC],$A79),0)","v":1451},{"$f":"IFERROR(SUMIFS(D_D[BL],D_D[MT],2,D_D[CAT],TA_32,D_D[EP],-1, D_D[LOC],$A79),0)","v":670},0.46175051688490698,{"$f":"IFERROR(SUMIFS(D_D[INV],D_D[MT],2,D_D[CAT],TA_33,D_D[EP],-1, D_D[LOC],$A79),0)","v":370},{"$f":"IFERROR(SUMIFS(D_D[BL],D_D[MT],2,D_D[CAT],TA_33,D_D[EP],-1, D_D[LOC],$A79),0)","v":369},0.99729729729729732,{"$f":"IFERROR(SUMIFS(D_D[INV],D_D[MT],2,D_D[CAT],TA_34,D_D[EP],-1, D_D[LOC],$A79),0)","v":0},{"$f":"IFERROR(SUMIFS(D_D[BL],D_D[MT],2,D_D[CAT],TA_34,D_D[EP],-1, D_D[LOC],$A79),0)","v":0},"0%",{"$f":"IFERROR(SUMIFS(D_D[INV],D_D[MT],2,D_D[CAT],TA_35,D_D[EP],-1, D_D[LOC],$A79),0)","v":0},{"$f":"IFERROR(SUMIFS(D_D[INV],D_D[MT],2,D_D[CAT],TA_36,D_D[EP],-1, D_D[LOC],$A79),0)","v":687},{"$f":"IFERROR(SUMIFS(D_D[INV],D_D[MT],7,D_D[CAT],2,D_D[EP],TA_30, D_D[LOC],$A79),0)","v":0}]
[-1,"Pension Other",{"$f":"IFERROR(SUMIFS(D_D[INV],D_D[MT],1,D_D[CAT],TA_30,D_D[EP],-1, D_D[LOC],$A80),0)","v":3348},{"$f":"IFERROR(SUMIFS(D_D[ADP],D_D[MT],1,D_D[CAT],TA_30,D_D[EP],-1, D_D[LOC],$A80),0)","v":106.08},{"$f":"IFERROR(SUMIFS(D_D[INV],D_D[MT],2,D_D[CAT],TA_31,D_D[EP],-1, D_D[LOC],$A80),0)","v":20832},{"$f":"IFERROR(SUMIFS(D_D[BL],D_D[MT],2,D_D[CAT],TA_31,D_D[EP],-1, D_D[LOC],$A80),0)","v":4150},0.19921274961597543,{"$f":"IFERROR(SUMIFS(D_D[INV],D_D[MT],2,D_D[CAT],TA_32,D_D[EP],-1, D_D[LOC],$A80),0)","v":3348},{"$f":"IFERROR(SUMIFS(D_D[BL],D_D[MT],2,D_D[CAT],TA_32,D_D[EP],-1, D_D[LOC],$A80),0)","v":1329},0.39695340501792115,{"$f":"IFERROR(SUMIFS(D_D[INV],D_D[MT],2,D_D[CAT],TA_33,D_D[EP],-1, D_D[LOC],$A80),0)","v":236},{"$f":"IFERROR(SUMIFS(D_D[BL],D_D[MT],2,D_D[CAT],TA_33,D_D[EP],-1, D_D[LOC],$A80),0)","v":27},0.11440677966101695,{"$f":"IFERROR(SUMIFS(D_D[INV],D_D[MT],2,D_D[CAT],TA_34,D_D[EP],-1, D_D[LOC],$A80),0)","v":58},{"$f":"IFERROR(SUMIFS(D_D[BL],D_D[MT],2,D_D[CAT],TA_34,D_D[EP],-1, D_D[LOC],$A80),0)","v":0},0,{"$f":"IFERROR(SUMIFS(D_D[INV],D_D[MT],2,D_D[CAT],TA_35,D_D[EP],-1, D_D[LOC],$A80),0)","v":0},{"$f":"IFERROR(SUMIFS(D_D[INV],D_D[MT],2,D_D[CAT],TA_36,D_D[EP],-1, D_D[LOC],$A80),0)","v":0},{"$f":"IFERROR(SUMIFS(D_D[INV],D_D[MT],7,D_D[CAT],2,D_D[EP],TA_30, D_D[LOC],$A80),0)","v":299}]