{"text_format":"1","workbook":"xlsx","n_sheets":13,"sheets":["Legend","Transformation","Rating Bundle - SOJ","Driver","Data","DT","Rating Bundle - SOO","Rating Bundle - State","Rating Bundle - SOJ - NWQ","Rating Bundle - NWQ - State","Traditional Aggregate (TA)","Diarys and Future Claims","TA-Regional Office"],"not_rendered":{"charts":0,"images":1,"macros":0,"external_links":0,"defined_names":65,"comments":1,"pivot_tables":0},"unopened":[],"bounds":{"document_bytes":16777216,"sheet_cells":100000,"rows_first":2000,"rows_last":500,"rows_between":2000,"halvings":0,"cell_chars":16384,"cell_head_chars":4096},"cells_cut":0,"cells_raw":0,"read":"whole","date_system":"1900"}

{"sheet":"Legend","index":0,"n_rows":35,"n_cols":5,"rows_kept":35,"cut":false,"hidden":false,"merged":[[34,1,35,1],[34,2,35,2],[1,4,12,4],[26,1,27,1],[26,2,27,2],[28,1,29,1],[28,2,29,2],[14,4,21,4],[7,5,7,6],[30,1,31,1],[30,2,31,2],[32,1,33,1],[32,2,33,2]]}
[null,"METRIC","DEFINITION","Line","COMMENT"]
[null,"010 Series","Initial entitlement for service-connected disability (=>8 issues)","Comp","Rating Bundle: Claims for disability compensation, dependency and indemnity compensation, and Veterans’ pension benefits, including both original and supplemental claims. Rating Bundle claims normally require a rating decision during processing.  The Rating Bundle Group is made up of 7 series and 1 group of End Products, plus 4 Agent Orange End Products, which are used to define VA Priority goals for Accuracy and reduction of claims over 125 days old"]
[null,"110 Series","Initial entitlement for service-connected disability (<=7 issues)","Comp"]
[null,"020 Series","Increased evaluation and/or additional claimed conditions","Comp"]
[null,"140 Series","Initial claims from surviving spouses, children or parents","Comp"]
[null,"180 Series","Initial entitlement for Pension - Veteran ","Pension"]
[null,"120 Series","Increased entitlement and/or reconsideration for Pension","Pension"]
[null,"310 Group","Future examination for disabilities (excludes EP 314)","Comp"]
[null,"320 Series","Increased entitlement due to hospitalization or surgery","Comp"]
[null,"EP 405","Reopened or new Agent Orange claims between 9/01/10 and 10/24/2011","Comp"]
[null,"EP 409","Agent Orange claims where an interim decision was provided; No longer used as of 10/24/2011","Comp"]
[null,"EP 681","Used to control claims under the Nehmer Agent Orange stipulation","Comp"]
[null,"EP 687","Previously used for Nehmer Agent Orange presumptive issues","Comp"]
[null,"EP 040","Decision Review Request - AMA Supplemental Claims","Comp"]
[null,"EP 335","Blue Water Navy Agent Orange (effective 1/1/2010)","Comp","Not-Rating: Claims for disability compensation, dependency and indemnity compensation, and Veterans’ pension benefits, which can but normally do not require a rating decision (i.e. claim to add dependent to award)."]
[]
[]
[null,"ADP","Average Days Pending, or total number of days pending divided by total number of claims pending"]
[null,"ADC","Average Days to Complete or total number of days to complete divided by total number of claims completed"]
[]
[null,"MTD","Month to Date. Captures claim activity from the first day of the reporting month through the report date"]
[null,"FYTD","Fiscal Year to Date. Captures claim activity from the first day of the current fiscal year through the report date"]
[]
[null,"SOJ","Station of Jurisdiction, or the Regional Office assigned to work the claim"]
[null,"SOO","Station of Origin, or the Regional Office with geographic oversight of the claim"]
[]
[null,"Pending Development","Claims that are awaiting development initiation, which may involve gathering supporting evidence, medical exams, and military documentation."]
[]
[null,"Pending Evidence","Claims that are in the process of gathering supporting evidence and possibly medical exams."]
[]
[null,"Pending Decision","Claims that are awaiting an evidence review and decision by a rating specialist"]
[]
[null,"Pending Award","Claims that are awaiting a first-level review of the evidence gathered and the decision."]
[]
[null,"Pending Authorization","Claims that are awaiting a final review of all aspects of the claim, which results in a notification to the claimant on the outcome of their claim."]

{"sheet":"Transformation","index":1,"n_rows":38,"n_cols":10,"rows_kept":38,"cut":false,"hidden":false,"merged":[[13,1,13,5],[14,1,14,5],[36,1,36,9],[15,1,15,5],[16,1,16,5],[18,1,18,5],[20,1,20,5],[25,1,25,5],[32,1,32,5],[33,1,33,5],[34,1,34,5],[19,1,19,5],[21,1,21,5],[22,1,22,5],[17,1,17,5],[12,1,12,5],[1,1,1,5],[6,1,6,5],[7,1,7,5],[8,1,8,5],[9,1,9,5],[37,1,37,9],[2,9,3,9],[31,1,31,5],[26,1,26,5],[27,1,27,5],[28,1,28,5],[29,1,29,5],[30,1,30,5],[24,1,24,5],[2,8,3,8],[2,7,3,7],[5,1,5,5],[4,1,4,5],[2,1,2,5],[10,1,10,5],[11,1,11,5]]}
[null," "]
[null,"Compensation and Pension Rating Bundle Metrics"]
[null,"National View",null,null,null,null,null,"# Pending","# Pending > 125","% Pending > 125 days"]
[null,{"$f":"\"Reporting through \"&TEXT(D_DT[],\"MMMM DD, YYYY\")","v":"Reporting through May 28, 2022"}]
[null,"Compensation and Pension Rating Bundle",null,null,null,null,"Total",{"$f":"SUM(H6,H11,H22)","v":592345},{"$f":"SUM(I6,I11,I22)","v":196852},{"$f":"IF(H5=0, 0,I5/H5)","v":0.33232660020764926}]
[null,"Original Entitlement",null,null,null,null,"Total",{"$f":"SUM(H7:H10)","v":158650},{"$f":"SUM(I7:I10)","v":55530},{"$f":"IF(H6=0, 0,I6/H6)","v":0.35001575795776868}]
["010","Initial entitlement for service-connected disability (>=8 issues)",null,null,null,null,"EP 010",{"$f":"IFERROR(SUMIFS(D_D[INV],D_D[MT],3,D_D[EP],$A7),0)","v":48734},{"$f":"IFERROR(SUMIFS(D_D[BL],D_D[MT],3,D_D[EP],$A7),0)","v":19548},0.40111626379940085]
["110","Initial entitlement for service-connected disability (<=7 issues)",null,null,null,null,"EP 110",{"$f":"IFERROR(SUMIFS(D_D[INV],D_D[MT],3,D_D[EP],$A8),0)","v":88719},{"$f":"IFERROR(SUMIFS(D_D[BL],D_D[MT],3,D_D[EP],$A8),0)","v":31584},0.35600040577553849]
["180","Initial entitlement - Veteran's Pension",null,null,null,null,"EP 180",{"$f":"IFERROR(SUMIFS(D_D[INV],D_D[MT],3,D_D[EP],$A9),0)","v":7107},{"$f":"IFERROR(SUMIFS(D_D[BL],D_D[MT],3,D_D[EP],$A9),0)","v":567},7.9780498100464337E-2]
["140","Initial claims from surviving spouses, children or parents",null,null,null,null,"EP 140",{"$f":"IFERROR(SUMIFS(D_D[INV],D_D[MT],3,D_D[EP],$A10),0)","v":14090},{"$f":"IFERROR(SUMIFS(D_D[BL],D_D[MT],3,D_D[EP],$A10),0)","v":3831},0.27189496096522359]
[null,"Supplemental Entitlement",null,null,null,null,"Total",{"$f":"SUM(H12:H21)","v":419340},{"$f":"SUM(I12:I21)","v":128328},0.30602375160967232]
["120","Increased entitlement and/or reconsideration for Pension",null,null,null,null,"EP 120",{"$f":"IFERROR(SUMIFS(D_D[INV],D_D[MT],3,D_D[EP],$A12),0)","v":4232},{"$f":"IFERROR(SUMIFS(D_D[BL],D_D[MT],3,D_D[EP],$A12),0)","v":309},7.3015122873345939E-2]
["020","Increased evaluation and/or additional claimed conditions",null,null,null,null,"EP 020",{"$f":"IFERROR(SUMIFS(D_D[INV],D_D[MT],3,D_D[EP],$A13),0)","v":264970},{"$f":"IFERROR(SUMIFS(D_D[BL],D_D[MT],3,D_D[EP],$A13),0)","v":69910},0.2638411895686304]
["310G","Future examination for disabilities",null,null,null,null,"EP 310",{"$f":"IFERROR(SUMIFS(D_D[INV],D_D[MT],3,D_D[EP],$A14),0)","v":7278},{"$f":"IFERROR(SUMIFS(D_D[BL],D_D[MT],3,D_D[EP],$A14),0)","v":1913},0.26284693597142073]
["320","Increased entitlement due to hospitalization or surgery",null,null,null,null,"EP 320",{"$f":"IFERROR(SUMIFS(D_D[INV],D_D[MT],3,D_D[EP],$A15),0)","v":1582},{"$f":"IFERROR(SUMIFS(D_D[BL],D_D[MT],3,D_D[EP],$A15),0)","v":51},3.2237673830594185E-2]
["681","Used to control claims under the Nehmer Agent Orange stipulation",null,null,null,null,"EP 681",{"$f":"IFERROR(SUMIFS(D_D[INV],D_D[MT],3,D_D[EP],$A16),0)","v":1204},{"$f":"IFERROR(SUMIFS(D_D[BL],D_D[MT],3,D_D[EP],$A16),0)","v":928},0.77076411960132896]
["687","Blue Water Navy Agent Orange Nehmer Reviews",null,null,null,null,"EP 687",{"$f":"IFERROR(SUMIFS(D_D[INV],D_D[MT],3,D_D[EP],$A17),0)","v":1885},{"$f":"IFERROR(SUMIFS(D_D[BL],D_D[MT],3,D_D[EP],$A17),0)","v":1881},{"$f":"IF(H17=0, 0,I17/H17)","v":0.9978779840848806}]
["688","NDAA Agent Orange Nehmer Reviews (3 new authorized disabilities)",null,null,null,null,"EP 688",{"$f":"IFERROR(SUMIFS(D_D[INV],D_D[MT],3,D_D[EP],$A18),0)","v":26436},{"$f":"IFERROR(SUMIFS(D_D[BL],D_D[MT],3,D_D[EP],$A18),0)","v":25946},{"$f":"IF(H18=0, 0,I18/H18)","v":0.98146466939022547}]
["405","Reopened or new Agent Orange claims between 9/01/10 and 10/24/2011",null,null,null,null,"EP 405",{"$f":"IFERROR(SUMIFS(D_D[INV],D_D[MT],3,D_D[EP],$A19),0)","v":0},{"$f":"IFERROR(SUMIFS(D_D[BL],D_D[MT],3,D_D[EP],$A19),0)","v":0},{"$f":"IF(H19=0, 0,I19/H19)","v":0}]
["040","Decision Review Request - AMA Supplemental Claims",null,null,null,null,"EP 040",{"$f":"IFERROR(SUMIFS(D_D[INV],D_D[MT],3.1,D_D[EP],$A20),0)","v":111731},{"$f":"IFERROR(SUMIFS(D_D[BL],D_D[MT],3.1,D_D[EP],$A20),0)","v":27390},{"$f":"IF(H20=0, 0,I20/H20)","v":0.24514235082474872}]
["409","Agent Orange claims where an interim decision was provided; No longer used as of 10/24/2011",null,null,null,null,"EP 409",{"$f":"IFERROR(SUMIFS(D_D[INV],D_D[MT],3,D_D[EP],$A21),0)","v":22},{"$f":"IFERROR(SUMIFS(D_D[BL],D_D[MT],3,D_D[EP],$A21),0)","v":0},{"$f":"IF(H21=0, 0,I21/H21)","v":0}]
[null,"Compensation Other – Diary – Becomes Part of Rating Bundle on 1/1/2020",null,null,null,null,"Total",{"$f":"SUM(H23)","v":14355},{"$f":"SUM(I23)","v":12994},{"$f":"IF(H22=0, 0,I22/H22)","v":0.90518982932776038}]
["335","Blue Water Navy - Agent Orange",null,null,null,null,"EP 335",{"$f":"IFERROR(SUMIFS(D_D[INV],D_D[MT],3,D_D[EP],$A23),0)","v":14355},{"$f":"IFERROR(SUMIFS(D_D[BL],D_D[MT],3,D_D[EP],$A23),0)","v":12994},0.90518982932776038]
[]
[null,"Education Metrics ",null,null,null,null,{"$f":"\"Pending on \" &TEXT(D_DT[]-0,\"MM/DD/YY\")","v":"Pending on 05/28/22"},{"$f":"\"Pending on \" &TEXT(D_DT[]-7,\"MM/DD/YY\")","v":"Pending on 05/21/22"},"# Change","% Change"]
[1,"Total Chapter 33 Original Claims *",null,null,null,null,{"$f":"IFERROR(SUMIFS(D_D[INV],D_D[MT],9,D_D[CAT],1,D_D[LOC],$A26),0)","v":5328},{"$f":"IFERROR(SUMIFS(D_D[BL],D_D[MT],9,D_D[CAT],1,D_D[LOC],$A26),0)","v":5917},{"$f":"IFERROR(SUMIFS(D_D[ADP],D_D[MT],9,D_D[CAT],1,D_D[LOC],$A26),0)","v":-589},{"$f":"IFERROR(I26/H26,0)","v":-9.9543687679567353E-2}]
[307,"Buffalo",null,null,null,null,{"$f":"IFERROR(SUMIFS(D_D[INV],D_D[MT],9,D_D[CAT],1,D_D[LOC],$A27),0)","v":3392},{"$f":"IFERROR(SUMIFS(D_D[BL],D_D[MT],9,D_D[CAT],1,D_D[LOC],$A27),0)","v":3486},{"$f":"IFERROR(SUMIFS(D_D[ADP],D_D[MT],9,D_D[CAT],1,D_D[LOC],$A27),0)","v":-94},{"$f":"IFERROR(I27/H27,0)","v":-2.6965002868617326E-2}]
[316,"Atlanta",null,null,null,null,{"$f":"IFERROR(SUMIFS(D_D[INV],D_D[MT],9,D_D[CAT],1,D_D[LOC],$A28),0)","v":0},{"$f":"IFERROR(SUMIFS(D_D[BL],D_D[MT],9,D_D[CAT],1,D_D[LOC],$A28),0)","v":0},{"$f":"IFERROR(SUMIFS(D_D[ADP],D_D[MT],9,D_D[CAT],1,D_D[LOC],$A28),0)","v":0},{"$f":"IF(H28=0, 0,I28/H28)","v":0}]
[331,"St Louis",null,null,null,null,{"$f":"IFERROR(SUMIFS(D_D[INV],D_D[MT],9,D_D[CAT],1,D_D[LOC],$A29),0)","v":0},{"$f":"IFERROR(SUMIFS(D_D[BL],D_D[MT],9,D_D[CAT],1,D_D[LOC],$A29),0)","v":0},{"$f":"IFERROR(SUMIFS(D_D[ADP],D_D[MT],9,D_D[CAT],1,D_D[LOC],$A29),0)","v":0},{"$f":"IFERROR(I29/H29,0)","v":0}]
[351,"Muskogee",null,null,null,null,{"$f":"IFERROR(SUMIFS(D_D[INV],D_D[MT],9,D_D[CAT],1,D_D[LOC],$A30),0)","v":1936},{"$f":"IFERROR(SUMIFS(D_D[BL],D_D[MT],9,D_D[CAT],1,D_D[LOC],$A30),0)","v":2431},{"$f":"IFERROR(SUMIFS(D_D[ADP],D_D[MT],9,D_D[CAT],1,D_D[LOC],$A30),0)","v":-495},{"$f":"IFERROR(I30/H30,0)","v":-0.20361990950226244}]
[1,"Total Education Claims - All Education Programs **",null,null,null,null,{"$f":"IFERROR(SUMIFS(D_D[INV],D_D[MT],9,D_D[CAT],2,D_D[LOC],$A31),0)","v":45327},{"$f":"IFERROR(SUMIFS(D_D[BL],D_D[MT],9,D_D[CAT],2,D_D[LOC],$A31),0)","v":49838},{"$f":"IFERROR(SUMIFS(D_D[ADP],D_D[MT],9,D_D[CAT],2,D_D[LOC],$A31),0)","v":-4511},{"$f":"IFERROR(I31/H31,0)","v":-9.0513262972029371E-2}]
[307,"Buffalo",null,null,null,null,{"$f":"IFERROR(SUMIFS(D_D[INV],D_D[MT],9,D_D[CAT],2,D_D[LOC],$A32),0)","v":20031},{"$f":"IFERROR(SUMIFS(D_D[BL],D_D[MT],9,D_D[CAT],2,D_D[LOC],$A32),0)","v":22015},{"$f":"IFERROR(SUMIFS(D_D[ADP],D_D[MT],9,D_D[CAT],2,D_D[LOC],$A32),0)","v":-1984},{"$f":"IFERROR(I32/H32,0)","v":-9.0120372473313656E-2}]
[316,"Atlanta",null,null,null,null,{"$f":"IFERROR(SUMIFS(D_D[INV],D_D[MT],9,D_D[CAT],2,D_D[LOC],$A33),0)","v":0},{"$f":"IFERROR(SUMIFS(D_D[BL],D_D[MT],9,D_D[CAT],2,D_D[LOC],$A33),0)","v":0},{"$f":"IFERROR(SUMIFS(D_D[ADP],D_D[MT],9,D_D[CAT],2,D_D[LOC],$A33),0)","v":0},{"$f":"IF(H33=0, 0,I33/H33)","v":0}]
[331,"St Louis",null,null,null,null,{"$f":"IFERROR(SUMIFS(D_D[INV],D_D[MT],9,D_D[CAT],2,D_D[LOC],$A34),0)","v":0},{"$f":"IFERROR(SUMIFS(D_D[BL],D_D[MT],9,D_D[CAT],2,D_D[LOC],$A34),0)","v":0},{"$f":"IFERROR(SUMIFS(D_D[ADP],D_D[MT],9,D_D[CAT],2,D_D[LOC],$A34),0)","v":0},{"$f":"IFERROR(I34/H34,0)","v":0}]
[351,"Muskogee",null,null,null,null,{"$f":"IFERROR(SUMIFS(D_D[INV],D_D[MT],9,D_D[CAT],2,D_D[LOC],$A35),0)","v":25296},{"$f":"IFERROR(SUMIFS(D_D[BL],D_D[MT],9,D_D[CAT],2,D_D[LOC],$A35),0)","v":27823},{"$f":"IFERROR(SUMIFS(D_D[ADP],D_D[MT],9,D_D[CAT],2,D_D[LOC],$A35),0)","v":-2527},{"$f":"IFERROR(I35/H35,0)","v":-9.0824138302842972E-2}]
[]
[null,"*Chapter 33 is the Post-9/11GI Bill. "]
[null,"**Represents all Education Benefit Programs, including  Chapter 33 claims."]

{"sheet":"Rating Bundle - SOJ","index":2,"n_rows":35,"n_cols":17,"rows_kept":35,"cut":false,"hidden":false,"merged":[[8,12,10,12],[8,13,8,14],[9,14,10,14],[8,15,8,16],[6,11,6,16],[8,8,10,8],[8,9,10,9],[8,10,10,10],[8,11,10,11],[1,3,1,10],[1,11,1,16],[2,3,2,10],[2,11,2,16],[8,3,10,3],[8,4,10,4],[8,5,10,5],[8,6,10,6],[8,7,10,7],[9,16,10,16],[7,3,7,10],[7,11,7,16]]}
[]
[null,null,"DISTRICT SELECTOR","Compensation and Pension Rating Bundle Metrics",null,null,null,null,null,null,null,"Report through"]
[null,null,null,"Station of Jurisdiction View",null,null,null,null,null,null,null,{"$f":"D_DT[]","v":"2022-05-28"}]
[null,null,null,"The Station of Jurisdiction (SOJ)  is the regional office assigned to work the claim",null,null,null,null,null,null,null,"ADP = Average Days Pending",null,null,"MTD = Month to Date"]
[null,null,null,"Each Special Mission has distinct claim counts",null,null,null,null,null,null,null,"ADC = Average Days to Complete",null,null,"FYTD = Fiscal Year to Date"]
[null,null,null,"When Special Mission is set to Pension, BDD, or Quickstart, the District Selector has no impact"]
[null,null,null,null,null,null,null,null,null,null,null,"Accuracy is available in Compensation and Pension Special Missions"]
[null,null,null,"CLAIM METRICS",null,null,null,null,null,null,null,"ACCURACY METRICS"]
[null,null,"SPECIAL MISSION SELECTOR","#\nPending","#\nPending\n> 125 Days","%\nPending\n> 125 Days","ADP","#\nCompleted\nMTD","ADC\nMTD","#\nCompleted\nFYTD","ADC\nFYTD","Rating\n3 Month Issue","Rating\n3 Month\nClaim","Rating 12 Month",null,"Authorization 12 Month"]
[null,null,null,null,null,null,null,null,null,null,null,null,null,"%","Margin of Error +/-","%","Margin of Error +/-"]
[null,null,null,null,null,null,null,null,null,null,null,null,null,"Correct",null,"Correct"]
[100,null,{"$f":"Driver!$C$20& \" Total\"","v":"USA - All Missions Total"},{"$f":"IF(ISNA($A12),\"\",IFERROR(SUMIFS(D_D[INV],D_D[MT],5,D_D[CAT],SMS, D_D[EP],-1,D_D[LOC],$A12),0))","v":592345},{"$f":"IF(ISNA($A12),\"\",IFERROR(SUMIFS(D_D[BL],D_D[MT],5,D_D[CAT],SMS, D_D[EP],-1,D_D[LOC],$A12),0))","v":196852},{"$f":"IF(ISNA($A12),\"\",IFERROR(E12/D12,0))","v":0.33232660020764926},{"$f":"IF(ISNA($A12),\"\",IFERROR(SUMIFS(D_D[ADP],D_D[MT],5,D_D[CAT],SMS, D_D[EP],-1,D_D[LOC],$A12),0))","v":143.19},{"$f":"IF(ISNA($A12),\"\",IFERROR(SUMIFS(D_D[PROD_MTD],D_D[MT],5,D_D[CAT],SMS, D_D[EP],-1,D_D[LOC],$A12),0))","v":142986},{"$f":"IF(ISNA($A12),\"\",IFERROR(SUMIFS(D_D[ADCM],D_D[MT],5,D_D[CAT],SMS, D_D[EP],-1,D_D[LOC],$A12),0))","v":166.97},{"$f":"IF(ISNA($A12),\"\",IFERROR(SUMIFS(D_D[PROD_FYTD],D_D[MT],5,D_D[CAT],SMS, D_D[EP],-1,D_D[LOC],$A12),0))","v":1105676},{"$f":"IF(ISNA($A12),\"\",IFERROR(SUMIFS(D_D[ADCF],D_D[MT],5,D_D[CAT],SMS, D_D[EP],-1,D_D[LOC],$A12),0))","v":138.44},{"$f":"IF(ISNA($A12-99),\"\",IFERROR(SUMIFS(D_D[INV],D_D[MT],8,D_D[CAT],SMS,D_D[LOC],$A12-99),0))","v":0},{"$f":"IF(ISNA($A12-99),\"\",IFERROR(SUMIFS(D_D[BL],D_D[MT],8,D_D[CAT],SMS,D_D[LOC],$A12-99),0))","v":0},{"$f":"IF(ISNA($A12-99),\"\",IFERROR(SUMIFS(D_D[ADP],D_D[MT],8,D_D[CAT],SMS,D_D[LOC],$A12-99),0))","v":0},{"$f":"IF(ISNA($A12-99),\"\",IFERROR(SUMIFS(D_D[PROD_MTD],D_D[MT],8,D_D[CAT],SMS,D_D[LOC],$A12-99),0))","v":0},{"$f":"IF(ISNA($A12-99),\"\",IFERROR(SUMIFS(D_D[PROD_FYTD],D_D[MT],8,D_D[CAT],SMS,D_D[LOC],$A12-99),0))","v":0},{"$f":"IF(ISNA($A12-99),\"\",IFERROR(SUMIFS(D_D[ADCM],D_D[MT],8,D_D[CAT],SMS,D_D[LOC],$A12-99),0))","v":0}]
[{"$f":"INDEX(RO,(MATCH($C13,RO_D,0)))","v":"395"},1,{"$f":"IFERROR(INDEX(INDIRECT(DS_RO_N),B13),\"\")","v":"Pacific District"},{"$f":"IF(ISNA($A13),\"\",IFERROR(SUMIFS(D_D[INV],D_D[MT],5,D_D[CAT],SMS, D_D[EP],-1,D_D[LOC],$A13),0))","v":17054},{"$f":"IF(ISNA($A13),\"\",IFERROR(SUMIFS(D_D[BL],D_D[MT],5,D_D[CAT],SMS, D_D[EP],-1,D_D[LOC],$A13),0))","v":6017},{"$f":"IF(ISNA($A13),\"\",IFERROR(E13/D13,0))","v":0.35282045267972323},{"$f":"IF(ISNA($A13),\"\",IFERROR(SUMIFS(D_D[ADP],D_D[MT],5,D_D[CAT],SMS, D_D[EP],-1,D_D[LOC],$A13),0))","v":144.81},{"$f":"IF(ISNA($A13),\"\",IFERROR(SUMIFS(D_D[PROD_MTD],D_D[MT],5,D_D[CAT],SMS, D_D[EP],-1,D_D[LOC],$A13),0))","v":29252},{"$f":"IF(ISNA($A13),\"\",IFERROR(SUMIFS(D_D[ADCM],D_D[MT],5,D_D[CAT],SMS, D_D[EP],-1,D_D[LOC],$A13),0))","v":166.45},{"$f":"IF(ISNA($A13),\"\",IFERROR(SUMIFS(D_D[PROD_FYTD],D_D[MT],5,D_D[CAT],SMS, D_D[EP],-1,D_D[LOC],$A13),0))","v":229184},{"$f":"IF(ISNA($A13),\"\",IFERROR(SUMIFS(D_D[ADCF],D_D[MT],5,D_D[CAT],SMS, D_D[EP],-1,D_D[LOC],$A13),0))","v":136.08000000000001},{"$f":"IF(ISNA($A13),\"\",IFERROR(SUMIFS(D_D[INV],D_D[MT],8,D_D[CAT],SMS,D_D[LOC],$A13),0))","v":0},{"$f":"IF(ISNA($A13),\"\",IFERROR(SUMIFS(D_D[BL],D_D[MT],8,D_D[CAT],SMS,D_D[LOC],$A13),0))","v":0},{"$f":"IF(ISNA($A13),\"\",IFERROR(SUMIFS(D_D[ADP],D_D[MT],8,D_D[CAT],SMS,D_D[LOC],$A13),0))","v":0},{"$f":"IF(ISNA($A13),\"\",IFERROR(SUMIFS(D_D[PROD_MTD],D_D[MT],8,D_D[CAT],SMS,D_D[LOC],$A13),0))","v":0},{"$f":"IF(ISNA($A13),\"\",IFERROR(SUMIFS(D_D[PROD_FYTD],D_D[MT],8,D_D[CAT],SMS,D_D[LOC],$A13),0))","v":0},{"$f":"IF(ISNA($A13),\"\",IFERROR(SUMIFS(D_D[ADCM],D_D[MT],8,D_D[CAT],SMS,D_D[LOC],$A13),0))","v":0}]
["340",2,{"$f":"IFERROR(INDEX(INDIRECT(DS_RO_N),B14),\"\")","v":"Albuquerque"},{"$f":"IF(ISNA($A14),\"\",IFERROR(SUMIFS(D_D[INV],D_D[MT],5,D_D[CAT],SMS, D_D[EP],-1,D_D[LOC],$A14),0))","v":525},{"$f":"IF(ISNA($A14),\"\",IFERROR(SUMIFS(D_D[BL],D_D[MT],5,D_D[CAT],SMS, D_D[EP],-1,D_D[LOC],$A14),0))","v":170},{"$f":"IF(ISNA($A14),\"\",IFERROR(E14/D14,0))","v":0.32380952380952382},{"$f":"IF(ISNA($A14),\"\",IFERROR(SUMIFS(D_D[ADP],D_D[MT],5,D_D[CAT],SMS, D_D[EP],-1,D_D[LOC],$A14),0))","v":118.42},{"$f":"IF(ISNA($A14),\"\",IFERROR(SUMIFS(D_D[PROD_MTD],D_D[MT],5,D_D[CAT],SMS, D_D[EP],-1,D_D[LOC],$A14),0))","v":802},{"$f":"IF(ISNA($A14),\"\",IFERROR(SUMIFS(D_D[ADCM],D_D[MT],5,D_D[CAT],SMS, D_D[EP],-1,D_D[LOC],$A14),0))","v":193.46},{"$f":"IF(ISNA($A14),\"\",IFERROR(SUMIFS(D_D[PROD_FYTD],D_D[MT],5,D_D[CAT],SMS, D_D[EP],-1,D_D[LOC],$A14),0))","v":6667},{"$f":"IF(ISNA($A14),\"\",IFERROR(SUMIFS(D_D[ADCF],D_D[MT],5,D_D[CAT],SMS, D_D[EP],-1,D_D[LOC],$A14),0))","v":165.14},{"$f":"IF(ISNA($A14),\"\",IFERROR(SUMIFS(D_D[INV],D_D[MT],8,D_D[CAT],SMS,D_D[LOC],$A14),0))","v":0},{"$f":"IF(ISNA($A14),\"\",IFERROR(SUMIFS(D_D[BL],D_D[MT],8,D_D[CAT],SMS,D_D[LOC],$A14),0))","v":0},{"$f":"IF(ISNA($A14),\"\",IFERROR(SUMIFS(D_D[ADP],D_D[MT],8,D_D[CAT],SMS,D_D[LOC],$A14),0))","v":0},{"$f":"IF(ISNA($A14),\"\",IFERROR(SUMIFS(D_D[PROD_MTD],D_D[MT],8,D_D[CAT],SMS,D_D[LOC],$A14),0))","v":0},{"$f":"IF(ISNA($A14),\"\",IFERROR(SUMIFS(D_D[PROD_FYTD],D_D[MT],8,D_D[CAT],SMS,D_D[LOC],$A14),0))","v":0},{"$f":"IF(ISNA($A14),\"\",IFERROR(SUMIFS(D_D[ADCM],D_D[MT],8,D_D[CAT],SMS,D_D[LOC],$A14),0))","v":0}]
["463",3,"Anchorage",{"$f":"IF(ISNA($A15),\"\",IFERROR(SUMIFS(D_D[INV],D_D[MT],5,D_D[CAT],SMS, D_D[EP],-1,D_D[LOC],$A15),0))","v":231},{"$f":"IF(ISNA($A15),\"\",IFERROR(SUMIFS(D_D[BL],D_D[MT],5,D_D[CAT],SMS, D_D[EP],-1,D_D[LOC],$A15),0))","v":103},0.44588744588744589,{"$f":"IF(ISNA($A15),\"\",IFERROR(SUMIFS(D_D[ADP],D_D[MT],5,D_D[CAT],SMS, D_D[EP],-1,D_D[LOC],$A15),0))","v":153.07},{"$f":"IF(ISNA($A15),\"\",IFERROR(SUMIFS(D_D[PROD_MTD],D_D[MT],5,D_D[CAT],SMS, D_D[EP],-1,D_D[LOC],$A15),0))","v":369},{"$f":"IF(ISNA($A15),\"\",IFERROR(SUMIFS(D_D[ADCM],D_D[MT],5,D_D[CAT],SMS, D_D[EP],-1,D_D[LOC],$A15),0))","v":228.62},{"$f":"IF(ISNA($A15),\"\",IFERROR(SUMIFS(D_D[PROD_FYTD],D_D[MT],5,D_D[CAT],SMS, D_D[EP],-1,D_D[LOC],$A15),0))","v":2205},{"$f":"IF(ISNA($A15),\"\",IFERROR(SUMIFS(D_D[ADCF],D_D[MT],5,D_D[CAT],SMS, D_D[EP],-1,D_D[LOC],$A15),0))","v":176.33},{"$f":"IF(ISNA($A15),\"\",IFERROR(SUMIFS(D_D[INV],D_D[MT],8,D_D[CAT],SMS,D_D[LOC],$A15),0))","v":0},{"$f":"IF(ISNA($A15),\"\",IFERROR(SUMIFS(D_D[BL],D_D[MT],8,D_D[CAT],SMS,D_D[LOC],$A15),0))","v":0},{"$f":"IF(ISNA($A15),\"\",IFERROR(SUMIFS(D_D[ADP],D_D[MT],8,D_D[CAT],SMS,D_D[LOC],$A15),0))","v":0},{"$f":"IF(ISNA($A15),\"\",IFERROR(SUMIFS(D_D[PROD_MTD],D_D[MT],8,D_D[CAT],SMS,D_D[LOC],$A15),0))","v":0},{"$f":"IF(ISNA($A15),\"\",IFERROR(SUMIFS(D_D[PROD_FYTD],D_D[MT],8,D_D[CAT],SMS,D_D[LOC],$A15),0))","v":0},{"$f":"IF(ISNA($A15),\"\",IFERROR(SUMIFS(D_D[ADCM],D_D[MT],8,D_D[CAT],SMS,D_D[LOC],$A15),0))","v":0}]
["347",4,"Boise",{"$f":"IF(ISNA($A16),\"\",IFERROR(SUMIFS(D_D[INV],D_D[MT],5,D_D[CAT],SMS, D_D[EP],-1,D_D[LOC],$A16),0))","v":595},{"$f":"IF(ISNA($A16),\"\",IFERROR(SUMIFS(D_D[BL],D_D[MT],5,D_D[CAT],SMS, D_D[EP],-1,D_D[LOC],$A16),0))","v":107},0.17983193277310924,{"$f":"IF(ISNA($A16),\"\",IFERROR(SUMIFS(D_D[ADP],D_D[MT],5,D_D[CAT],SMS, D_D[EP],-1,D_D[LOC],$A16),0))","v":91.82},{"$f":"IF(ISNA($A16),\"\",IFERROR(SUMIFS(D_D[PROD_MTD],D_D[MT],5,D_D[CAT],SMS, D_D[EP],-1,D_D[LOC],$A16),0))","v":1216},{"$f":"IF(ISNA($A16),\"\",IFERROR(SUMIFS(D_D[ADCM],D_D[MT],5,D_D[CAT],SMS, D_D[EP],-1,D_D[LOC],$A16),0))","v":130.9},{"$f":"IF(ISNA($A16),\"\",IFERROR(SUMIFS(D_D[PROD_FYTD],D_D[MT],5,D_D[CAT],SMS, D_D[EP],-1,D_D[LOC],$A16),0))","v":9545},{"$f":"IF(ISNA($A16),\"\",IFERROR(SUMIFS(D_D[ADCF],D_D[MT],5,D_D[CAT],SMS, D_D[EP],-1,D_D[LOC],$A16),0))","v":122.99},{"$f":"IF(ISNA($A16),\"\",IFERROR(SUMIFS(D_D[INV],D_D[MT],8,D_D[CAT],SMS,D_D[LOC],$A16),0))","v":0},{"$f":"IF(ISNA($A16),\"\",IFERROR(SUMIFS(D_D[BL],D_D[MT],8,D_D[CAT],SMS,D_D[LOC],$A16),0))","v":0},{"$f":"IF(ISNA($A16),\"\",IFERROR(SUMIFS(D_D[ADP],D_D[MT],8,D_D[CAT],SMS,D_D[LOC],$A16),0))","v":0},{"$f":"IF(ISNA($A16),\"\",IFERROR(SUMIFS(D_D[PROD_MTD],D_D[MT],8,D_D[CAT],SMS,D_D[LOC],$A16),0))","v":0},{"$f":"IF(ISNA($A16),\"\",IFERROR(SUMIFS(D_D[PROD_FYTD],D_D[MT],8,D_D[CAT],SMS,D_D[LOC],$A16),0))","v":0},{"$f":"IF(ISNA($A16),\"\",IFERROR(SUMIFS(D_D[ADCM],D_D[MT],8,D_D[CAT],SMS,D_D[LOC],$A16),0))","v":0}]
["459",5,"Honolulu",{"$f":"IF(ISNA($A17),\"\",IFERROR(SUMIFS(D_D[INV],D_D[MT],5,D_D[CAT],SMS, D_D[EP],-1,D_D[LOC],$A17),0))","v":329},{"$f":"IF(ISNA($A17),\"\",IFERROR(SUMIFS(D_D[BL],D_D[MT],5,D_D[CAT],SMS, D_D[EP],-1,D_D[LOC],$A17),0))","v":100},0.303951367781155,{"$f":"IF(ISNA($A17),\"\",IFERROR(SUMIFS(D_D[ADP],D_D[MT],5,D_D[CAT],SMS, D_D[EP],-1,D_D[LOC],$A17),0))","v":113.45},{"$f":"IF(ISNA($A17),\"\",IFERROR(SUMIFS(D_D[PROD_MTD],D_D[MT],5,D_D[CAT],SMS, D_D[EP],-1,D_D[LOC],$A17),0))","v":806},{"$f":"IF(ISNA($A17),\"\",IFERROR(SUMIFS(D_D[ADCM],D_D[MT],5,D_D[CAT],SMS, D_D[EP],-1,D_D[LOC],$A17),0))","v":163.04},{"$f":"IF(ISNA($A17),\"\",IFERROR(SUMIFS(D_D[PROD_FYTD],D_D[MT],5,D_D[CAT],SMS, D_D[EP],-1,D_D[LOC],$A17),0))","v":6462},{"$f":"IF(ISNA($A17),\"\",IFERROR(SUMIFS(D_D[ADCF],D_D[MT],5,D_D[CAT],SMS, D_D[EP],-1,D_D[LOC],$A17),0))","v":142.74},{"$f":"IF(ISNA($A17),\"\",IFERROR(SUMIFS(D_D[INV],D_D[MT],8,D_D[CAT],SMS,D_D[LOC],$A17),0))","v":0},{"$f":"IF(ISNA($A17),\"\",IFERROR(SUMIFS(D_D[BL],D_D[MT],8,D_D[CAT],SMS,D_D[LOC],$A17),0))","v":0},{"$f":"IF(ISNA($A17),\"\",IFERROR(SUMIFS(D_D[ADP],D_D[MT],8,D_D[CAT],SMS,D_D[LOC],$A17),0))","v":0},{"$f":"IF(ISNA($A17),\"\",IFERROR(SUMIFS(D_D[PROD_MTD],D_D[MT],8,D_D[CAT],SMS,D_D[LOC],$A17),0))","v":0},{"$f":"IF(ISNA($A17),\"\",IFERROR(SUMIFS(D_D[PROD_FYTD],D_D[MT],8,D_D[CAT],SMS,D_D[LOC],$A17),0))","v":0},{"$f":"IF(ISNA($A17),\"\",IFERROR(SUMIFS(D_D[ADCM],D_D[MT],8,D_D[CAT],SMS,D_D[LOC],$A17),0))","v":0}]
["344",6,"Los Angeles",{"$f":"IF(ISNA($A18),\"\",IFERROR(SUMIFS(D_D[INV],D_D[MT],5,D_D[CAT],SMS, D_D[EP],-1,D_D[LOC],$A18),0))","v":1524},{"$f":"IF(ISNA($A18),\"\",IFERROR(SUMIFS(D_D[BL],D_D[MT],5,D_D[CAT],SMS, D_D[EP],-1,D_D[LOC],$A18),0))","v":505},0.33136482939632544,{"$f":"IF(ISNA($A18),\"\",IFERROR(SUMIFS(D_D[ADP],D_D[MT],5,D_D[CAT],SMS, D_D[EP],-1,D_D[LOC],$A18),0))","v":132.22999999999999},{"$f":"IF(ISNA($A18),\"\",IFERROR(SUMIFS(D_D[PROD_MTD],D_D[MT],5,D_D[CAT],SMS, D_D[EP],-1,D_D[LOC],$A18),0))","v":2194},{"$f":"IF(ISNA($A18),\"\",IFERROR(SUMIFS(D_D[ADCM],D_D[MT],5,D_D[CAT],SMS, D_D[EP],-1,D_D[LOC],$A18),0))","v":175.89},{"$f":"IF(ISNA($A18),\"\",IFERROR(SUMIFS(D_D[PROD_FYTD],D_D[MT],5,D_D[CAT],SMS, D_D[EP],-1,D_D[LOC],$A18),0))","v":18005},{"$f":"IF(ISNA($A18),\"\",IFERROR(SUMIFS(D_D[ADCF],D_D[MT],5,D_D[CAT],SMS, D_D[EP],-1,D_D[LOC],$A18),0))","v":140.41},{"$f":"IF(ISNA($A18),\"\",IFERROR(SUMIFS(D_D[INV],D_D[MT],8,D_D[CAT],SMS,D_D[LOC],$A18),0))","v":0},{"$f":"IF(ISNA($A18),\"\",IFERROR(SUMIFS(D_D[BL],D_D[MT],8,D_D[CAT],SMS,D_D[LOC],$A18),0))","v":0},{"$f":"IF(ISNA($A18),\"\",IFERROR(SUMIFS(D_D[ADP],D_D[MT],8,D_D[CAT],SMS,D_D[LOC],$A18),0))","v":0},{"$f":"IF(ISNA($A18),\"\",IFERROR(SUMIFS(D_D[PROD_MTD],D_D[MT],8,D_D[CAT],SMS,D_D[LOC],$A18),0))","v":0},{"$f":"IF(ISNA($A18),\"\",IFERROR(SUMIFS(D_D[PROD_FYTD],D_D[MT],8,D_D[CAT],SMS,D_D[LOC],$A18),0))","v":0},{"$f":"IF(ISNA($A18),\"\",IFERROR(SUMIFS(D_D[ADCM],D_D[MT],8,D_D[CAT],SMS,D_D[LOC],$A18),0))","v":0}]
["358",7,"Manila",{"$f":"IF(ISNA($A19),\"\",IFERROR(SUMIFS(D_D[INV],D_D[MT],5,D_D[CAT],SMS, D_D[EP],-1,D_D[LOC],$A19),0))","v":253},{"$f":"IF(ISNA($A19),\"\",IFERROR(SUMIFS(D_D[BL],D_D[MT],5,D_D[CAT],SMS, D_D[EP],-1,D_D[LOC],$A19),0))","v":114},0.45059288537549408,{"$f":"IF(ISNA($A19),\"\",IFERROR(SUMIFS(D_D[ADP],D_D[MT],5,D_D[CAT],SMS, D_D[EP],-1,D_D[LOC],$A19),0))","v":166.9},{"$f":"IF(ISNA($A19),\"\",IFERROR(SUMIFS(D_D[PROD_MTD],D_D[MT],5,D_D[CAT],SMS, D_D[EP],-1,D_D[LOC],$A19),0))","v":916},{"$f":"IF(ISNA($A19),\"\",IFERROR(SUMIFS(D_D[ADCM],D_D[MT],5,D_D[CAT],SMS, D_D[EP],-1,D_D[LOC],$A19),0))","v":143.22},{"$f":"IF(ISNA($A19),\"\",IFERROR(SUMIFS(D_D[PROD_FYTD],D_D[MT],5,D_D[CAT],SMS, D_D[EP],-1,D_D[LOC],$A19),0))","v":6637},{"$f":"IF(ISNA($A19),\"\",IFERROR(SUMIFS(D_D[ADCF],D_D[MT],5,D_D[CAT],SMS, D_D[EP],-1,D_D[LOC],$A19),0))","v":139.30000000000001},{"$f":"IF(ISNA($A19),\"\",IFERROR(SUMIFS(D_D[INV],D_D[MT],8,D_D[CAT],SMS,D_D[LOC],$A19),0))","v":0},{"$f":"IF(ISNA($A19),\"\",IFERROR(SUMIFS(D_D[BL],D_D[MT],8,D_D[CAT],SMS,D_D[LOC],$A19),0))","v":0},{"$f":"IF(ISNA($A19),\"\",IFERROR(SUMIFS(D_D[ADP],D_D[MT],8,D_D[CAT],SMS,D_D[LOC],$A19),0))","v":0},{"$f":"IF(ISNA($A19),\"\",IFERROR(SUMIFS(D_D[PROD_MTD],D_D[MT],8,D_D[CAT],SMS,D_D[LOC],$A19),0))","v":0},{"$f":"IF(ISNA($A19),\"\",IFERROR(SUMIFS(D_D[PROD_FYTD],D_D[MT],8,D_D[CAT],SMS,D_D[LOC],$A19),0))","v":0},{"$f":"IF(ISNA($A19),\"\",IFERROR(SUMIFS(D_D[ADCM],D_D[MT],8,D_D[CAT],SMS,D_D[LOC],$A19),0))","v":0}]
["343",8,"Oakland",{"$f":"IF(ISNA($A20),\"\",IFERROR(SUMIFS(D_D[INV],D_D[MT],5,D_D[CAT],SMS, D_D[EP],-1,D_D[LOC],$A20),0))","v":1060},{"$f":"IF(ISNA($A20),\"\",IFERROR(SUMIFS(D_D[BL],D_D[MT],5,D_D[CAT],SMS, D_D[EP],-1,D_D[LOC],$A20),0))","v":483},0.45566037735849058,{"$f":"IF(ISNA($A20),\"\",IFERROR(SUMIFS(D_D[ADP],D_D[MT],5,D_D[CAT],SMS, D_D[EP],-1,D_D[LOC],$A20),0))","v":191.69},{"$f":"IF(ISNA($A20),\"\",IFERROR(SUMIFS(D_D[PROD_MTD],D_D[MT],5,D_D[CAT],SMS, D_D[EP],-1,D_D[LOC],$A20),0))","v":1274},{"$f":"IF(ISNA($A20),\"\",IFERROR(SUMIFS(D_D[ADCM],D_D[MT],5,D_D[CAT],SMS, D_D[EP],-1,D_D[LOC],$A20),0))","v":291.42},{"$f":"IF(ISNA($A20),\"\",IFERROR(SUMIFS(D_D[PROD_FYTD],D_D[MT],5,D_D[CAT],SMS, D_D[EP],-1,D_D[LOC],$A20),0))","v":8812},{"$f":"IF(ISNA($A20),\"\",IFERROR(SUMIFS(D_D[ADCF],D_D[MT],5,D_D[CAT],SMS, D_D[EP],-1,D_D[LOC],$A20),0))","v":218.21},{"$f":"IF(ISNA($A20),\"\",IFERROR(SUMIFS(D_D[INV],D_D[MT],8,D_D[CAT],SMS,D_D[LOC],$A20),0))","v":0},{"$f":"IF(ISNA($A20),\"\",IFERROR(SUMIFS(D_D[BL],D_D[MT],8,D_D[CAT],SMS,D_D[LOC],$A20),0))","v":0},{"$f":"IF(ISNA($A20),\"\",IFERROR(SUMIFS(D_D[ADP],D_D[MT],8,D_D[CAT],SMS,D_D[LOC],$A20),0))","v":0},{"$f":"IF(ISNA($A20),\"\",IFERROR(SUMIFS(D_D[PROD_MTD],D_D[MT],8,D_D[CAT],SMS,D_D[LOC],$A20),0))","v":0},{"$f":"IF(ISNA($A20),\"\",IFERROR(SUMIFS(D_D[PROD_FYTD],D_D[MT],8,D_D[CAT],SMS,D_D[LOC],$A20),0))","v":0},{"$f":"IF(ISNA($A20),\"\",IFERROR(SUMIFS(D_D[ADCM],D_D[MT],8,D_D[CAT],SMS,D_D[LOC],$A20),0))","v":0}]
["345",9,"Phoenix",{"$f":"IF(ISNA($A21),\"\",IFERROR(SUMIFS(D_D[INV],D_D[MT],5,D_D[CAT],SMS, D_D[EP],-1,D_D[LOC],$A21),0))","v":2276},{"$f":"IF(ISNA($A21),\"\",IFERROR(SUMIFS(D_D[BL],D_D[MT],5,D_D[CAT],SMS, D_D[EP],-1,D_D[LOC],$A21),0))","v":996},0.43760984182776802,{"$f":"IF(ISNA($A21),\"\",IFERROR(SUMIFS(D_D[ADP],D_D[MT],5,D_D[CAT],SMS, D_D[EP],-1,D_D[LOC],$A21),0))","v":188.52},{"$f":"IF(ISNA($A21),\"\",IFERROR(SUMIFS(D_D[PROD_MTD],D_D[MT],5,D_D[CAT],SMS, D_D[EP],-1,D_D[LOC],$A21),0))","v":3424},{"$f":"IF(ISNA($A21),\"\",IFERROR(SUMIFS(D_D[ADCM],D_D[MT],5,D_D[CAT],SMS, D_D[EP],-1,D_D[LOC],$A21),0))","v":190.78},{"$f":"IF(ISNA($A21),\"\",IFERROR(SUMIFS(D_D[PROD_FYTD],D_D[MT],5,D_D[CAT],SMS, D_D[EP],-1,D_D[LOC],$A21),0))","v":21809},{"$f":"IF(ISNA($A21),\"\",IFERROR(SUMIFS(D_D[ADCF],D_D[MT],5,D_D[CAT],SMS, D_D[EP],-1,D_D[LOC],$A21),0))","v":172.75},{"$f":"IF(ISNA($A21),\"\",IFERROR(SUMIFS(D_D[INV],D_D[MT],8,D_D[CAT],SMS,D_D[LOC],$A21),0))","v":0},{"$f":"IF(ISNA($A21),\"\",IFERROR(SUMIFS(D_D[BL],D_D[MT],8,D_D[CAT],SMS,D_D[LOC],$A21),0))","v":0},{"$f":"IF(ISNA($A21),\"\",IFERROR(SUMIFS(D_D[ADP],D_D[MT],8,D_D[CAT],SMS,D_D[LOC],$A21),0))","v":0},{"$f":"IF(ISNA($A21),\"\",IFERROR(SUMIFS(D_D[PROD_MTD],D_D[MT],8,D_D[CAT],SMS,D_D[LOC],$A21),0))","v":0},{"$f":"IF(ISNA($A21),\"\",IFERROR(SUMIFS(D_D[PROD_FYTD],D_D[MT],8,D_D[CAT],SMS,D_D[LOC],$A21),0))","v":0},{"$f":"IF(ISNA($A21),\"\",IFERROR(SUMIFS(D_D[ADCM],D_D[MT],8,D_D[CAT],SMS,D_D[LOC],$A21),0))","v":0}]
["348",10,"Portland",{"$f":"IF(ISNA($A22),\"\",IFERROR(SUMIFS(D_D[INV],D_D[MT],5,D_D[CAT],SMS, D_D[EP],-1,D_D[LOC],$A22),0))","v":1565},{"$f":"IF(ISNA($A22),\"\",IFERROR(SUMIFS(D_D[BL],D_D[MT],5,D_D[CAT],SMS, D_D[EP],-1,D_D[LOC],$A22),0))","v":672},0.42939297124600639,{"$f":"IF(ISNA($A22),\"\",IFERROR(SUMIFS(D_D[ADP],D_D[MT],5,D_D[CAT],SMS, D_D[EP],-1,D_D[LOC],$A22),0))","v":158.01},{"$f":"IF(ISNA($A22),\"\",IFERROR(SUMIFS(D_D[PROD_MTD],D_D[MT],5,D_D[CAT],SMS, D_D[EP],-1,D_D[LOC],$A22),0))","v":1472},{"$f":"IF(ISNA($A22),\"\",IFERROR(SUMIFS(D_D[ADCM],D_D[MT],5,D_D[CAT],SMS, D_D[EP],-1,D_D[LOC],$A22),0))","v":221.43},{"$f":"IF(ISNA($A22),\"\",IFERROR(SUMIFS(D_D[PROD_FYTD],D_D[MT],5,D_D[CAT],SMS, D_D[EP],-1,D_D[LOC],$A22),0))","v":13447},{"$f":"IF(ISNA($A22),\"\",IFERROR(SUMIFS(D_D[ADCF],D_D[MT],5,D_D[CAT],SMS, D_D[EP],-1,D_D[LOC],$A22),0))","v":178.21},{"$f":"IF(ISNA($A22),\"\",IFERROR(SUMIFS(D_D[INV],D_D[MT],8,D_D[CAT],SMS,D_D[LOC],$A22),0))","v":0},{"$f":"IF(ISNA($A22),\"\",IFERROR(SUMIFS(D_D[BL],D_D[MT],8,D_D[CAT],SMS,D_D[LOC],$A22),0))","v":0},{"$f":"IF(ISNA($A22),\"\",IFERROR(SUMIFS(D_D[ADP],D_D[MT],8,D_D[CAT],SMS,D_D[LOC],$A22),0))","v":0},{"$f":"IF(ISNA($A22),\"\",IFERROR(SUMIFS(D_D[PROD_MTD],D_D[MT],8,D_D[CAT],SMS,D_D[LOC],$A22),0))","v":0},{"$f":"IF(ISNA($A22),\"\",IFERROR(SUMIFS(D_D[PROD_FYTD],D_D[MT],8,D_D[CAT],SMS,D_D[LOC],$A22),0))","v":0},{"$f":"IF(ISNA($A22),\"\",IFERROR(SUMIFS(D_D[ADCM],D_D[MT],8,D_D[CAT],SMS,D_D[LOC],$A22),0))","v":0}]
["354",11,"Reno",{"$f":"IF(ISNA($A23),\"\",IFERROR(SUMIFS(D_D[INV],D_D[MT],5,D_D[CAT],SMS, D_D[EP],-1,D_D[LOC],$A23),0))","v":509},{"$f":"IF(ISNA($A23),\"\",IFERROR(SUMIFS(D_D[BL],D_D[MT],5,D_D[CAT],SMS, D_D[EP],-1,D_D[LOC],$A23),0))","v":165},0.32416502946954812,{"$f":"IF(ISNA($A23),\"\",IFERROR(SUMIFS(D_D[ADP],D_D[MT],5,D_D[CAT],SMS, D_D[EP],-1,D_D[LOC],$A23),0))","v":135.78},{"$f":"IF(ISNA($A23),\"\",IFERROR(SUMIFS(D_D[PROD_MTD],D_D[MT],5,D_D[CAT],SMS, D_D[EP],-1,D_D[LOC],$A23),0))","v":834},{"$f":"IF(ISNA($A23),\"\",IFERROR(SUMIFS(D_D[ADCM],D_D[MT],5,D_D[CAT],SMS, D_D[EP],-1,D_D[LOC],$A23),0))","v":318.23},{"$f":"IF(ISNA($A23),\"\",IFERROR(SUMIFS(D_D[PROD_FYTD],D_D[MT],5,D_D[CAT],SMS, D_D[EP],-1,D_D[LOC],$A23),0))","v":5563},{"$f":"IF(ISNA($A23),\"\",IFERROR(SUMIFS(D_D[ADCF],D_D[MT],5,D_D[CAT],SMS, D_D[EP],-1,D_D[LOC],$A23),0))","v":210.75},{"$f":"IF(ISNA($A23),\"\",IFERROR(SUMIFS(D_D[INV],D_D[MT],8,D_D[CAT],SMS,D_D[LOC],$A23),0))","v":0},{"$f":"IF(ISNA($A23),\"\",IFERROR(SUMIFS(D_D[BL],D_D[MT],8,D_D[CAT],SMS,D_D[LOC],$A23),0))","v":0},{"$f":"IF(ISNA($A23),\"\",IFERROR(SUMIFS(D_D[ADP],D_D[MT],8,D_D[CAT],SMS,D_D[LOC],$A23),0))","v":0},{"$f":"IF(ISNA($A23),\"\",IFERROR(SUMIFS(D_D[PROD_MTD],D_D[MT],8,D_D[CAT],SMS,D_D[LOC],$A23),0))","v":0},{"$f":"IF(ISNA($A23),\"\",IFERROR(SUMIFS(D_D[PROD_FYTD],D_D[MT],8,D_D[CAT],SMS,D_D[LOC],$A23),0))","v":0},{"$f":"IF(ISNA($A23),\"\",IFERROR(SUMIFS(D_D[ADCM],D_D[MT],8,D_D[CAT],SMS,D_D[LOC],$A23),0))","v":0}]
["341",12,"Salt Lake City",{"$f":"IF(ISNA($A24),\"\",IFERROR(SUMIFS(D_D[INV],D_D[MT],5,D_D[CAT],SMS, D_D[EP],-1,D_D[LOC],$A24),0))","v":1967},{"$f":"IF(ISNA($A24),\"\",IFERROR(SUMIFS(D_D[BL],D_D[MT],5,D_D[CAT],SMS, D_D[EP],-1,D_D[LOC],$A24),0))","v":1002},0.50940518556176917,{"$f":"IF(ISNA($A24),\"\",IFERROR(SUMIFS(D_D[ADP],D_D[MT],5,D_D[CAT],SMS, D_D[EP],-1,D_D[LOC],$A24),0))","v":210.33},{"$f":"IF(ISNA($A24),\"\",IFERROR(SUMIFS(D_D[PROD_MTD],D_D[MT],5,D_D[CAT],SMS, D_D[EP],-1,D_D[LOC],$A24),0))","v":1924},{"$f":"IF(ISNA($A24),\"\",IFERROR(SUMIFS(D_D[ADCM],D_D[MT],5,D_D[CAT],SMS, D_D[EP],-1,D_D[LOC],$A24),0))","v":312.79000000000002},{"$f":"IF(ISNA($A24),\"\",IFERROR(SUMIFS(D_D[PROD_FYTD],D_D[MT],5,D_D[CAT],SMS, D_D[EP],-1,D_D[LOC],$A24),0))","v":12690},{"$f":"IF(ISNA($A24),\"\",IFERROR(SUMIFS(D_D[ADCF],D_D[MT],5,D_D[CAT],SMS, D_D[EP],-1,D_D[LOC],$A24),0))","v":277.17},{"$f":"IF(ISNA($A24),\"\",IFERROR(SUMIFS(D_D[INV],D_D[MT],8,D_D[CAT],SMS,D_D[LOC],$A24),0))","v":0},{"$f":"IF(ISNA($A24),\"\",IFERROR(SUMIFS(D_D[BL],D_D[MT],8,D_D[CAT],SMS,D_D[LOC],$A24),0))","v":0},{"$f":"IF(ISNA($A24),\"\",IFERROR(SUMIFS(D_D[ADP],D_D[MT],8,D_D[CAT],SMS,D_D[LOC],$A24),0))","v":0},{"$f":"IF(ISNA($A24),\"\",IFERROR(SUMIFS(D_D[PROD_MTD],D_D[MT],8,D_D[CAT],SMS,D_D[LOC],$A24),0))","v":0},{"$f":"IF(ISNA($A24),\"\",IFERROR(SUMIFS(D_D[PROD_FYTD],D_D[MT],8,D_D[CAT],SMS,D_D[LOC],$A24),0))","v":0},{"$f":"IF(ISNA($A24),\"\",IFERROR(SUMIFS(D_D[ADCM],D_D[MT],8,D_D[CAT],SMS,D_D[LOC],$A24),0))","v":0}]
["377",13,"San Diego",{"$f":"IF(ISNA($A25),\"\",IFERROR(SUMIFS(D_D[INV],D_D[MT],5,D_D[CAT],SMS, D_D[EP],-1,D_D[LOC],$A25),0))","v":2940},{"$f":"IF(ISNA($A25),\"\",IFERROR(SUMIFS(D_D[BL],D_D[MT],5,D_D[CAT],SMS, D_D[EP],-1,D_D[LOC],$A25),0))","v":875},0.29761904761904762,{"$f":"IF(ISNA($A25),\"\",IFERROR(SUMIFS(D_D[ADP],D_D[MT],5,D_D[CAT],SMS, D_D[EP],-1,D_D[LOC],$A25),0))","v":123.81},{"$f":"IF(ISNA($A25),\"\",IFERROR(SUMIFS(D_D[PROD_MTD],D_D[MT],5,D_D[CAT],SMS, D_D[EP],-1,D_D[LOC],$A25),0))","v":5756},{"$f":"IF(ISNA($A25),\"\",IFERROR(SUMIFS(D_D[ADCM],D_D[MT],5,D_D[CAT],SMS, D_D[EP],-1,D_D[LOC],$A25),0))","v":137.97999999999999},{"$f":"IF(ISNA($A25),\"\",IFERROR(SUMIFS(D_D[PROD_FYTD],D_D[MT],5,D_D[CAT],SMS, D_D[EP],-1,D_D[LOC],$A25),0))","v":51029},{"$f":"IF(ISNA($A25),\"\",IFERROR(SUMIFS(D_D[ADCF],D_D[MT],5,D_D[CAT],SMS, D_D[EP],-1,D_D[LOC],$A25),0))","v":108.94},{"$f":"IF(ISNA($A25),\"\",IFERROR(SUMIFS(D_D[INV],D_D[MT],8,D_D[CAT],SMS,D_D[LOC],$A25),0))","v":0},{"$f":"IF(ISNA($A25),\"\",IFERROR(SUMIFS(D_D[BL],D_D[MT],8,D_D[CAT],SMS,D_D[LOC],$A25),0))","v":0},{"$f":"IF(ISNA($A25),\"\",IFERROR(SUMIFS(D_D[ADP],D_D[MT],8,D_D[CAT],SMS,D_D[LOC],$A25),0))","v":0},{"$f":"IF(ISNA($A25),\"\",IFERROR(SUMIFS(D_D[PROD_MTD],D_D[MT],8,D_D[CAT],SMS,D_D[LOC],$A25),0))","v":0},{"$f":"IF(ISNA($A25),\"\",IFERROR(SUMIFS(D_D[PROD_FYTD],D_D[MT],8,D_D[CAT],SMS,D_D[LOC],$A25),0))","v":0},{"$f":"IF(ISNA($A25),\"\",IFERROR(SUMIFS(D_D[ADCM],D_D[MT],8,D_D[CAT],SMS,D_D[LOC],$A25),0))","v":0}]
["346",14,"Seattle",{"$f":"IF(ISNA($A26),\"\",IFERROR(SUMIFS(D_D[INV],D_D[MT],5,D_D[CAT],SMS, D_D[EP],-1,D_D[LOC],$A26),0))","v":3280},{"$f":"IF(ISNA($A26),\"\",IFERROR(SUMIFS(D_D[BL],D_D[MT],5,D_D[CAT],SMS, D_D[EP],-1,D_D[LOC],$A26),0))","v":725},0.22103658536585366,{"$f":"IF(ISNA($A26),\"\",IFERROR(SUMIFS(D_D[ADP],D_D[MT],5,D_D[CAT],SMS, D_D[EP],-1,D_D[LOC],$A26),0))","v":94.49},{"$f":"IF(ISNA($A26),\"\",IFERROR(SUMIFS(D_D[PROD_MTD],D_D[MT],5,D_D[CAT],SMS, D_D[EP],-1,D_D[LOC],$A26),0))","v":8265},{"$f":"IF(ISNA($A26),\"\",IFERROR(SUMIFS(D_D[ADCM],D_D[MT],5,D_D[CAT],SMS, D_D[EP],-1,D_D[LOC],$A26),0))","v":98},{"$f":"IF(ISNA($A26),\"\",IFERROR(SUMIFS(D_D[PROD_FYTD],D_D[MT],5,D_D[CAT],SMS, D_D[EP],-1,D_D[LOC],$A26),0))","v":66313},{"$f":"IF(ISNA($A26),\"\",IFERROR(SUMIFS(D_D[ADCF],D_D[MT],5,D_D[CAT],SMS, D_D[EP],-1,D_D[LOC],$A26),0))","v":87.65},{"$f":"IF(ISNA($A26),\"\",IFERROR(SUMIFS(D_D[INV],D_D[MT],8,D_D[CAT],SMS,D_D[LOC],$A26),0))","v":0},{"$f":"IF(ISNA($A26),\"\",IFERROR(SUMIFS(D_D[BL],D_D[MT],8,D_D[CAT],SMS,D_D[LOC],$A26),0))","v":0},{"$f":"IF(ISNA($A26),\"\",IFERROR(SUMIFS(D_D[ADP],D_D[MT],8,D_D[CAT],SMS,D_D[LOC],$A26),0))","v":0},{"$f":"IF(ISNA($A26),\"\",IFERROR(SUMIFS(D_D[PROD_MTD],D_D[MT],8,D_D[CAT],SMS,D_D[LOC],$A26),0))","v":0},{"$f":"IF(ISNA($A26),\"\",IFERROR(SUMIFS(D_D[PROD_FYTD],D_D[MT],8,D_D[CAT],SMS,D_D[LOC],$A26),0))","v":0},{"$f":"IF(ISNA($A26),\"\",IFERROR(SUMIFS(D_D[ADCM],D_D[MT],8,D_D[CAT],SMS,D_D[LOC],$A26),0))","v":0}]
[{"$error":"#N/A"},15,"",{"$f":"IF(ISNA($A27),\"\",IFERROR(SUMIFS(D_D[INV],D_D[MT],5,D_D[CAT],SMS, D_D[EP],-1,D_D[LOC],$A27),0))","v":""},{"$f":"IF(ISNA($A27),\"\",IFERROR(SUMIFS(D_D[BL],D_D[MT],5,D_D[CAT],SMS, D_D[EP],-1,D_D[LOC],$A27),0))","v":""},"",{"$f":"IF(ISNA($A27),\"\",IFERROR(SUMIFS(D_D[ADP],D_D[MT],5,D_D[CAT],SMS, D_D[EP],-1,D_D[LOC],$A27),0))","v":""},{"$f":"IF(ISNA($A27),\"\",IFERROR(SUMIFS(D_D[PROD_MTD],D_D[MT],5,D_D[CAT],SMS, D_D[EP],-1,D_D[LOC],$A27),0))","v":""},{"$f":"IF(ISNA($A27),\"\",IFERROR(SUMIFS(D_D[ADCM],D_D[MT],5,D_D[CAT],SMS, D_D[EP],-1,D_D[LOC],$A27),0))","v":""},{"$f":"IF(ISNA($A27),\"\",IFERROR(SUMIFS(D_D[PROD_FYTD],D_D[MT],5,D_D[CAT],SMS, D_D[EP],-1,D_D[LOC],$A27),0))","v":""},{"$f":"IF(ISNA($A27),\"\",IFERROR(SUMIFS(D_D[ADCF],D_D[MT],5,D_D[CAT],SMS, D_D[EP],-1,D_D[LOC],$A27),0))","v":""},{"$f":"IF(ISNA($A27),\"\",IFERROR(SUMIFS(D_D[INV],D_D[MT],8,D_D[CAT],SMS,D_D[LOC],$A27),0))","v":""},{"$f":"IF(ISNA($A27),\"\",IFERROR(SUMIFS(D_D[BL],D_D[MT],8,D_D[CAT],SMS,D_D[LOC],$A27),0))","v":""},{"$f":"IF(ISNA($A27),\"\",IFERROR(SUMIFS(D_D[ADP],D_D[MT],8,D_D[CAT],SMS,D_D[LOC],$A27),0))","v":""},{"$f":"IF(ISNA($A27),\"\",IFERROR(SUMIFS(D_D[PROD_MTD],D_D[MT],8,D_D[CAT],SMS,D_D[LOC],$A27),0))","v":""},{"$f":"IF(ISNA($A27),\"\",IFERROR(SUMIFS(D_D[PROD_FYTD],D_D[MT],8,D_D[CAT],SMS,D_D[LOC],$A27),0))","v":""},{"$f":"IF(ISNA($A27),\"\",IFERROR(SUMIFS(D_D[ADCM],D_D[MT],8,D_D[CAT],SMS,D_D[LOC],$A27),0))","v":""}]
[{"$error":"#N/A"},16,"",{"$f":"IF(ISNA($A28),\"\",IFERROR(SUMIFS(D_D[INV],D_D[MT],5,D_D[CAT],SMS, D_D[EP],-1,D_D[LOC],$A28),0))","v":""},{"$f":"IF(ISNA($A28),\"\",IFERROR(SUMIFS(D_D[BL],D_D[MT],5,D_D[CAT],SMS, D_D[EP],-1,D_D[LOC],$A28),0))","v":""},"",{"$f":"IF(ISNA($A28),\"\",IFERROR(SUMIFS(D_D[ADP],D_D[MT],5,D_D[CAT],SMS, D_D[EP],-1,D_D[LOC],$A28),0))","v":""},{"$f":"IF(ISNA($A28),\"\",IFERROR(SUMIFS(D_D[PROD_MTD],D_D[MT],5,D_D[CAT],SMS, D_D[EP],-1,D_D[LOC],$A28),0))","v":""},{"$f":"IF(ISNA($A28),\"\",IFERROR(SUMIFS(D_D[ADCM],D_D[MT],5,D_D[CAT],SMS, D_D[EP],-1,D_D[LOC],$A28),0))","v":""},{"$f":"IF(ISNA($A28),\"\",IFERROR(SUMIFS(D_D[PROD_FYTD],D_D[MT],5,D_D[CAT],SMS, D_D[EP],-1,D_D[LOC],$A28),0))","v":""},{"$f":"IF(ISNA($A28),\"\",IFERROR(SUMIFS(D_D[ADCF],D_D[MT],5,D_D[CAT],SMS, D_D[EP],-1,D_D[LOC],$A28),0))","v":""},{"$f":"IF(ISNA($A28),\"\",IFERROR(SUMIFS(D_D[INV],D_D[MT],8,D_D[CAT],SMS,D_D[LOC],$A28),0))","v":""},{"$f":"IF(ISNA($A28),\"\",IFERROR(SUMIFS(D_D[BL],D_D[MT],8,D_D[CAT],SMS,D_D[LOC],$A28),0))","v":""},{"$f":"IF(ISNA($A28),\"\",IFERROR(SUMIFS(D_D[ADP],D_D[MT],8,D_D[CAT],SMS,D_D[LOC],$A28),0))","v":""},{"$f":"IF(ISNA($A28),\"\",IFERROR(SUMIFS(D_D[PROD_MTD],D_D[MT],8,D_D[CAT],SMS,D_D[LOC],$A28),0))","v":""},{"$f":"IF(ISNA($A28),\"\",IFERROR(SUMIFS(D_D[PROD_FYTD],D_D[MT],8,D_D[CAT],SMS,D_D[LOC],$A28),0))","v":""},{"$f":"IF(ISNA($A28),\"\",IFERROR(SUMIFS(D_D[ADCM],D_D[MT],8,D_D[CAT],SMS,D_D[LOC],$A28),0))","v":""}]
[{"$error":"#N/A"},17,"",{"$f":"IF(ISNA($A29),\"\",IFERROR(SUMIFS(D_D[INV],D_D[MT],5,D_D[CAT],SMS, D_D[EP],-1,D_D[LOC],$A29),0))","v":""},{"$f":"IF(ISNA($A29),\"\",IFERROR(SUMIFS(D_D[BL],D_D[MT],5,D_D[CAT],SMS, D_D[EP],-1,D_D[LOC],$A29),0))","v":""},"",{"$f":"IF(ISNA($A29),\"\",IFERROR(SUMIFS(D_D[ADP],D_D[MT],5,D_D[CAT],SMS, D_D[EP],-1,D_D[LOC],$A29),0))","v":""},{"$f":"IF(ISNA($A29),\"\",IFERROR(SUMIFS(D_D[PROD_MTD],D_D[MT],5,D_D[CAT],SMS, D_D[EP],-1,D_D[LOC],$A29),0))","v":""},{"$f":"IF(ISNA($A29),\"\",IFERROR(SUMIFS(D_D[ADCM],D_D[MT],5,D_D[CAT],SMS, D_D[EP],-1,D_D[LOC],$A29),0))","v":""},{"$f":"IF(ISNA($A29),\"\",IFERROR(SUMIFS(D_D[PROD_FYTD],D_D[MT],5,D_D[CAT],SMS, D_D[EP],-1,D_D[LOC],$A29),0))","v":""},{"$f":"IF(ISNA($A29),\"\",IFERROR(SUMIFS(D_D[ADCF],D_D[MT],5,D_D[CAT],SMS, D_D[EP],-1,D_D[LOC],$A29),0))","v":""},{"$f":"IF(ISNA($A29),\"\",IFERROR(SUMIFS(D_D[INV],D_D[MT],8,D_D[CAT],SMS,D_D[LOC],$A29),0))","v":""},{"$f":"IF(ISNA($A29),\"\",IFERROR(SUMIFS(D_D[BL],D_D[MT],8,D_D[CAT],SMS,D_D[LOC],$A29),0))","v":""},{"$f":"IF(ISNA($A29),\"\",IFERROR(SUMIFS(D_D[ADP],D_D[MT],8,D_D[CAT],SMS,D_D[LOC],$A29),0))","v":""},{"$f":"IF(ISNA($A29),\"\",IFERROR(SUMIFS(D_D[PROD_MTD],D_D[MT],8,D_D[CAT],SMS,D_D[LOC],$A29),0))","v":""},{"$f":"IF(ISNA($A29),\"\",IFERROR(SUMIFS(D_D[PROD_FYTD],D_D[MT],8,D_D[CAT],SMS,D_D[LOC],$A29),0))","v":""},{"$f":"IF(ISNA($A29),\"\",IFERROR(SUMIFS(D_D[ADCM],D_D[MT],8,D_D[CAT],SMS,D_D[LOC],$A29),0))","v":""}]
[{"$error":"#N/A"},18,"",{"$f":"IF(ISNA($A30),\"\",IFERROR(SUMIFS(D_D[INV],D_D[MT],5,D_D[CAT],SMS, D_D[EP],-1,D_D[LOC],$A30),0))","v":""},{"$f":"IF(ISNA($A30),\"\",IFERROR(SUMIFS(D_D[BL],D_D[MT],5,D_D[CAT],SMS, D_D[EP],-1,D_D[LOC],$A30),0))","v":""},"",{"$f":"IF(ISNA($A30),\"\",IFERROR(SUMIFS(D_D[ADP],D_D[MT],5,D_D[CAT],SMS, D_D[EP],-1,D_D[LOC],$A30),0))","v":""},{"$f":"IF(ISNA($A30),\"\",IFERROR(SUMIFS(D_D[PROD_MTD],D_D[MT],5,D_D[CAT],SMS, D_D[EP],-1,D_D[LOC],$A30),0))","v":""},{"$f":"IF(ISNA($A30),\"\",IFERROR(SUMIFS(D_D[ADCM],D_D[MT],5,D_D[CAT],SMS, D_D[EP],-1,D_D[LOC],$A30),0))","v":""},{"$f":"IF(ISNA($A30),\"\",IFERROR(SUMIFS(D_D[PROD_FYTD],D_D[MT],5,D_D[CAT],SMS, D_D[EP],-1,D_D[LOC],$A30),0))","v":""},{"$f":"IF(ISNA($A30),\"\",IFERROR(SUMIFS(D_D[ADCF],D_D[MT],5,D_D[CAT],SMS, D_D[EP],-1,D_D[LOC],$A30),0))","v":""},{"$f":"IF(ISNA($A30),\"\",IFERROR(SUMIFS(D_D[INV],D_D[MT],8,D_D[CAT],SMS,D_D[LOC],$A30),0))","v":""},{"$f":"IF(ISNA($A30),\"\",IFERROR(SUMIFS(D_D[BL],D_D[MT],8,D_D[CAT],SMS,D_D[LOC],$A30),0))","v":""},{"$f":"IF(ISNA($A30),\"\",IFERROR(SUMIFS(D_D[ADP],D_D[MT],8,D_D[CAT],SMS,D_D[LOC],$A30),0))","v":""},{"$f":"IF(ISNA($A30),\"\",IFERROR(SUMIFS(D_D[PROD_MTD],D_D[MT],8,D_D[CAT],SMS,D_D[LOC],$A30),0))","v":""},{"$f":"IF(ISNA($A30),\"\",IFERROR(SUMIFS(D_D[PROD_FYTD],D_D[MT],8,D_D[CAT],SMS,D_D[LOC],$A30),0))","v":""},{"$f":"IF(ISNA($A30),\"\",IFERROR(SUMIFS(D_D[ADCM],D_D[MT],8,D_D[CAT],SMS,D_D[LOC],$A30),0))","v":""}]
[{"$error":"#N/A"},19,"",{"$f":"IF(ISNA($A31),\"\",IFERROR(SUMIFS(D_D[INV],D_D[MT],5,D_D[CAT],SMS, D_D[EP],-1,D_D[LOC],$A31),0))","v":""},{"$f":"IF(ISNA($A31),\"\",IFERROR(SUMIFS(D_D[BL],D_D[MT],5,D_D[CAT],SMS, D_D[EP],-1,D_D[LOC],$A31),0))","v":""},"",{"$f":"IF(ISNA($A31),\"\",IFERROR(SUMIFS(D_D[ADP],D_D[MT],5,D_D[CAT],SMS, D_D[EP],-1,D_D[LOC],$A31),0))","v":""},{"$f":"IF(ISNA($A31),\"\",IFERROR(SUMIFS(D_D[PROD_MTD],D_D[MT],5,D_D[CAT],SMS, D_D[EP],-1,D_D[LOC],$A31),0))","v":""},{"$f":"IF(ISNA($A31),\"\",IFERROR(SUMIFS(D_D[ADCM],D_D[MT],5,D_D[CAT],SMS, D_D[EP],-1,D_D[LOC],$A31),0))","v":""},{"$f":"IF(ISNA($A31),\"\",IFERROR(SUMIFS(D_D[PROD_FYTD],D_D[MT],5,D_D[CAT],SMS, D_D[EP],-1,D_D[LOC],$A31),0))","v":""},{"$f":"IF(ISNA($A31),\"\",IFERROR(SUMIFS(D_D[ADCF],D_D[MT],5,D_D[CAT],SMS, D_D[EP],-1,D_D[LOC],$A31),0))","v":""},{"$f":"IF(ISNA($A31),\"\",IFERROR(SUMIFS(D_D[INV],D_D[MT],8,D_D[CAT],SMS,D_D[LOC],$A31),0))","v":""},{"$f":"IF(ISNA($A31),\"\",IFERROR(SUMIFS(D_D[BL],D_D[MT],8,D_D[CAT],SMS,D_D[LOC],$A31),0))","v":""},{"$f":"IF(ISNA($A31),\"\",IFERROR(SUMIFS(D_D[ADP],D_D[MT],8,D_D[CAT],SMS,D_D[LOC],$A31),0))","v":""},{"$f":"IF(ISNA($A31),\"\",IFERROR(SUMIFS(D_D[PROD_MTD],D_D[MT],8,D_D[CAT],SMS,D_D[LOC],$A31),0))","v":""},{"$f":"IF(ISNA($A31),\"\",IFERROR(SUMIFS(D_D[PROD_FYTD],D_D[MT],8,D_D[CAT],SMS,D_D[LOC],$A31),0))","v":""},{"$f":"IF(ISNA($A31),\"\",IFERROR(SUMIFS(D_D[ADCM],D_D[MT],8,D_D[CAT],SMS,D_D[LOC],$A31),0))","v":""}]
[{"$error":"#N/A"},20,"",{"$f":"IF(ISNA($A32),\"\",IFERROR(SUMIFS(D_D[INV],D_D[MT],5,D_D[CAT],SMS, D_D[EP],-1,D_D[LOC],$A32),0))","v":""},{"$f":"IF(ISNA($A32),\"\",IFERROR(SUMIFS(D_D[BL],D_D[MT],5,D_D[CAT],SMS, D_D[EP],-1,D_D[LOC],$A32),0))","v":""},"",{"$f":"IF(ISNA($A32),\"\",IFERROR(SUMIFS(D_D[ADP],D_D[MT],5,D_D[CAT],SMS, D_D[EP],-1,D_D[LOC],$A32),0))","v":""},{"$f":"IF(ISNA($A32),\"\",IFERROR(SUMIFS(D_D[PROD_MTD],D_D[MT],5,D_D[CAT],SMS, D_D[EP],-1,D_D[LOC],$A32),0))","v":""},{"$f":"IF(ISNA($A32),\"\",IFERROR(SUMIFS(D_D[ADCM],D_D[MT],5,D_D[CAT],SMS, D_D[EP],-1,D_D[LOC],$A32),0))","v":""},{"$f":"IF(ISNA($A32),\"\",IFERROR(SUMIFS(D_D[PROD_FYTD],D_D[MT],5,D_D[CAT],SMS, D_D[EP],-1,D_D[LOC],$A32),0))","v":""},{"$f":"IF(ISNA($A32),\"\",IFERROR(SUMIFS(D_D[ADCF],D_D[MT],5,D_D[CAT],SMS, D_D[EP],-1,D_D[LOC],$A32),0))","v":""},{"$f":"IF(ISNA($A32),\"\",IFERROR(SUMIFS(D_D[INV],D_D[MT],8,D_D[CAT],SMS,D_D[LOC],$A32),0))","v":""},{"$f":"IF(ISNA($A32),\"\",IFERROR(SUMIFS(D_D[BL],D_D[MT],8,D_D[CAT],SMS,D_D[LOC],$A32),0))","v":""},{"$f":"IF(ISNA($A32),\"\",IFERROR(SUMIFS(D_D[ADP],D_D[MT],8,D_D[CAT],SMS,D_D[LOC],$A32),0))","v":""},{"$f":"IF(ISNA($A32),\"\",IFERROR(SUMIFS(D_D[PROD_MTD],D_D[MT],8,D_D[CAT],SMS,D_D[LOC],$A32),0))","v":""},{"$f":"IF(ISNA($A32),\"\",IFERROR(SUMIFS(D_D[PROD_FYTD],D_D[MT],8,D_D[CAT],SMS,D_D[LOC],$A32),0))","v":""},{"$f":"IF(ISNA($A32),\"\",IFERROR(SUMIFS(D_D[ADCM],D_D[MT],8,D_D[CAT],SMS,D_D[LOC],$A32),0))","v":""}]
[{"$error":"#N/A"},21,"",{"$f":"IF(ISNA($A33),\"\",IFERROR(SUMIFS(D_D[INV],D_D[MT],5,D_D[CAT],SMS, D_D[EP],-1,D_D[LOC],$A33),0))","v":""},{"$f":"IF(ISNA($A33),\"\",IFERROR(SUMIFS(D_D[BL],D_D[MT],5,D_D[CAT],SMS, D_D[EP],-1,D_D[LOC],$A33),0))","v":""},"",{"$f":"IF(ISNA($A33),\"\",IFERROR(SUMIFS(D_D[ADP],D_D[MT],5,D_D[CAT],SMS, D_D[EP],-1,D_D[LOC],$A33),0))","v":""},{"$f":"IF(ISNA($A33),\"\",IFERROR(SUMIFS(D_D[PROD_MTD],D_D[MT],5,D_D[CAT],SMS, D_D[EP],-1,D_D[LOC],$A33),0))","v":""},{"$f":"IF(ISNA($A33),\"\",IFERROR(SUMIFS(D_D[ADCM],D_D[MT],5,D_D[CAT],SMS, D_D[EP],-1,D_D[LOC],$A33),0))","v":""},{"$f":"IF(ISNA($A33),\"\",IFERROR(SUMIFS(D_D[PROD_FYTD],D_D[MT],5,D_D[CAT],SMS, D_D[EP],-1,D_D[LOC],$A33),0))","v":""},{"$f":"IF(ISNA($A33),\"\",IFERROR(SUMIFS(D_D[ADCF],D_D[MT],5,D_D[CAT],SMS, D_D[EP],-1,D_D[LOC],$A33),0))","v":""},{"$f":"IF(ISNA($A33),\"\",IFERROR(SUMIFS(D_D[INV],D_D[MT],8,D_D[CAT],SMS,D_D[LOC],$A33),0))","v":""},{"$f":"IF(ISNA($A33),\"\",IFERROR(SUMIFS(D_D[BL],D_D[MT],8,D_D[CAT],SMS,D_D[LOC],$A33),0))","v":""},{"$f":"IF(ISNA($A33),\"\",IFERROR(SUMIFS(D_D[ADP],D_D[MT],8,D_D[CAT],SMS,D_D[LOC],$A33),0))","v":""},{"$f":"IF(ISNA($A33),\"\",IFERROR(SUMIFS(D_D[PROD_MTD],D_D[MT],8,D_D[CAT],SMS,D_D[LOC],$A33),0))","v":""},{"$f":"IF(ISNA($A33),\"\",IFERROR(SUMIFS(D_D[PROD_FYTD],D_D[MT],8,D_D[CAT],SMS,D_D[LOC],$A33),0))","v":""},{"$f":"IF(ISNA($A33),\"\",IFERROR(SUMIFS(D_D[ADCM],D_D[MT],8,D_D[CAT],SMS,D_D[LOC],$A33),0))","v":""}]
[{"$error":"#N/A"},22,"",{"$f":"IF(ISNA($A34),\"\",IFERROR(SUMIFS(D_D[INV],D_D[MT],5,D_D[CAT],SMS, D_D[EP],-1,D_D[LOC],$A34),0))","v":""},{"$f":"IF(ISNA($A34),\"\",IFERROR(SUMIFS(D_D[BL],D_D[MT],5,D_D[CAT],SMS, D_D[EP],-1,D_D[LOC],$A34),0))","v":""},"",{"$f":"IF(ISNA($A34),\"\",IFERROR(SUMIFS(D_D[ADP],D_D[MT],5,D_D[CAT],SMS, D_D[EP],-1,D_D[LOC],$A34),0))","v":""},{"$f":"IF(ISNA($A34),\"\",IFERROR(SUMIFS(D_D[PROD_MTD],D_D[MT],5,D_D[CAT],SMS, D_D[EP],-1,D_D[LOC],$A34),0))","v":""},{"$f":"IF(ISNA($A34),\"\",IFERROR(SUMIFS(D_D[ADCM],D_D[MT],5,D_D[CAT],SMS, D_D[EP],-1,D_D[LOC],$A34),0))","v":""},{"$f":"IF(ISNA($A34),\"\",IFERROR(SUMIFS(D_D[PROD_FYTD],D_D[MT],5,D_D[CAT],SMS, D_D[EP],-1,D_D[LOC],$A34),0))","v":""},{"$f":"IF(ISNA($A34),\"\",IFERROR(SUMIFS(D_D[ADCF],D_D[MT],5,D_D[CAT],SMS, D_D[EP],-1,D_D[LOC],$A34),0))","v":""},{"$f":"IF(ISNA($A34),\"\",IFERROR(SUMIFS(D_D[INV],D_D[MT],8,D_D[CAT],SMS,D_D[LOC],$A34),0))","v":""},{"$f":"IF(ISNA($A34),\"\",IFERROR(SUMIFS(D_D[BL],D_D[MT],8,D_D[CAT],SMS,D_D[LOC],$A34),0))","v":""},{"$f":"IF(ISNA($A34),\"\",IFERROR(SUMIFS(D_D[ADP],D_D[MT],8,D_D[CAT],SMS,D_D[LOC],$A34),0))","v":""},{"$f":"IF(ISNA($A34),\"\",IFERROR(SUMIFS(D_D[PROD_MTD],D_D[MT],8,D_D[CAT],SMS,D_D[LOC],$A34),0))","v":""},{"$f":"IF(ISNA($A34),\"\",IFERROR(SUMIFS(D_D[PROD_FYTD],D_D[MT],8,D_D[CAT],SMS,D_D[LOC],$A34),0))","v":""},{"$f":"IF(ISNA($A34),\"\",IFERROR(SUMIFS(D_D[ADCM],D_D[MT],8,D_D[CAT],SMS,D_D[LOC],$A34),0))","v":""}]
[{"$error":"#N/A"},23,"",{"$f":"IF(ISNA($A35),\"\",IFERROR(SUMIFS(D_D[INV],D_D[MT],5,D_D[CAT],SMS, D_D[EP],-1,D_D[LOC],$A35),0))","v":""},{"$f":"IF(ISNA($A35),\"\",IFERROR(SUMIFS(D_D[BL],D_D[MT],5,D_D[CAT],SMS, D_D[EP],-1,D_D[LOC],$A35),0))","v":""},"",{"$f":"IF(ISNA($A35),\"\",IFERROR(SUMIFS(D_D[ADP],D_D[MT],5,D_D[CAT],SMS, D_D[EP],-1,D_D[LOC],$A35),0))","v":""},{"$f":"IF(ISNA($A35),\"\",IFERROR(SUMIFS(D_D[PROD_MTD],D_D[MT],5,D_D[CAT],SMS, D_D[EP],-1,D_D[LOC],$A35),0))","v":""},{"$f":"IF(ISNA($A35),\"\",IFERROR(SUMIFS(D_D[ADCM],D_D[MT],5,D_D[CAT],SMS, D_D[EP],-1,D_D[LOC],$A35),0))","v":""},{"$f":"IF(ISNA($A35),\"\",IFERROR(SUMIFS(D_D[PROD_FYTD],D_D[MT],5,D_D[CAT],SMS, D_D[EP],-1,D_D[LOC],$A35),0))","v":""},{"$f":"IF(ISNA($A35),\"\",IFERROR(SUMIFS(D_D[ADCF],D_D[MT],5,D_D[CAT],SMS, D_D[EP],-1,D_D[LOC],$A35),0))","v":""},{"$f":"IF(ISNA($A35),\"\",IFERROR(SUMIFS(D_D[INV],D_D[MT],8,D_D[CAT],SMS,D_D[LOC],$A35),0))","v":""},{"$f":"IF(ISNA($A35),\"\",IFERROR(SUMIFS(D_D[BL],D_D[MT],8,D_D[CAT],SMS,D_D[LOC],$A35),0))","v":""},{"$f":"IF(ISNA($A35),\"\",IFERROR(SUMIFS(D_D[ADP],D_D[MT],8,D_D[CAT],SMS,D_D[LOC],$A35),0))","v":""},{"$f":"IF(ISNA($A35),\"\",IFERROR(SUMIFS(D_D[PROD_MTD],D_D[MT],8,D_D[CAT],SMS,D_D[LOC],$A35),0))","v":""},{"$f":"IF(ISNA($A35),\"\",IFERROR(SUMIFS(D_D[PROD_FYTD],D_D[MT],8,D_D[CAT],SMS,D_D[LOC],$A35),0))","v":""},{"$f":"IF(ISNA($A35),\"\",IFERROR(SUMIFS(D_D[ADCM],D_D[MT],8,D_D[CAT],SMS,D_D[LOC],$A35),0))","v":""}]

{"sheet":"Driver","index":3,"n_rows":226,"n_cols":27,"rows_kept":226,"cut":false,"hidden":true,"merged":[]}
["DIST_ID","DIST_DEF",null,null,null,"ROO","RO","ROI","ROD","RODS",null,"STO","ST","STI","STD","STDS",null,"ROO","RO","ROI","ROD"]
[1,"DIST_NE",null,null,null,1,0,100,"USA","1",null,1,0,100,"USA",100,null,1,0,100,"USA",null,null,null,null,null,"-Total"]
[2,"DIST_SE",null,null,null,2,1,394,"Northeast District","394",null,2,1,"394","Northeast District","394",null,2,1,"310","Philadelphia",null,null,"Northeast District",null," "]
[3,"DIST_CN",null,null,null,3,1,"313","Baltimore","394",null,3,1,"CT","Connecticut","394",null,3,1,"330","Milwaukee",null,null,"Connecticut","CT100",{"$f":"X4&$AA$2","v":"Connecticut-Total"},"-Other RO"]
[4,"DIST_PC",null,null,null,4,1,"301","Boston","394",null,4,1,"DE","Delaware","394",null,4,1,"335","St. Paul",null,null,null,"CT308","Hartford RO","-NWQ"]
[5,"DIST_OT",null,null,null,5,1,"307","Buffalo","394",null,5,1,"DC","District of Columbia","394",null,5,1,"-1","Other",null,null," ","CT-1",{"$f":"X4&$AA$4","v":"Connecticut-Other RO"}]
[null,null,null,null,null,6,1,"328","Chicago","394",null,6,1,"IL","Illinois","394",null,6,2,"318","Winston-Salem",null,null," ","CT499",{"$f":"X4&$AA$5","v":"Connecticut-NWQ"}]
[null,null,null,null,null,7,1,"325","Cleveland","394",null,7,1,"IN","Indiana","394",null,7,2,"341","Salt Lake City",null,null,"Delaware","DE100",{"$f":"X8&$AA$2","v":"Delaware-Total"}]
[null,"CONTROLLER for SOJ District Selection",null,null,null,8,1,"329","Detroit","394",null,8,1,"ME","Maine","394",null,8,2,"-1","Other",null,null,null,"DE460","Wilmington RO"]
[null,"ACTIVE SELECTION",null,4,null,9,1,"308","Hartford","394",null,9,1,"MD","Maryland","394",null,9,3,"318","Winston-Salem",null,null," ","DE-1",{"$f":"X8&$AA$4","v":"Delaware-Other RO"}]
[null,"MODIFIED SELECTION",{"$f":"IF(D20=12,\"DIST_P\",IF(D20=14,\"DIST_Q\",DS_RO_STG))","v":"DIST_PC"},null,null,10,1,"326","Indianapolis","394",null,10,1,"MA","Massachusetts","394",null,10,3,"377","San Diego",null,null," ","DE499",{"$f":"X8&$AA$5","v":"Delaware-NWQ"}]
[null,null,null,null,null,11,1,"373","Manchester","394",null,11,1,"MI","Michigan","394",null,11,3,"-1","Other",null,null,"DC","DC100",{"$f":"X12&$AA$2","v":"DC-Total"}]
[null,"DISTRICT-RO",{"$f":"INDEX(DIST_DEF,(MATCH($D$10,DIST_ID,0)))","v":"DIST_PC"},null,null,12,1,"330","Milwaukee","394",null,12,1,"MO","Missouri","394",null,null,null,null,null,null,null," ","DC372","Washington DC RO"]
[null,"DISTRICT-STATE",{"$f":"INDEX(DIST_DEF,(MATCH($D$10,DIST_ID,0)))&\"_ST\"","v":"DIST_PC_ST"},null,null,13,1,"306","New York","394",null,13,1,"NH","New Hampshire","394",null,null,null,null,null,null,null," ","DC-1",{"$f":"X12&$AA$4","v":"DC-Other RO"}]
[null,"DISTRICT-NWQ",{"$f":"INDEX(DIST_DEF,(MATCH($D$10,DIST_ID,0)))&\"_NWQ\"","v":"DIST_PC_NWQ"},{"$f":"INDEX(DIST_DEF,(MATCH($D$10,DIST_ID,0)))&\"_NWQD\"","v":"DIST_PC_NWQD"},null,14,1,"309","Newark","394",null,14,1,"NJ","New Jersey","394",null,null,null,"ROI","ROD",null,null," ","DC499",{"$f":"X12&$AA$5","v":"DC-NWQ"}]
[null,null,{"$f":"INDEX(DIST_DEF,(MATCH($D$10,DIST_ID,0)))&\"_NWQI\"","v":"DIST_PC_NWQI"},null,null,15,1,"310","Philadelphia","394",null,15,1,"NY","New York","394",null,null,null,100,"USA",null,null,"Illinois","IL100",{"$f":"X16&$AA$2","v":"Illinois-Total"}]
[null,null,null,null,null,16,1,"311","Pittsburgh","394",null,16,1,"OH","Ohio","394",null,null,null,"310","Philadelphia",null,null,null,"IL328","Chicago RO"]
[null,"CONTROLLER for Mission Selection",null,null,null,17,1,"304","Providence","394",null,17,1,"PA","Pennsylvania","394",null,null,null,"330","Milwaukee",null,null," ","IL-1",{"$f":"X16&$AA$4","v":"Illinois-Other RO"}]
[null,"ACTIVE SELECTION",null,1,null,18,1,"376","St. Louis RMC","394",null,18,1,"RI","Rhode Island","394",null,null,null,"335","St. Paul",null,null," ","IL499",{"$f":"X16&$AA$5","v":"Illinois-NWQ"}]
[null,"MODIFIED SELECTION",{"$f":"INDEX(SMD,(MATCH($D$19,DIST_ID,0)))","v":"USA - All Missions"},{"$f":"IF(SMSA=1,0,SMSA+9)","v":0},null,19,1,"331","St. Louis","394",null,19,1,"VT","Vermont","394",null,null,null,499,"NWQ",null,null,"Indiana","IN100",{"$f":"X20&$AA$2","v":"Indiana-Total"}]
[null,"USA - All Missions",null,1,null,20,1,"402","Togus","394",null,20,1,"WI","Wisconsin","394",null,null,null,"-1","Other",null,null,null,"IN326","Indianapolis RO"]
[null,"Compensation",null,11,null,21,1,"372","Washington","394",null,21,2,"393","Southeast District","393",null,null,null,"318","Winston-Salem",null,null," ","IN-1",{"$f":"X20&$AA$4","v":"Indiana-Other RO"}]
[null,"Pension",null,12,null,22,1,"405","White River Junction","394",null,22,2,"AL","Alabama","393",null,null,null,"341","Salt Lake City",null,null," ","IN499",{"$f":"X20&$AA$5","v":"Indiana-NWQ"}]
[null,"BDD",null,13,null,23,1,"460","Wilmington","394",null,23,2,"AR","Arkansas","393",null,null,null,499,"NWQ",null,null,"Maine","ME100",{"$f":"X24&$AA$2","v":"Maine-Total"}]
[null,"Quickstart",null,14,null,24,2,"393","Southeast District","393",null,24,2,"FL","Florida","393",null,null,null,"-1","Other",null,null,null,"ME402","Togus RO"]
[null,null,null,null,null,25,2,"316","Atlanta","393",null,25,2,"GA","Georgia","393",null,null,null,"318","Winston-Salem",null,null,null,"ME-1",{"$f":"X24&$AA$4","v":"Maine-Other RO"}]
[null,"TRADITIONAL AGGREGATE CODES",null,null,null,26,2,"319","Columbia","393",null,26,2,"KY","Kentucky","393",null,null,null,"377","San Diego",null,null,null,"ME499",{"$f":"X24&$AA$5","v":"Maine-NWQ"}]
[null,"ALL",1000,null,null,27,2,315,"Huntington","393",null,27,2,"LA","Louisiana","393",null,null,null,499,"NWQ",null,null,"Maryland","MD100",{"$f":"X28&$AA$2","v":"Maryland-Total"}]
[null,"Non-Rating/Appeals Compensation",2000,null,null,28,2,"323","Jackson","393",null,28,2,"MS","Mississippi","393",null,null,null,"-1","Other",null,null,null,"MD313","Baltimore RO"]
[null,"Non-Rating/Appeals Pension",3000,null,null,29,2,"350","Little Rock","393",null,29,2,"NC","North Carolina","393",null,null,null,null,null,null,null,null,"MD-1",{"$f":"X28&$AA$4","v":"Maryland-Other RO"}]
[null,"Compensation Entitlement",2100,null,null,30,2,"327","Louisville","393",null,30,2,"PR","Puerto Rico","393",null,null,null,null,null,null,null,null,"MD499",{"$f":"X28&$AA$5","v":"Maryland-NWQ"}]
[null,"Compensation Award Adjustment",2200,null,null,31,2,"322","Montgomery","393",null,31,2,"SC","South Carolina","393",null,null,null,null,null,null,null,"Massachusetts","MA100",{"$f":"X32&$AA$2","v":"Massachusetts-Total"}]
[null,"Compensation Program Review",2300,null,null,32,2,"320","Nashville","393",null,32,2,"TN","Tennessee","393",null,null,null,null,null,null,null,null,"MA301","Boston RO"]
[null,"Compensation Other",2400,null,null,33,2,"321","New Orleans","393",null,33,2,"VA","Virginia","393",null,null,null,null,null,null,null,null,"MA-1",{"$f":"X32&$AA$4","v":"Massachusetts-Other RO"}]
[null,"Compensation Burial",2500,null,null,34,2,"314","Roanoke","393",null,34,2,"WV","West Virginia","393",null,null,null,null,null,null,null,null,"MA499",{"$f":"X32&$AA$5","v":"Massachusetts-NWQ"}]
[null,"Compensation Accrued",2600,null,null,35,2,"355","San Juan","393",null,35,3,"384","Continental District","384",null,null,null,null,null,null,null,"Michigan","MI100",{"$f":"X36&$AA$2","v":"Michigan-Total"}]
[null,"Pension Entitlement",3100,null,null,36,2,"317","St. Petersburg","393",null,36,3,"CO","Colorado","384",null,null,null,null,null,null,null,null,"MI329","Detroit RO"]
[null,"Pension Award Adjustment",3200,null,null,37,2,"318","Winston-Salem","393",null,37,3,"IA","Iowa","384",null,null,null,null,null,null,null,null,"MI-1",{"$f":"X36&$AA$4","v":"Michigan-Other RO"}]
[null,"Pension Program Review",3300,null,null,38,3,"384","Continental District","384",null,38,3,"KS","Kansas","384",null,null,null,null,null,null,null,null,"MI499",{"$f":"X36&$AA$5","v":"Michigan-NWQ"}]
[null,"Pension Other",3400,null,null,39,3,"442","Cheyenne ","384",null,39,3,"MN","Minnesota","384",null,null,null,null,null,null,null,"Missouri","MO100",{"$f":"X40&$AA$2","v":"Missouri-Total"}]
[null,"Pension Burial",3500,null,null,40,3,"339","Denver","384",null,40,3,"MT","Montana","384",null,null,null,null,null,null,null,null,"MO331","St. Louis RO"]
[null,"Pension Accrued",3600,null,null,41,3,"333","Des Moines","384",null,41,3,"NE","Nebraska","384",null,null,null,null,null,null,null,null,"MO-1",{"$f":"X40&$AA$4","v":"Missouri-Other RO"}]
[null,null,null,null,null,42,3,"437","Fargo","384",null,42,3,"ND","North Dakota","384",null,null,null,null,null,null,null,null,"MO499",{"$f":"X40&$AA$5","v":"Missouri-NWQ"}]
[null,"CONTROLLER for SOJ District Selection",null,null,null,43,3,"436","Fort Harrison ","384",null,43,3,"OK","Oklahoma","384",null,null,null,null,null,null,null,"New Hampshire","NH100",{"$f":"X44&$AA$2","v":"New Hampshire-Total"}]
[null,"ACTIVE SELECTION",null,6,null,44,3,"362","Houston","384",null,44,3,"SD","South Dakota","384",null,null,null,null,null,null,null,null,"NH373","Manchester RO"]
[null,"MODIFIED SELECTION",{"$f":"IF(D10=6,DS_RO&\"_N\",IF(D20=13,DS_RO,IF(D20>11,DS_RO&\"_N\",DS_RO)))","v":"DIST_PC"},null,null,45,3,"334","Lincoln","384",null,45,3,"TX","Texas","384",null,null,null,null,null,null,null,null,"NH-1",{"$f":"X44&$AA$4","v":"New Hampshire-Other RO"}]
[null,null,null,null,null,46,3,"351","Muskogee","384",null,46,3,"WY","Wyoming","384",null,null,null,null,null,null,null,null,"NH499",{"$f":"X44&$AA$5","v":"New Hampshire-NWQ"}]
[null,null,null,null,null,47,3,"438","Sioux Falls","384",null,47,4,"395","Pacific District","395",null,null,null,null,null,null,null,"New Jersey","NJ100",{"$f":"X48&$AA$2","v":"New Jersey-Total"}]
[null,null,null,null,null,48,3,"335","St. Paul","384",null,48,4,"AK","Alaska","395",null,null,null,null,null,null,null,null,"NJ309","Newark RO"]
[null,null,null,null,null,49,3,"349","Waco","384",null,49,4,"AZ","Arizona","395",null,null,null,null,null,null,null,null,"NJ-1",{"$f":"X48&$AA$4","v":"New Jersey-Other RO"}]
[null,null,null,null,null,50,3,"452","Wichita","384",null,50,4,"CA","California","395",null,null,null,null,null,null,null,null,"NJ499",{"$f":"X48&$AA$5","v":"New Jersey-NWQ"}]
[null,null,null,null,null,51,4,"395","Pacific District","395",null,51,4,"HI","Hawaii","395",null,null,null,null,null,null,null,"New York","NY100",{"$f":"X52&$AA$2","v":"New York-Total"}]
[null,null,null,null,null,52,4,"340","Albuquerque","395",null,52,4,"ID","Idaho","395",null,null,null,null,null,null,null,null,"NY307","Buffalo RO"]
[null,null,null,null,null,53,4,"463","Anchorage","395",null,53,4,"NV","Nevada","395",null,null,null,null,null,null,null,null,"NY306","New York RO"]
[null,null,null,null,null,54,4,"347","Boise","395",null,54,4,"NM","New Mexico","395",null,null,null,null,null,null,null,null,"NY-1",{"$f":"X52&$AA$4","v":"New York-Other RO"}]
[null,null,null,null,null,55,4,"459","Honolulu","395",null,55,4,"OR","Oregon","395",null,null,null,null,null,null,null,null,"NY499",{"$f":"X52&$AA$5","v":"New York-NWQ"}]
[null,null,null,null,null,56,4,"344","Los Angeles","395",null,56,4,"PI","Philippines","395",null,null,null,null,null,null,null,"Ohio","OH100",{"$f":"X57&$AA$2","v":"Ohio-Total"}]
[null,null,null,null,null,57,4,"358","Manila","395",null,57,4,"UT","Utah","395",null,null,null,null,null,null,null,null,"OH325","Cleveland RO"]
[null,null,null,null,null,58,4,"343","Oakland","395",null,58,4,"WA","Washington","395",null,null,null,null,null,null,null,null,"OH-1",{"$f":"X57&$AA$4","v":"Ohio-Other RO"}]
[null,null,null,null,null,59,4,"345","Phoenix","395",null,59,5,"35","Other District","35",null,null,null,null,null,null,null,null,"OH499",{"$f":"X57&$AA$5","v":"Ohio-NWQ"}]
[null,null,null,null,null,60,4,"348","Portland","395",null,60,5,"35","Outside US","35",null,null,null,null,null,null,null,"Pennsylvania","PA100",{"$f":"X61&$AA$2","v":"Pennsylvania-Total"}]
[null,null,null,null,null,61,4,"354","Reno","395",null,null,null,null,null,null,null,null,null,null,null,null,null,null,"PA310","Philadelphia RO"]
[null,null,null,null,null,62,4,"341","Salt Lake City","395",null,null,null,null,null,null,null,null,null,null,null,null,null,null,"PA311","Pittsburgh RO"]
[null,null,null,null,null,63,4,"377","San Diego","395",null,null,null,null,null,null,null,null,null,null,null,null,null,null,"PA-1",{"$f":"X61&$AA$4","v":"Pennsylvania-Other RO"}]
[null,null,null,null,null,64,4,"346","Seattle","395",null,null,null,null,null,null,null,null,null,null,null,null,null,null,"PA499",{"$f":"X61&$AA$5","v":"Pennsylvania-NWQ"}]
[null,null,null,null,null,65,5,"35","Other District","35",null,null,null,null,null,null,null,null,null,null,null,null,null,"Rhode Island","RI100",{"$f":"X66&$AA$2","v":"Rhode Island-Total"}]
[null,null,null,null,null,66,5,"499","NWQ","35",null,null,null,null,null,null,null,null,null,null,null,null,null,null,"RI304","Providence RO"]
[null,null,null,null,null,67,5,"-1","Other","35",null,null,null,null,null,null,null,null,null,null,null,null,null,null,"RI-1",{"$f":"X66&$AA$4","v":"Rhode Island-Other RO"}]
[null,null,null,null,null,null,null,null,null,null,null,null,null,null,null,null,null,null,null,null,null,null,null,null,"RI499",{"$f":"X66&$AA$5","v":"Rhode Island-NWQ"}]
[null,null,null,null,null,null,null,null,null,null,null,null,null,null,null,null,null,null,null,null,null,null,null,"Vermont","VT100",{"$f":"X70&$AA$2","v":"Vermont-Total"}]
[null,null,null,null,null,null,null,null,null,null,null,null,null,null,null,null,null,null,null,null,null,null,null,null,"VT405","White River RO"]
[null,null,null,null,null,null,null,null,null,null,null,null,null,null,null,null,null,null,null,null,null,null,null,null,"VT-1",{"$f":"X70&$AA$4","v":"Vermont-Other RO"}]
[null,null,null,null,null,null,null,null,null,null,null,null,null,null,null,null,null,null,null,null,null,null,null,null,"VT499",{"$f":"X70&$AA$5","v":"Vermont-NWQ"}]
[null,null,null,null,null,null,null,null,null,null,null,null,null,null,null,null,null,null,null,null,null,null,null,"Wisconsin","WI100",{"$f":"X74&$AA$2","v":"Wisconsin-Total"}]
[null,null,null,null,null,null,null,null,null,null,null,null,null,null,null,null,null,null,null,null,null,null,null,null,"WI330","Milwaukee RO"]
[null,null,null,null,null,null,null,null,null,null,null,null,null,null,null,null,null,null,null,null,null,null,null,null,"WI-1",{"$f":"X74&$AA$4","v":"Wisconsin-Other RO"}]
[null,null,null,null,null,null,null,null,null,null,null,null,null,null,null,null,null,null,null,null,null,null,null,null,"WI499",{"$f":"X74&$AA$5","v":"Wisconsin-NWQ"}]
[null,null,null,null,null,null,null,null,null,null,null,null,null,null,null,null,null,null,null,null,null,null,null,"Southeast District",null," "]
[null,null,null,null,null,null,null,null,null,null,null,null,null,null,null,null,null,null,null,null,null,null,null,"Alabama","AL100",{"$f":"X79&$AA$2","v":"Alabama-Total"}]
[null,null,null,null,null,null,null,null,null,null,null,null,null,null,null,null,null,null,null,null,null,null,null,null,"AL322","Montgomery RO"]
[null,null,null,null,null,null,null,null,null,null,null,null,null,null,null,null,null,null,null,null,null,null,null," ","AL-1",{"$f":"X79&$AA$4","v":"Alabama-Other RO"}]
[null,null,null,null,null,null,null,null,null,null,null,null,null,null,null,null,null,null,null,null,null,null,null," ","AL499",{"$f":"X79&$AA$5","v":"Alabama-NWQ"}]
[null,null,null,null,null,null,null,null,null,null,null,null,null,null,null,null,null,null,null,null,null,null,null,"Arkansas","AR100",{"$f":"X83&$AA$2","v":"Arkansas-Total"}]
[null,null,null,null,null,null,null,null,null,null,null,null,null,null,null,null,null,null,null,null,null,null,null,null,"AR350","Little Rock RO"]
[null,null,null,null,null,null,null,null,null,null,null,null,null,null,null,null,null,null,null,null,null,null,null," ","AR-1",{"$f":"X83&$AA$4","v":"Arkansas-Other RO"}]
[null,null,null,null,null,null,null,null,null,null,null,null,null,null,null,null,null,null,null,null,null,null,null," ","AR499",{"$f":"X83&$AA$5","v":"Arkansas-NWQ"}]
[null,null,null,null,null,null,null,null,null,null,null,null,null,null,null,null,null,null,null,null,null,null,null,"Florida","FL100",{"$f":"X87&$AA$2","v":"Florida-Total"}]
[null,null,null,null,null,null,null,null,null,null,null,null,null,null,null,null,null,null,null,null,null,null,null,null,"FL317","St. Petersburg RO"]
[null,null,null,null,null,null,null,null,null,null,null,null,null,null,null,null,null,null,null,null,null,null,null," ","FL-1",{"$f":"X87&$AA$4","v":"Florida-Other RO"}]
[null,null,null,null,null,null,null,null,null,null,null,null,null,null,null,null,null,null,null,null,null,null,null," ","FL499",{"$f":"X87&$AA$5","v":"Florida-NWQ"}]
[null,null,null,null,null,null,null,null,null,null,null,null,null,null,null,null,null,null,null,null,null,null,null,"Georgia","GA100",{"$f":"X91&$AA$2","v":"Georgia-Total"}]
[null,null,null,null,null,null,null,null,null,null,null,null,null,null,null,null,null,null,null,null,null,null,null," ","GA316","Atlanta RO"]
[null,null,null,null,null,null,null,null,null,null,null,null,null,null,null,null,null,null,null,null,null,null,null," ","GA-1",{"$f":"X91&$AA$4","v":"Georgia-Other RO"}]
[null,null,null,null,null,null,null,null,null,null,null,null,null,null,null,null,null,null,null,null,null,null,null," ","GA499",{"$f":"X91&$AA$5","v":"Georgia-NWQ"}]
[null,null,null,null,null,null,null,null,null,null,null,null,null,null,null,null,null,null,null,null,null,null,null,"Kentucky","KY100",{"$f":"X95&$AA$2","v":"Kentucky-Total"}]
[null,null,null,null,null,null,null,null,null,null,null,null,null,null,null,null,null,null,null,null,null,null,null,null,"KY327","Louisville RO"]
[null,null,null,null,null,null,null,null,null,null,null,null,null,null,null,null,null,null,null,null,null,null,null,null,"KY-1",{"$f":"X95&$AA$4","v":"Kentucky-Other RO"}]
[null,null,null,null,null,null,null,null,null,null,null,null,null,null,null,null,null,null,null,null,null,null,null,null,"KY499",{"$f":"X95&$AA$5","v":"Kentucky-NWQ"}]
[null,null,null,null,null,null,null,null,null,null,null,null,null,null,null,null,null,null,null,null,null,null,null,"Louisiana","LA100",{"$f":"X99&$AA$2","v":"Louisiana-Total"}]
[null,null,null,null,null,null,null,null,null,null,null,null,null,null,null,null,null,null,null,null,null,null,null," ","LA321","New Orleans RO"]
[null,null,null,null,null,null,null,null,null,null,null,null,null,null,null,null,null,null,null,null,null,null,null," ","LA-1",{"$f":"X99&$AA$4","v":"Louisiana-Other RO"}]
[null,null,null,null,null,null,null,null,null,null,null,null,null,null,null,null,null,null,null,null,null,null,null," ","LA499",{"$f":"X99&$AA$5","v":"Louisiana-NWQ"}]
[null,null,null,null,null,null,null,null,null,null,null,null,null,null,null,null,null,null,null,null,null,null,null,"Mississippi","MS100",{"$f":"X103&$AA$2","v":"Mississippi-Total"}]
[null,null,null,null,null,null,null,null,null,null,null,null,null,null,null,null,null,null,null,null,null,null,null,null,"MS323","Jackson RO"]
[null,null,null,null,null,null,null,null,null,null,null,null,null,null,null,null,null,null,null,null,null,null,null,null,"MS-1",{"$f":"X103&$AA$4","v":"Mississippi-Other RO"}]
[null,null,null,null,null,null,null,null,null,null,null,null,null,null,null,null,null,null,null,null,null,null,null,null,"MS499",{"$f":"X103&$AA$5","v":"Mississippi-NWQ"}]
[null,null,null,null,null,null,null,null,null,null,null,null,null,null,null,null,null,null,null,null,null,null,null,"North Carolina","NC100",{"$f":"X107&$AA$2","v":"North Carolina-Total"}]
[null,null,null,null,null,null,null,null,null,null,null,null,null,null,null,null,null,null,null,null,null,null,null,null,"NC318","Winston-Salem RO"]
[null,null,null,null,null,null,null,null,null,null,null,null,null,null,null,null,null,null,null,null,null,null,null,null,"NC-1",{"$f":"X107&$AA$4","v":"North Carolina-Other RO"}]
[null,null,null,null,null,null,null,null,null,null,null,null,null,null,null,null,null,null,null,null,null,null,null,null,"NC499",{"$f":"X107&$AA$5","v":"North Carolina-NWQ"}]
[null,null,null,null,null,null,null,null,null,null,null,null,null,null,null,null,null,null,null,null,null,null,null,"Puerto Rico","PR100",{"$f":"X111&$AA$2","v":"Puerto Rico-Total"}]
[null,null,null,null,null,null,null,null,null,null,null,null,null,null,null,null,null,null,null,null,null,null,null,null,"PR355","San Juan RO"]
[null,null,null,null,null,null,null,null,null,null,null,null,null,null,null,null,null,null,null,null,null,null,null,null,"PR-1",{"$f":"X111&$AA$4","v":"Puerto Rico-Other RO"}]
[null,null,null,null,null,null,null,null,null,null,null,null,null,null,null,null,null,null,null,null,null,null,null,null,"PR499",{"$f":"X111&$AA$5","v":"Puerto Rico-NWQ"}]
[null,null,null,null,null,null,null,null,null,null,null,null,null,null,null,null,null,null,null,null,null,null,null,"South Carolina","SC100",{"$f":"X115&$AA$2","v":"South Carolina-Total"}]
[null,null,null,null,null,null,null,null,null,null,null,null,null,null,null,null,null,null,null,null,null,null,null,null,"SC319","Columbia RO"]
[null,null,null,null,null,null,null,null,null,null,null,null,null,null,null,null,null,null,null,null,null,null,null,null,"SC-1",{"$f":"X115&$AA$4","v":"South Carolina-Other RO"}]
[null,null,null,null,null,null,null,null,null,null,null,null,null,null,null,null,null,null,null,null,null,null,null,null,"SC499",{"$f":"X115&$AA$5","v":"South Carolina-NWQ"}]
[null,null,null,null,null,null,null,null,null,null,null,null,null,null,null,null,null,null,null,null,null,null,null,"Tennessee","TN100",{"$f":"X119&$AA$2","v":"Tennessee-Total"}]
[null,null,null,null,null,null,null,null,null,null,null,null,null,null,null,null,null,null,null,null,null,null,null,null,"TN320","Nashville RO"]
[null,null,null,null,null,null,null,null,null,null,null,null,null,null,null,null,null,null,null,null,null,null,null,null,"TN-1",{"$f":"X119&$AA$4","v":"Tennessee-Other RO"}]
[null,null,null,null,null,null,null,null,null,null,null,null,null,null,null,null,null,null,null,null,null,null,null,null,"TN499",{"$f":"X119&$AA$5","v":"Tennessee-NWQ"}]
[null,null,null,null,null,null,null,null,null,null,null,null,null,null,null,null,null,null,null,null,null,null,null,"Virginia","VA100",{"$f":"X123&$AA$2","v":"Virginia-Total"}]
[null,null,null,null,null,null,null,null,null,null,null,null,null,null,null,null,null,null,null,null,null,null,null,null,"VA314","Roanoke RO"]
[null,null,null,null,null,null,null,null,null,null,null,null,null,null,null,null,null,null,null,null,null,null,null,null,"VA-1",{"$f":"X123&$AA$4","v":"Virginia-Other RO"}]
[null,null,null,null,null,null,null,null,null,null,null,null,null,null,null,null,null,null,null,null,null,null,null,null,"VA499",{"$f":"X123&$AA$5","v":"Virginia-NWQ"}]
[null,null,null,null,null,null,null,null,null,null,null,null,null,null,null,null,null,null,null,null,null,null,null,"West Virginia","WV100",{"$f":"X127&$AA$2","v":"West Virginia-Total"}]
[null,null,null,null,null,null,null,null,null,null,null,null,null,null,null,null,null,null,null,null,null,null,null,null,"WV315","Huntington RO"]
[null,null,null,null,null,null,null,null,null,null,null,null,null,null,null,null,null,null,null,null,null,null,null,null,"WV-1",{"$f":"X127&$AA$4","v":"West Virginia-Other RO"}]
[null,null,null,null,null,null,null,null,null,null,null,null,null,null,null,null,null,null,null,null,null,null,null,null,"WV499",{"$f":"X127&$AA$5","v":"West Virginia-NWQ"}]
[null,null,null,null,null,null,null,null,null,null,null,null,null,null,null,null,null,null,null,null,null,null,null,"Continental District",null," "]
[null,null,null,null,null,null,null,null,null,null,null,null,null,null,null,null,null,null,null,null,null,null,null,"Colorado","CO100",{"$f":"X132&$AA$2","v":"Colorado-Total"}]
[null,null,null,null,null,null,null,null,null,null,null,null,null,null,null,null,null,null,null,null,null,null,null,null,"CO339","Denver RO"]
[null,null,null,null,null,null,null,null,null,null,null,null,null,null,null,null,null,null,null,null,null,null,null," ","CO-1",{"$f":"X132&$AA$4","v":"Colorado-Other RO"}]
[null,null,null,null,null,null,null,null,null,null,null,null,null,null,null,null,null,null,null,null,null,null,null," ","CO499",{"$f":"X132&$AA$5","v":"Colorado-NWQ"}]
[null,null,null,null,null,null,null,null,null,null,null,null,null,null,null,null,null,null,null,null,null,null,null,"Iowa","IA100",{"$f":"X136&$AA$2","v":"Iowa-Total"}]
[null,null,null,null,null,null,null,null,null,null,null,null,null,null,null,null,null,null,null,null,null,null,null," ","IA333","Des Moines RO"]
[null,null,null,null,null,null,null,null,null,null,null,null,null,null,null,null,null,null,null,null,null,null,null," ","IA-1",{"$f":"X136&$AA$4","v":"Iowa-Other RO"}]
[null,null,null,null,null,null,null,null,null,null,null,null,null,null,null,null,null,null,null,null,null,null,null," ","IA499",{"$f":"X136&$AA$5","v":"Iowa-NWQ"}]
[null,null,null,null,null,null,null,null,null,null,null,null,null,null,null,null,null,null,null,null,null,null,null,"Kansas","KS100",{"$f":"X140&$AA$2","v":"Kansas-Total"}]
[null,null,null,null,null,null,null,null,null,null,null,null,null,null,null,null,null,null,null,null,null,null,null,null,"KS452","Wichita RO"]
[null,null,null,null,null,null,null,null,null,null,null,null,null,null,null,null,null,null,null,null,null,null,null,null,"KS-1",{"$f":"X140&$AA$4","v":"Kansas-Other RO"}]
[null,null,null,null,null,null,null,null,null,null,null,null,null,null,null,null,null,null,null,null,null,null,null,null,"KS499",{"$f":"X140&$AA$5","v":"Kansas-NWQ"}]
[null,null,null,null,null,null,null,null,null,null,null,null,null,null,null,null,null,null,null,null,null,null,null,"Minnesota","MN100",{"$f":"X144&$AA$2","v":"Minnesota-Total"}]
[null,null,null,null,null,null,null,null,null,null,null,null,null,null,null,null,null,null,null,null,null,null,null,null,"MN335","St. Paul RO"]
[null,null,null,null,null,null,null,null,null,null,null,null,null,null,null,null,null,null,null,null,null,null,null,null,"MN-1",{"$f":"X144&$AA$4","v":"Minnesota-Other RO"}]
[null,null,null,null,null,null,null,null,null,null,null,null,null,null,null,null,null,null,null,null,null,null,null,null,"MN499",{"$f":"X144&$AA$5","v":"Minnesota-NWQ"}]
[null,null,null,null,null,null,null,null,null,null,null,null,null,null,null,null,null,null,null,null,null,null,null,"Montana","MT100",{"$f":"X148&$AA$2","v":"Montana-Total"}]
[null,null,null,null,null,null,null,null,null,null,null,null,null,null,null,null,null,null,null,null,null,null,null,null,"MT436","Fort Harrison RO"]
[null,null,null,null,null,null,null,null,null,null,null,null,null,null,null,null,null,null,null,null,null,null,null,null,"MT-1",{"$f":"X148&$AA$4","v":"Montana-Other RO"}]
[null,null,null,null,null,null,null,null,null,null,null,null,null,null,null,null,null,null,null,null,null,null,null,null,"MT499",{"$f":"X148&$AA$5","v":"Montana-NWQ"}]
[null,null,null,null,null,null,null,null,null,null,null,null,null,null,null,null,null,null,null,null,null,null,null,"Nebraska","NE100",{"$f":"X152&$AA$2","v":"Nebraska-Total"}]
[null,null,null,null,null,null,null,null,null,null,null,null,null,null,null,null,null,null,null,null,null,null,null,null,"NE334","Lincoln RO"]
[null,null,null,null,null,null,null,null,null,null,null,null,null,null,null,null,null,null,null,null,null,null,null,null,"NE-1",{"$f":"X152&$AA$4","v":"Nebraska-Other RO"}]
[null,null,null,null,null,null,null,null,null,null,null,null,null,null,null,null,null,null,null,null,null,null,null,null,"NE499",{"$f":"X152&$AA$5","v":"Nebraska-NWQ"}]
[null,null,null,null,null,null,null,null,null,null,null,null,null,null,null,null,null,null,null,null,null,null,null,"North Dakota","ND100",{"$f":"X156&$AA$2","v":"North Dakota-Total"}]
[null,null,null,null,null,null,null,null,null,null,null,null,null,null,null,null,null,null,null,null,null,null,null,null,"ND437","Fargo RO"]
[null,null,null,null,null,null,null,null,null,null,null,null,null,null,null,null,null,null,null,null,null,null,null,null,"ND-1",{"$f":"X156&$AA$4","v":"North Dakota-Other RO"}]
[null,null,null,null,null,null,null,null,null,null,null,null,null,null,null,null,null,null,null,null,null,null,null,null,"ND499",{"$f":"X156&$AA$5","v":"North Dakota-NWQ"}]
[null,null,null,null,null,null,null,null,null,null,null,null,null,null,null,null,null,null,null,null,null,null,null,"Oklahoma","OK100",{"$f":"X160&$AA$2","v":"Oklahoma-Total"}]
[null,null,null,null,null,null,null,null,null,null,null,null,null,null,null,null,null,null,null,null,null,null,null,null,"OK351","Muskogee RO"]
[null,null,null,null,null,null,null,null,null,null,null,null,null,null,null,null,null,null,null,null,null,null,null,null,"OK-1",{"$f":"X160&$AA$4","v":"Oklahoma-Other RO"}]
[null,null,null,null,null,null,null,null,null,null,null,null,null,null,null,null,null,null,null,null,null,null,null,null,"OK499",{"$f":"X160&$AA$5","v":"Oklahoma-NWQ"}]
[null,null,null,null,null,null,null,null,null,null,null,null,null,null,null,null,null,null,null,null,null,null,null,"South Dakota","SD100",{"$f":"X164&$AA$2","v":"South Dakota-Total"}]
[null,null,null,null,null,null,null,null,null,null,null,null,null,null,null,null,null,null,null,null,null,null,null,null,"SD438","Sioux Falls RO"]
[null,null,null,null,null,null,null,null,null,null,null,null,null,null,null,null,null,null,null,null,null,null,null,null,"SD-1",{"$f":"X164&$AA$4","v":"South Dakota-Other RO"}]
[null,null,null,null,null,null,null,null,null,null,null,null,null,null,null,null,null,null,null,null,null,null,null,null,"SD499",{"$f":"X164&$AA$5","v":"South Dakota-NWQ"}]
[null,null,null,null,null,null,null,null,null,null,null,null,null,null,null,null,null,null,null,null,null,null,null,"Texas","TX100",{"$f":"X168&$AA$2","v":"Texas-Total"}]
[null,null,null,null,null,null,null,null,null,null,null,null,null,null,null,null,null,null,null,null,null,null,null,null,"TX362","Houston RO"]
[null,null,null,null,null,null,null,null,null,null,null,null,null,null,null,null,null,null,null,null,null,null,null,null,"TX349","Waco RO"]
[null,null,null,null,null,null,null,null,null,null,null,null,null,null,null,null,null,null,null,null,null,null,null,null,"TX-1",{"$f":"X168&$AA$4","v":"Texas-Other RO"}]
[null,null,null,null,null,null,null,null,null,null,null,null,null,null,null,null,null,null,null,null,null,null,null,null,"TX499",{"$f":"X168&$AA$5","v":"Texas-NWQ"}]
[null,null,null,null,null,null,null,null,null,null,null,null,null,null,null,null,null,null,null,null,null,null,null,"Wyoming","WY100",{"$f":"X173&$AA$2","v":"Wyoming-Total"}]
[null,null,null,null,null,null,null,null,null,null,null,null,null,null,null,null,null,null,null,null,null,null,null,null,"WY442","Cheyenne RO"]
[null,null,null,null,null,null,null,null,null,null,null,null,null,null,null,null,null,null,null,null,null,null,null,null,"WY-1",{"$f":"X173&$AA$4","v":"Wyoming-Other RO"}]
[null,null,null,null,null,null,null,null,null,null,null,null,null,null,null,null,null,null,null,null,null,null,null,null,"WY499",{"$f":"X173&$AA$5","v":"Wyoming-NWQ"}]
[null,null,null,null,null,null,null,null,null,null,null,null,null,null,null,null,null,null,null,null,null,null,null,"Pacific District",null," "]
[null,null,null,null,null,null,null,null,null,null,null,null,null,null,null,null,null,null,null,null,null,null,null,"Alaska","AK100",{"$f":"X178&$AA$2","v":"Alaska-Total"}]
[null,null,null,null,null,null,null,null,null,null,null,null,null,null,null,null,null,null,null,null,null,null,null,null,"AK463","Anchorage RO"]
[null,null,null,null,null,null,null,null,null,null,null,null,null,null,null,null,null,null,null,null,null,null,null," ","AK-1",{"$f":"X178&$AA$4","v":"Alaska-Other RO"}]
[null,null,null,null,null,null,null,null,null,null,null,null,null,null,null,null,null,null,null,null,null,null,null," ","AK499",{"$f":"X178&$AA$5","v":"Alaska-NWQ"}]
[null,null,null,null,null,null,null,null,null,null,null,null,null,null,null,null,null,null,null,null,null,null,null,"Arizona","AZ100",{"$f":"X182&$AA$2","v":"Arizona-Total"}]
[null,null,null,null,null,null,null,null,null,null,null,null,null,null,null,null,null,null,null,null,null,null,null,null,"AZ345","Phoenix RO"]
[null,null,null,null,null,null,null,null,null,null,null,null,null,null,null,null,null,null,null,null,null,null,null," ","AZ-1",{"$f":"X182&$AA$4","v":"Arizona-Other RO"}]
[null,null,null,null,null,null,null,null,null,null,null,null,null,null,null,null,null,null,null,null,null,null,null," ","AZ499",{"$f":"X182&$AA$5","v":"Arizona-NWQ"}]
[null,null,null,null,null,null,null,null,null,null,null,null,null,null,null,null,null,null,null,null,null,null,null,"California","CA100",{"$f":"X186&$AA$2","v":"California-Total"}]
[null,null,null,null,null,null,null,null,null,null,null,null,null,null,null,null,null,null,null,null,null,null,null,null,"CA344","Los Angeles RO"]
[null,null,null,null,null,null,null,null,null,null,null,null,null,null,null,null,null,null,null,null,null,null,null,null,"CA343","Oakland RO"]
[null,null,null,null,null,null,null,null,null,null,null,null,null,null,null,null,null,null,null,null,null,null,null," ","CA377","San Diego RO"]
[null,null,null,null,null,null,null,null,null,null,null,null,null,null,null,null,null,null,null,null,null,null,null," ","CA-1",{"$f":"X186&$AA$4","v":"California-Other RO"}]
[null,null,null,null,null,null,null,null,null,null,null,null,null,null,null,null,null,null,null,null,null,null,null," ","CA499",{"$f":"X186&$AA$5","v":"California-NWQ"}]
[null,null,null,null,null,null,null,null,null,null,null,null,null,null,null,null,null,null,null,null,null,null,null,"Hawaii","HI100",{"$f":"X192&$AA$2","v":"Hawaii-Total"}]
[null,null,null,null,null,null,null,null,null,null,null,null,null,null,null,null,null,null,null,null,null,null,null,null,"HI459","Honolulu RO"]
[null,null,null,null,null,null,null,null,null,null,null,null,null,null,null,null,null,null,null,null,null,null,null,null,"HI-1",{"$f":"X192&$AA$4","v":"Hawaii-Other RO"}]
[null,null,null,null,null,null,null,null,null,null,null,null,null,null,null,null,null,null,null,null,null,null,null,null,"HI499",{"$f":"X192&$AA$5","v":"Hawaii-NWQ"}]
[null,null,null,null,null,null,null,null,null,null,null,null,null,null,null,null,null,null,null,null,null,null,null,"Idaho","ID100",{"$f":"X196&$AA$2","v":"Idaho-Total"}]
[null,null,null,null,null,null,null,null,null,null,null,null,null,null,null,null,null,null,null,null,null,null,null,null,"ID347","Boise RO"]
[null,null,null,null,null,null,null,null,null,null,null,null,null,null,null,null,null,null,null,null,null,null,null,null,"ID-1",{"$f":"X196&$AA$4","v":"Idaho-Other RO"}]
[null,null,null,null,null,null,null,null,null,null,null,null,null,null,null,null,null,null,null,null,null,null,null,null,"ID499",{"$f":"X196&$AA$5","v":"Idaho-NWQ"}]
[null,null,null,null,null,null,null,null,null,null,null,null,null,null,null,null,null,null,null,null,null,null,null,"Nevada","NV100",{"$f":"X200&$AA$2","v":"Nevada-Total"}]
[null,null,null,null,null,null,null,null,null,null,null,null,null,null,null,null,null,null,null,null,null,null,null,null,"NV354","Reno RO"]
[null,null,null,null,null,null,null,null,null,null,null,null,null,null,null,null,null,null,null,null,null,null,null,null,"NV-1",{"$f":"X200&$AA$4","v":"Nevada-Other RO"}]
[null,null,null,null,null,null,null,null,null,null,null,null,null,null,null,null,null,null,null,null,null,null,null,null,"NV499",{"$f":"X200&$AA$5","v":"Nevada-NWQ"}]
[null,null,null,null,null,null,null,null,null,null,null,null,null,null,null,null,null,null,null,null,null,null,null,"New Mexico","NM100",{"$f":"X204&$AA$2","v":"New Mexico-Total"}]
[null,null,null,null,null,null,null,null,null,null,null,null,null,null,null,null,null,null,null,null,null,null,null,null,"NM340","Albuquerque RO"]
[null,null,null,null,null,null,null,null,null,null,null,null,null,null,null,null,null,null,null,null,null,null,null,null,"NM-1",{"$f":"X204&$AA$4","v":"New Mexico-Other RO"}]
[null,null,null,null,null,null,null,null,null,null,null,null,null,null,null,null,null,null,null,null,null,null,null,null,"NM499",{"$f":"X204&$AA$5","v":"New Mexico-NWQ"}]
[null,null,null,null,null,null,null,null,null,null,null,null,null,null,null,null,null,null,null,null,null,null,null,"Oregon","OR100",{"$f":"X208&$AA$2","v":"Oregon-Total"}]
[null,null,null,null,null,null,null,null,null,null,null,null,null,null,null,null,null,null,null,null,null,null,null,null,"OR348","Portland RO"]
[null,null,null,null,null,null,null,null,null,null,null,null,null,null,null,null,null,null,null,null,null,null,null,null,"OR-1",{"$f":"X208&$AA$4","v":"Oregon-Other RO"}]
[null,null,null,null,null,null,null,null,null,null,null,null,null,null,null,null,null,null,null,null,null,null,null,null,"OR499",{"$f":"X208&$AA$5","v":"Oregon-NWQ"}]
[null,null,null,null,null,null,null,null,null,null,null,null,null,null,null,null,null,null,null,null,null,null,null,"Philippines","PI100",{"$f":"X212&$AA$2","v":"Philippines-Total"}]
[null,null,null,null,null,null,null,null,null,null,null,null,null,null,null,null,null,null,null,null,null,null,null,null,"PI358","Manila RO"]
[null,null,null,null,null,null,null,null,null,null,null,null,null,null,null,null,null,null,null,null,null,null,null,null,"PI-1",{"$f":"X212&$AA$4","v":"Philippines-Other RO"}]
[null,null,null,null,null,null,null,null,null,null,null,null,null,null,null,null,null,null,null,null,null,null,null,null,"PI499",{"$f":"X212&$AA$5","v":"Philippines-NWQ"}]
[null,null,null,null,null,null,null,null,null,null,null,null,null,null,null,null,null,null,null,null,null,null,null,"Utah","UT100",{"$f":"X216&$AA$2","v":"Utah-Total"}]
[null,null,null,null,null,null,null,null,null,null,null,null,null,null,null,null,null,null,null,null,null,null,null,null,"UT341","Salt Lake City RO"]
[null,null,null,null,null,null,null,null,null,null,null,null,null,null,null,null,null,null,null,null,null,null,null,null,"UT-1",{"$f":"X216&$AA$4","v":"Utah-Other RO"}]
[null,null,null,null,null,null,null,null,null,null,null,null,null,null,null,null,null,null,null,null,null,null,null,null,"UT499",{"$f":"X216&$AA$5","v":"Utah-NWQ"}]
[null,null,null,null,null,null,null,null,null,null,null,null,null,null,null,null,null,null,null,null,null,null,null,"Washington","WA100",{"$f":"X220&$AA$2","v":"Washington-Total"}]
[null,null,null,null,null,null,null,null,null,null,null,null,null,null,null,null,null,null,null,null,null,null,null,null,"WA346","Seattle RO"]
[null,null,null,null,null,null,null,null,null,null,null,null,null,null,null,null,null,null,null,null,null,null,null,null,"WA-1",{"$f":"X220&$AA$4","v":"Washington-Other RO"}]
[null,null,null,null,null,null,null,null,null,null,null,null,null,null,null,null,null,null,null,null,null,null,null,null,"WA499",{"$f":"X220&$AA$5","v":"Washington-NWQ"}]
[null,null,null,null,null,null,null,null,null,null,null,null,null,null,null,null,null,null,null,null,null,null,null,"Other District",null," "]
[null,null,null,null,null,null,null,null,null,null,null,null,null,null,null,null,null,null,null,null,null,null,null,"Outside US","OT-1",{"$f":"X225&$AA$4","v":"Outside US-Other RO"}]
[null,null,null,null,null,null,null,null,null,null,null,null,null,null,null,null,null,null,null,null,null,null,null," ","OT499",{"$f":"X225&$AA$5","v":"Outside US-NWQ"}]

{"sheet":"Data","index":4,"n_rows":2227,"n_cols":16,"rows_kept":2227,"cut":false,"hidden":true,"merged":[]}
["MT","CAT","LOC","EP","INV","BL","ADP","PROD_MTD","PROD_FYTD","ADCM","ADCF","DEV","EVD","DEC","AWD","AUT"]
[5,0,327,-1,1129,362,124.86,3112,24197,149.33000000000001,128.63,113,595,328,57,36]
[5,0,328,-1,924,225,109.5,1600,10982,124.44,118.25,180,304,377,54,9]
[5,0,329,-1,1167,224,86.59,2875,23497,119.7,103.5,204,438,463,54,8]
[5,0,330,-1,2111,464,97.61,3974,30647,129.05000000000001,97.46,362,729,605,292,123]
[5,0,331,-1,2254,920,163.03,2555,17436,268.13,221.72,153,1385,629,59,28]
[5,0,333,-1,864,212,110.9,1820,14317,137.58000000000001,122.14,131,285,359,71,18]
[5,0,334,-1,1089,418,162.13,1649,12051,277.3,205.6,123,579,340,34,13]
[5,0,335,-1,2810,913,142.33000000000001,4676,38280,151.99,128.49,425,1060,861,402,62]
[5,0,339,-1,1276,339,109.97,2767,23125,137.13999999999999,118.76,205,562,430,74,5]
[5,0,340,-1,525,170,118.42,802,6667,193.46,165.14,85,205,192,36,7]
[5,0,341,-1,1967,1002,210.33,1924,12690,312.79000000000002,277.17,157,859,530,408,13]
[5,0,343,-1,1060,483,191.69,1274,8812,291.42,218.21,153,416,430,49,12]
[5,0,344,-1,1524,505,132.22999999999999,2194,18005,175.89,140.41,217,714,563,14,16]
[5,0,345,-1,2276,996,188.52,3424,21809,190.78,172.75,241,1144,682,195,14]
[5,0,346,-1,3280,725,94.49,8265,66313,98,87.65,260,1008,1537,278,197]
[5,0,347,-1,595,107,91.82,1216,9545,130.9,122.99,76,143,249,99,28]
[5,0,348,-1,1565,672,158.01,1472,13447,221.43,178.21,168,951,399,30,17]
[5,0,349,-1,4494,2029,188.35,6531,40152,192.57,197.57,366,2149,1622,293,64]
[5,0,350,-1,754,193,99.98,1696,13862,144.71,119.62,135,302,265,44,8]
[5,0,351,-1,2111,750,144.43,4558,34187,157.62,124.19,115,915,986,78,17]
[5,0,354,-1,509,165,135.78,834,5563,318.23,210.75,149,183,159,14,4]
[5,0,355,-1,651,157,110.79,1167,9952,116.35,128.91999999999999,117,295,188,46,5]
[5,0,358,-1,253,114,166.9,916,6637,143.22,139.30000000000001,17,150,68,16,2]
[5,0,362,-1,2708,700,102.49,5770,42216,124.54,108.75,330,1026,1137,105,110]
[5,0,372,-1,3,null,1.67,1,1,399,399,2,1]
[5,0,373,-1,283,95,134.28,525,4377,213.28,172.72,40,85,148,10]
[5,0,377,-1,2940,875,123.81,5756,51029,137.97999999999999,108.94,208,1387,1191,128,26]
[5,0,387,-1,null,null,null,null,3,null,31.67]
[5,0,392,-1,7750,7429,505.35,4,26,388.25,457.04,null,7749,1]
[5,0,397,-1,null,null,null,22,182,564.59,496.63]
[5,0,402,-1,842,471,204.17,1357,9269,297.23,218.13,79,419,297,39,8]
[5,0,405,-1,172,72,142.36000000000001,258,2205,195.21,136.54,15,65,85,7]
[5,0,436,-1,582,193,120.1,780,6478,219.75,169.8,82,231,251,17,1]
[5,0,437,-1,213,69,140.76,622,5235,189.01,149.69999999999999,31,71,97,10,4]
[5,0,438,-1,461,163,129.13999999999999,894,9305,193.99,113.56,33,192,227,9]
[5,0,442,-1,189,68,164.61,269,2166,269.10000000000002,150.91999999999999,36,76,56,18,3]
[5,0,452,-1,387,116,118.26,830,6553,182.17,155.93,77,157,106,42,5]
[5,0,459,-1,329,100,113.45,806,6462,163.04,142.74,41,134,152,2]
[5,0,460,-1,82,28,112.18,244,1986,208.31,170.93,17,35,27,3]
[5,0,463,-1,231,103,153.07,369,2205,228.62,176.33,38,97,74,19,3]
[5,0,499,-1,502855,161540,138.25,125,1121,100.63,165.16,9236,298779,194489,347,4]
[5,0,-1,-1,null,null,null,2376,23315,110.59,112.44]
[5,11,-1,-1,9967,7552,400.24,1054,11025,195.14,207.06,1746,8131,51,34,5]
[5,11,301,-1,568,177,123.69,1189,9926,150.69999999999999,127.8,74,208,266,19,1]
[5,11,304,-1,972,159,75.17,3106,24484,90.51,77.02,119,316,398,66,73]
[5,11,306,-1,612,228,145.13,1047,11289,187.15,143.49,113,267,173,53,6]
[5,11,307,-1,780,215,122.83,1099,9277,197.97,149.99,96,299,376,6,3]
[5,11,308,-1,505,214,165.18,1015,8284,184.62,150.04,33,233,197,38,4]
[5,11,309,-1,323,76,115.77,1075,7878,161.84,155.12,49,149,122,3]
[5,11,310,-1,4490,1767,146.74,5655,40313,183.54,132.38,359,2606,1236,210,79]
[5,11,311,-1,946,301,140.58000000000001,1465,11902,164.17,154.19,139,454,322,7,24]
[5,11,313,-1,473,115,97.65,856,7005,153.54,139.21,109,175,148,25,16]
[5,11,314,-1,1878,999,196.1,2270,14279,294.27999999999997,265.02999999999997,242,760,781,61,34]
[5,11,315,-1,834,386,193.24,1512,10458,242.24,186.33,70,351,345,62,6]
[5,11,316,-1,3169,1319,162.88999999999999,5329,46279,181.95,140.12,271,1507,1302,47,42]
[5,11,317,-1,5605,2713,192.29,7954,52792,215.05,201.31,658,2320,2325,189,111]
[5,11,318,-1,3539,710,98.5,9122,68779,111.78,101.18,375,1347,1495,263,59]
[5,11,319,-1,2036,640,129.88999999999999,3851,29566,161.05000000000001,134.1,179,1073,663,99,22]
[5,11,320,-1,1466,449,122.21,3031,24901,148.88999999999999,115.1,162,674,610,6,14]
[5,11,321,-1,964,251,111.52,1644,13787,168.01,130.31,138,372,363,76,15]
[5,11,322,-1,1147,328,117.64,1989,16663,156.51,116.45,152,445,458,57,35]
[5,11,323,-1,927,326,124.08,1782,14816,150.94999999999999,129.49,116,510,265,32,4]
[5,11,325,-1,1880,750,161.82,2938,18779,230.83,213.85,248,809,683,79,60]
[5,11,326,-1,1073,330,131.57,1575,14841,172.62,133.81,140,472,433,18,10]
[5,11,327,-1,1108,352,124.62,3087,23938,149.16999999999999,128.61000000000001,106,587,323,57,35]
[5,11,328,-1,905,224,110.8,1588,10802,124.3,118.37,171,300,371,54,9]
[5,11,329,-1,1152,223,87.3,2867,23373,119.87,103.55,193,436,461,54,8]
[5,11,330,-1,1420,302,99.64,2582,18845,147.22999999999999,115.93,236,482,573,90,39]
[5,11,331,-1,2219,912,164.31,2499,16943,271.5,224.99,143,1377,613,58,28]
[5,11,333,-1,854,210,111.54,1814,14168,137.63999999999999,122.51,126,283,356,71,18]
[5,11,334,-1,1080,415,162.63,1635,11783,279.01,208.18,121,575,337,34,13]
[5,11,335,-1,2042,777,165.52,3052,25936,191.25,159.97999999999999,261,781,775,177,48]
[5,11,339,-1,1256,338,110.96,2747,22844,137.4,118.95,199,557,421,74,5]
[5,11,340,-1,514,170,120.19,792,6491,194.88,166.72,84,202,186,35,7]
[5,11,341,-1,1944,999,212.04,1889,12544,317.08999999999997,279.32,153,854,521,403,13]
[5,11,343,-1,1041,480,193.88,1263,8785,293.07,218.63,146,413,423,47,12]
[5,11,344,-1,1491,499,133.31,2170,17612,176.05,141.26,200,707,554,14,16]
[5,11,345,-1,2243,991,190.52,3364,21112,192.94,176.65,226,1135,675,193,14]
[5,11,346,-1,3259,721,94.54,8234,65924,97.36,87.54,258,999,1528,278,196]
[5,11,347,-1,590,106,92.21,1202,9377,131.44999999999999,123.12,73,142,249,98,28]
[5,11,348,-1,1540,664,158.37,1453,13176,223.01,179.77,163,939,391,30,17]
[5,11,349,-1,4408,2011,190.05,6353,38182,196.78,205.13,350,2130,1581,288,59]
[5,11,350,-1,745,191,99.93,1687,13718,144.59,119.86,131,302,260,44,8]
[5,11,351,-1,2069,743,146.22,4423,32754,161.1,127.7,106,905,965,77,16]
[5,11,354,-1,497,165,138.54,824,5418,321.44,213.86,141,183,156,13,4]
[5,11,355,-1,638,157,112.69,1163,9838,116.47,129.04,109,293,185,46,5]
[5,11,358,-1,245,114,171.07,896,6414,144.68,140.88,17,144,66,16,2]
[5,11,362,-1,2638,691,103.89,5584,40585,127.12,111.26,311,1012,1106,102,107]
[5,11,372,-1,3,null,1.67,1,1,399,399,2,1]
[5,11,373,-1,280,92,132.44999999999999,521,4225,213.12,175.11,40,83,147,10]
[5,11,377,-1,2860,867,125.21,5527,49094,142.15,111.51,203,1360,1146,125,26]
[5,11,402,-1,823,465,206.44,1346,9099,298.24,220.12,74,407,296,38,8]
[5,11,405,-1,168,71,143.62,250,2076,199.48,138.57,15,64,83,6]
[5,11,436,-1,574,191,119.88,771,6336,221.17,171.43,81,230,245,17,1]
[5,11,437,-1,210,68,139.84,610,5066,191.85,151.29,31,69,96,10,4]
[5,11,438,-1,459,163,129.46,885,9202,195.52,113.85,33,192,225,9]
[5,11,442,-1,182,67,168.34,266,2070,270.89,153.12,35,75,52,18,2]
[5,11,452,-1,384,115,118.65,816,6373,183.67,156.86000000000001,76,156,105,42,5]
[5,11,459,-1,317,99,115.6,792,6228,164.66,145.24,36,131,148,2]
[5,11,460,-1,80,28,114.29,238,1880,210.24,174.25,17,35,26,2]
[5,11,463,-1,231,103,153.07,354,2045,234.71,182.59,38,97,74,19,3]
[5,11,499,-1,478756,157069,140.63999999999999,113,1037,108.81,172.06,2937,283639,192105,75]
[5,11,100,-1,565379,191858,145.75,136216,1042617,171.65,143.11000000000001,13230,325755,220836,4176,1379]
[5,12,-1,-1,517,51,41.57,1362,12750,53.82,39.49,423,63,17,13,1]
[5,12,310,-1,15,null,8,4,180,4.75,22.84,13,2]
[5,12,330,-1,686,161,92.58,1382,11642,95.3,67.260000000000005,126,245,30,202,83]
[5,12,335,-1,759,131,80.260000000000005,1614,12198,78.3,62.12,164,274,82,225,14]
[5,12,499,-1,21378,3718,86.98,9,57,31.11,103.44,6299,12551,2275,251,2]
[5,12,100,-1,23355,4061,85.87,4371,36827,75.88,55.78,7025,13135,2404,691,100]
[5,13,-1,-1,3,2,199.67,5,38,37.4,39.92,null,2,null,1]
[5,13,301,-1,5,2,165.4,7,145,61.57,109.57,null,2,3]
[5,13,304,-1,3,1,141.66999999999999,8,165,79.63,89.41,null,1,2]
[5,13,306,-1,6,2,124,23,269,111.87,92.33,null,2,3,1]
[5,13,307,-1,4,1,90.25,13,207,85,100.72,null,2,2]
[5,13,308,-1,10,2,61.2,15,215,88.73,105.01,null,6,2,2]
[5,13,309,-1,2,1,118.5,11,168,77.64,112.43,null,null,2]
[5,13,310,-1,21,5,99.52,33,265,70.27,92.52,null,11,10]
[5,13,311,-1,32,14,128.88,59,564,177.02,132.66999999999999,null,17,14,null,1]
[5,13,313,-1,10,4,162.6,19,316,110.05,101.55,null,5,5]
[5,13,314,-1,23,4,69.739999999999995,106,1039,63.4,61.87,null,10,13]
[5,13,315,-1,4,2,167.5,12,192,77.08,103.32,null,null,4]
[5,13,316,-1,66,11,90.52,192,2012,52.08,62.76,null,16,47,1,2]
[5,13,317,-1,40,8,97.95,81,769,68.569999999999993,51.08,null,15,20,5]
[5,13,318,-1,47,1,36.57,232,2450,32.869999999999997,46.89,null,14,24,6,3]
[5,13,319,-1,41,2,42.76,128,1576,48.41,45.65,null,12,25,4]
[5,13,320,-1,45,6,71.069999999999993,124,1314,34.83,37.22,null,9,30,6]
[5,13,321,-1,8,2,87.63,15,206,121.47,105.81,null,1,5,2]
[5,13,322,-1,16,5,139.56,16,180,124.69,138.04,1,3,11,1]
[5,13,323,-1,13,1,75.23,16,174,224.56,124.93,null,3,10]
[5,13,325,-1,10,2,126.4,16,223,127.81,107.98,null,3,2,null,5]
[5,13,326,-1,14,2,70.290000000000006,34,305,73.349999999999994,98.66,null,4,10]
[5,13,327,-1,5,2,133.4,22,210,166.18,107.13,null,4,null,null,1]
[5,13,328,-1,9,1,97.78,12,180,141.91999999999999,111.49,null,3,6]
[5,13,329,-1,4,1,115.25,8,124,58.88,94.43,null,2,2]
[5,13,330,-1,5,1,210.6,10,160,100.9,118.68,null,2,2,null,1]
[5,13,331,-1,25,8,114.08,56,492,117.57,109.35,null,8,16,1]
[5,13,333,-1,5,2,110,6,149,118.67,87.06,null,2,3]
[5,13,334,-1,7,3,130.71,14,267,77.790000000000006,92.57,null,4,3]
[5,13,335,-1,9,5,114.33,10,146,63.2,81.569999999999993,null,5,4]
[5,13,339,-1,14,1,66.430000000000007,20,281,101.3,103.24,null,5,9]
[5,13,340,-1,9,null,43.11,10,176,80.400000000000006,107.22,null,3,6]
[5,13,341,-1,15,1,50.13,33,128,70.36,76.27,null,3,8,4]
[5,13,343,-1,10,3,134.1,11,27,102,82.15,null,2,7,1]
[5,13,344,-1,15,6,178.73,23,391,154.91,102.09,null,6,9]
[5,13,345,-1,16,4,93.06,59,692,67.53,53.88,null,8,7,1]
[5,13,346,-1,19,4,94.84,31,388,266.74,106.59,null,9,9,null,1]
[5,13,347,-1,1,1,218,14,168,83.86,115.68,null,1]
[5,13,348,-1,20,8,169.05,19,271,100.89,102.42,null,12,8]
[5,13,349,-1,61,12,82.48,177,1938,42.28,48.67,null,16,36,5,4]
[5,13,350,-1,5,2,184.6,9,144,166.11,97.22,null,null,5]
[5,13,351,-1,33,7,71.09,135,1429,43.59,43.19,null,10,21,1,1]
[5,13,354,-1,4,null,37.5,10,145,53.5,94.43,null,null,3,1]
[5,13,355,-1,5,null,35.799999999999997,4,114,82.75,118.54,null,2,3]
[5,13,358,-1,8,null,39.130000000000003,20,223,77.7,93.7,null,6,2]
[5,13,362,-1,51,9,67.16,186,1631,47.14,46.13,null,14,31,3,3]
[5,13,373,-1,3,3,305.33,4,151,235,106.97,null,2,1]
[5,13,377,-1,74,8,79.23,229,1933,37.42,43.75,null,26,45,3]
[5,13,402,-1,3,1,116.33,11,159,174.09,108.05,null,1,1,1]
[5,13,405,-1,3,1,118.67,8,129,61.5,103.84,null,1,2]
[5,13,436,-1,8,2,136.25,9,142,98.11,96.89,1,1,6]
[5,13,437,-1,3,1,205,12,169,44.42,102.21,null,2,1]
[5,13,438,-1,2,null,56,9,103,44.33,87.64,null,null,2]
[5,13,442,-1,6,1,78.5,3,96,109.67,103.45,null,1,4,null,1]
[5,13,452,-1,2,1,101.5,14,180,94.64,123.21,null,1,1]
[5,13,459,-1,7,1,95.43,14,234,71.069999999999993,76.290000000000006,null,3,4]
[5,13,460,-1,1,null,54,6,106,131.83000000000001,111.99,null,null,1]
[5,13,463,-1,null,null,null,15,160,84.8,96.36]
[5,13,499,-1,2719,753,121.2,null,null,null,null,null,2589,107,21,2]
[5,13,100,-1,3609,933,113.78,2398,26228,67.05,68.739999999999995,2,2892,619,71,25]
[5,14,-1,-1,null,null,null,1,4,306,214.25]
[5,14,499,-1,2,null,37,null,null,null,null,null,null,2]
[5,14,100,-1,2,null,37,1,4,306,214.25,null,null,2]
[5,0,35,-1,512930,169106,143.32,2531,24681,114.36,117.96,11073,306925,194540,383,9]
[5,0,384,-1,17184,5970,144.19,31166,234065,166.16,140.77000000000001,1954,7303,6472,1153,302]
[5,0,393,-1,24525,8892,146.43,45386,350340,166.52,139.66999999999999,2820,10656,9582,1069,396]
[5,0,394,-1,20652,6867,133.88999999999999,34651,267406,172.56,138.69999999999999,2600,9507,7041,1045,458]
[5,0,395,-1,17054,6017,144.81,29252,229184,166.45,136.08000000000001,1810,7391,6226,1288,339]
[5,11,35,-1,488723,164621,145.93,1167,12062,186.78,204.05,4683,291770,192156,109,5]
[5,11,384,-1,16156,5789,148.33000000000001,28956,215299,173.44,147.71,1730,6965,6264,919,278]
[5,11,393,-1,24056,8821,147.88999999999999,44421,339814,168.88,142.09,2709,10541,9375,1039,390]
[5,11,394,-1,19672,6649,136.19999999999999,32912,251222,176.46,142.63999999999999,2370,9173,6924,836,368]
[5,11,395,-1,16772,5978,146.03,28760,224220,168.01,137.51,1738,7306,6117,1273,338]
[5,13,35,-1,2722,755,121.29,5,38,37.4,39.92,null,2591,107,22,2]
[5,13,384,-1,201,44,83.17,595,6531,50.53,58.5,1,61,121,9,9]
[5,13,393,-1,318,46,77.099999999999994,957,10380,56.67,58.17,1,89,197,25,6]
[5,13,394,-1,170,52,118.91,353,4343,113.96,107.43,null,72,86,5,7]
[5,13,395,-1,198,36,96.19,488,4936,73.930000000000007,70.709999999999994,null,79,108,10,1]
[6,0,100,-1,592345,196852,143.19,142986,1105676,166.97,138.44]
[6,11,100,-1,564710,191706,145.91999999999999,134215,1029519,172.53,143.80000000000001]
[6,11,"AK",-1,1917,711,152.87,444,3054,170.21,143]
[6,11,"AL",-1,13776,4274,138,3370,26288,171.78,144.21]
[6,11,"AR",-1,6300,2231,156.91999999999999,1487,11262,191.41,153.9]
[6,11,"AZ",-1,12662,4542,152.47999999999999,3033,23376,176.22,144.06]
[6,11,"CA",-1,46115,15399,146.16,10973,83150,169.86,139.47999999999999]
[6,11,"CO",-1,10945,3384,136.94999999999999,2728,21140,160.47999999999999,130.62]
[6,11,"CT",-1,3159,1165,161.47999999999999,799,5604,193.65,158.32]
[6,11,"DC",-1,717,234,141.43,175,1221,162.91999999999999,143.07]
[6,11,"DE",-1,1658,532,137.54,387,2969,168.69,142.94]
[6,11,"FL",-1,52370,18288,144.19,11881,91389,171.71,142.87]
[6,11,"GA",-1,27310,7918,129.82,6673,53805,157.66999999999999,132.87]
[6,11,"HI",-1,3416,1187,149.84,896,6222,164.42,142.16]
[6,11,"IA",-1,4746,1804,159.27000000000001,1025,8047,185.38,163.69999999999999]
[6,11,"ID",-1,3364,1307,161.72999999999999,768,5995,190.02,148.19]
[6,11,"IL",-1,12857,4870,157.09,2858,22464,190.4,155]
[6,11,"IN",-1,9929,3633,152.91,2442,17597,187.61,155.09]
[6,11,"KS",-1,4294,1622,157.74,1042,8028,180.58,150.85]
[6,11,"KY",-1,7830,2803,152.56,1923,13846,175.57,148.5]
[6,11,"LA",-1,9870,3077,139.93,2338,17963,172.47,146.88]
[6,11,"MA",-1,5763,2109,157.44999999999999,1427,10241,184.73,152.38999999999999]
[6,11,"MD",-1,10838,3129,127.41,2600,20594,146.32,126.13]
[6,11,"ME",-1,2365,951,171.25,522,3840,205.76,171.46]
[6,11,"MI",-1,11916,4361,155.83000000000001,2716,21145,182.74,152.81]
[6,11,"MN",-1,7191,2532,155.33000000000001,1754,13515,178.59,154.02000000000001]
[6,11,"MO",-1,10916,4061,155.94999999999999,2490,19102,193.53,158.51]
[6,11,"MS",-1,7119,2284,140.72999999999999,1708,12855,175.23,149.13]
[6,11,"MT",-1,2535,954,157.93,584,4011,202.18,170.8]
[6,11,"NC",-1,25184,7570,132.16,6237,49994,152.25,128.74]
[6,11,"ND",-1,1310,486,153.11000000000001,280,2279,184.14,148.99]
[6,11,"NE",-1,3628,1139,141.02000000000001,832,6645,160.82,142.52000000000001]
[6,11,"NH",-1,1846,694,162.47,407,3069,208.65,161.74]
[6,11,"NJ",-1,7175,2541,153.9,1603,11974,192.27,159.25]
[6,11,"NM",-1,3983,1467,153.04,901,6882,183.2,151.16]
[6,11,"NV",-1,7797,2628,143.76,1794,13153,179.81,144.80000000000001]
[6,11,"NY",-1,13605,5235,162.5,3256,24174,192.89,163.24]
[6,11,"OH",-1,16481,5998,153.86000000000001,3796,29380,192.01,153.82]
[6,11,"OK",-1,10449,3241,137.66,2562,18929,169.3,140.94999999999999]
[6,11,"OR",-1,6886,2826,175.74,1545,11696,201.4,168.18]
[6,11,"OT",-1,7362,4121,210.25,1059,9053,226.27,189.6]
[6,11,"PA",-1,15122,5817,165.12,3439,25749,200.18,162.43]
[6,11,"PR",-1,3917,1339,147.54,1264,9075,132.43,137.99]
[6,11,"RI",-1,1564,539,148.91,371,2586,208.02,157.15]
[6,11,"SC",-1,14532,4723,141.97,3652,28492,163.05000000000001,141.22]
[6,11,"SD",-1,2111,784,152.38,451,3590,184.86,160.68]
[6,11,"TN",-1,14320,4888,149.96,3738,28185,175.08,143.97]
[6,11,"TX",-1,63308,18577,129.59,15533,121429,155.47999999999999,130.47]
[6,11,"UT",-1,3117,1070,145.68,719,5950,170.64,141.15]
[6,11,"VA",-1,22804,7020,132.56,5470,41645,156.59,131.1]
[6,11,"VT",-1,600,245,187.96,144,1123,218.65,190.97]
[6,11,"WA",-1,12569,4619,154.13999999999999,2970,22133,176.41,142.13]
[6,11,"WI",-1,8164,2935,155.25,1905,14343,182.07,157.93]
[6,11,"WV",-1,3651,1365,158.72,961,6942,197.43,165.87]
[6,11,"WY",-1,1347,477,150.62,283,2326,197.64,169.28]
[6,12,100,-1,24024,4213,83.5,6372,49925,87.35,64.52]
[6,12,"AK",-1,43,11,105.07,6,72,62.33,71.53]
[6,12,"AL",-1,696,112,83.55,190,1458,95.3,75.89]
[6,12,"AR",-1,309,52,74.67,98,786,85.94,64.62]
[6,12,"AZ",-1,618,98,77.47,193,1446,83.22,69.760000000000005]
[6,12,"CA",-1,1890,311,83.02,489,3780,95.22,69.08]
[6,12,"CO",-1,372,69,79.17,110,795,78.69,59.06]
[6,12,"CT",-1,180,25,79.19,41,355,97.41,65.66]
[6,12,"DC",-1,27,6,92.74,6,45,68.33,65.09]
[6,12,"DE",-1,77,12,65.75,17,152,96.24,56.6]
[6,12,"FL",-1,1997,335,80.12,531,4287,87.93,60.42]
[6,12,"GA",-1,1048,169,79.45,259,2055,93.76,60.08]
[6,12,"HI",-1,86,16,91.41,18,175,74.06,70.66]
[6,12,"IA",-1,275,53,86.31,82,556,93.38,68.52]
[6,12,"ID",-1,119,18,76.150000000000006,42,298,85.71,61.96]
[6,12,"IL",-1,630,140,95.28,184,1350,83.51,65.400000000000006]
[6,12,"IN",-1,414,76,89.73,112,941,83.34,62]
[6,12,"KS",-1,233,37,88.84,55,491,97.56,62.26]
[6,12,"KY",-1,364,60,74.88,103,813,94.7,64.42]
[6,12,"LA",-1,448,76,78.680000000000007,110,879,85.75,69.22]
[6,12,"MA",-1,277,52,88.01,61,485,83.72,60.38]
[6,12,"MD",-1,369,74,88.76,93,656,80.3,57.66]
[6,12,"ME",-1,87,16,85.39,32,238,62.38,50.33]
[6,12,"MI",-1,730,141,91.67,204,1513,104.55,71.08]
[6,12,"MN",-1,308,55,84.31,97,756,86.32,60.58]
[6,12,"MO",-1,555,108,91.04,148,1179,76.72,65.88]
[6,12,"MS",-1,340,57,83.97,96,675,85.03,74.66]
[6,12,"MT",-1,93,14,88.12,18,192,95,49.29]
[6,12,"NC",-1,948,180,82.83,252,2119,86.16,58.81]
[6,12,"ND",-1,51,9,93.12,10,97,88.9,55.72]
[6,12,"NE",-1,126,30,96.62,33,266,82.55,56.64]
[6,12,"NH",-1,83,15,79.67,19,182,113.05,68.150000000000006]
[6,12,"NJ",-1,357,59,77.48,104,743,82.64,64.23]
[6,12,"NM",-1,180,37,98.24,50,377,75.08,74.209999999999994]
[6,12,"NV",-1,342,80,98.31,106,654,96.14,68.739999999999995]
[6,12,"NY",-1,708,96,76.73,179,1489,78.06,59.08]
[6,12,"OH",-1,946,149,78.489999999999995,228,1778,86.64,64.900000000000006]
[6,12,"OK",-1,465,91,84.12,131,1094,81.87,63.19]
[6,12,"OR",-1,371,74,90.52,77,707,70.989999999999995,59.28]
[6,12,"OT",-1,206,70,136.47,46,284,135.02000000000001,100.23]
[6,12,"PA",-1,868,131,77.150000000000006,201,1545,79.709999999999994,63.32]
[6,12,"PR",-1,337,51,78.03,81,504,127.15,88.68]
[6,12,"RI",-1,58,12,92.5,10,124,102.4,65.55]
[6,12,"SC",-1,627,114,84.61,162,1323,75.650000000000006,59.36]
[6,12,"SD",-1,50,6,66.180000000000007,20,159,69.8,46.55]
[6,12,"TN",-1,694,131,87.35,170,1458,86.01,65.540000000000006]
[6,12,"TX",-1,2197,388,80.760000000000005,610,4623,85.39,66.56]
[6,12,"UT",-1,152,21,78.86,40,359,92.18,59.88]
[6,12,"VA",-1,640,95,74.53,152,1351,88.54,60.85]
[6,12,"VT",-1,24,5,88.04,3,57,51.33,64.77]
[6,12,"WA",-1,447,89,97.83,125,966,89.48,61.61]
[6,12,"WI",-1,340,55,83.38,103,754,69.180000000000007,60.17]
[6,12,"WV",-1,189,26,80.64,53,393,62.38,52.93]
[6,12,"WY",-1,33,6,76.760000000000005,12,91,104.83,56.2]
[6,13,100,-1,3609,933,113.78,2398,26228,67.05,68.739999999999995]
[6,13,"AK",-1,37,14,124.49,21,187,80.239999999999995,78.45]
[6,13,"AL",-1,72,23,132.15,39,522,102.28,71.959999999999994]
[6,13,"AR",-1,35,11,159.49,15,173,121.53,78.099999999999994]
[6,13,"AZ",-1,73,14,93.62,51,538,60.88,67.58]
[6,13,"CA",-1,375,72,87.99,251,2440,55.36,60.76]
[6,13,"CO",-1,104,30,131.44,70,777,38.340000000000003,48.52]
[6,13,"CT",-1,24,4,125,10,103,90.5,96.1]
[6,13,"DC",-1,11,2,58.18,5,59,51.6,41.75]
[6,13,"DE",-1,14,3,86.29,9,69,107.11,97.14]
[6,13,"FL",-1,334,84,108.18,225,2603,63.61,69.7]
[6,13,"GA",-1,145,29,101.79,108,1080,57.26,72.430000000000007]
[6,13,"HI",-1,49,16,115.63,24,321,42.5,56.76]
[6,13,"IA",-1,22,9,136.94999999999999,5,105,95.6,74.760000000000005]
[6,13,"ID",-1,31,6,124.68,23,229,46.48,57.92]
[6,13,"IL",-1,51,15,127.14,38,426,83.13,71.8]
[6,13,"IN",-1,33,9,107.85,27,250,107.78,119.08]
[6,13,"KS",-1,27,2,62.67,28,274,60.29,63.58]
[6,13,"KY",-1,37,13,126.73,26,274,79.92,62.84]
[6,13,"LA",-1,60,10,79.67,18,291,72.83,81.44]
[6,13,"MA",-1,29,10,157.9,14,166,43.29,94.57]
[6,13,"MD",-1,131,31,110.9,78,903,168,83.1]
[6,13,"ME",-1,11,5,277.18,6,56,158.66999999999999,128.77000000000001]
[6,13,"MI",-1,51,18,127.9,24,236,119.67,84.98]
[6,13,"MN",-1,20,8,164.05,4,109,30.25,86.1]
[6,13,"MO",-1,51,14,119.8,34,386,78.290000000000006,72.06]
[6,13,"MS",-1,28,8,100.14,25,190,84.64,108.91]
[6,13,"MT",-1,13,7,196.54,5,85,128,107.8]
[6,13,"NC",-1,178,32,98.51,144,1624,41.51,52.94]
[6,13,"ND",-1,10,1,60.1,3,49,19.670000000000002,88.53]
[6,13,"NE",-1,14,3,90.64,19,174,45.74,74.569999999999993]
[6,13,"NH",-1,7,4,341.14,3,66,159,100.73]
[6,13,"NJ",-1,41,14,169.54,22,208,37.18,77.010000000000005]
[6,13,"NM",-1,32,11,168.91,17,188,40.35,73.5]
[6,13,"NV",-1,34,7,99,24,319,39.25,60.91]
[6,13,"NY",-1,82,23,115.99,40,398,65.88,86.05]
[6,13,"OH",-1,64,21,120.11,50,465,87.2,75.09]
[6,13,"OK",-1,47,13,112.09,44,385,57.05,47.7]
[6,13,"OR",-1,30,11,167.63,16,136,77.69,77.290000000000006]
[6,13,"OT",-1,146,59,154.12,57,435,159.47,122.91]
[6,13,"PA",-1,49,14,145.04,31,329,134.55000000000001,89.96]
[6,13,"PR",-1,16,2,58.44,4,54,82.75,125]
[6,13,"RI",-1,7,3,145.57,5,29,98.6,83.83]
[6,13,"SC",-1,64,10,85.78,59,686,56.85,65.06]
[6,13,"SD",-1,11,3,93.18,6,72,19.170000000000002,88.06]
[6,13,"TN",-1,74,17,101.2,66,668,45.56,61.15]
[6,13,"TX",-1,379,95,112.07,280,3271,51.05,63.47]
[6,13,"UT",-1,26,4,75.73,17,213,57.65,68.25]
[6,13,"VA",-1,252,62,116,195,2351,61.27,62.04]
[6,13,"VT",-1,5,2,104.8,1,19,33,122.53]
[6,13,"WA",-1,122,33,91.76,87,938,47.79,57.86]
[6,13,"WI",-1,34,14,182.21,13,182,87.23,100.11]
[6,13,"WV",-1,9,4,172.33,8,65,18.38,84.49]
[6,13,"WY",-1,8,4,100,4,52,92.25,66.75]
[6,14,100,-1,2,null,37,1,4,306,214.25]
[6,14,"CA",-1,1,null,17]
[6,14,"GA",-1,null,null,null,null,1,null,287]
[6,14,"IL",-1,null,null,null,null,1,null,17]
[6,14,"PA",-1,null,null,null,1,1,306,306]
[6,14,"TX",-1,null,null,null,null,1,null,247]
[6,14,"WI",-1,1,null,57]
[6,0,"AK",-1,1997,736,151.32,471,3313,164.82,137.80000000000001]
[6,0,"AL",-1,14544,4409,135.37,3599,28268,166.99,139.36000000000001]
[6,0,"AR",-1,6644,2294,153.11000000000001,1600,12221,184.29,147.08000000000001]
[6,0,"AZ",-1,13353,4654,148.68,3277,25360,168.94,138.21]
[6,0,"CA",-1,48381,15782,143.24,11713,89370,164.29,134.35]
[6,0,"CO",-1,11421,3483,135.02000000000001,2908,22712,154.44999999999999,125.31]
[6,0,"CT",-1,3363,1194,156.82,850,6062,187.8,151.83000000000001]
[6,0,"DC",-1,755,242,138.47999999999999,186,1325,156.88,135.91]
[6,0,"DE",-1,1749,547,133.97,413,3190,164.37,137.83000000000001]
[6,0,"FL",-1,54701,18707,141.63,12637,98279,166.26,137.33000000000001]
[6,0,"GA",-1,28503,8116,127.83,7040,56941,153.77000000000001,129.1]
[6,0,"HI",-1,3551,1219,147.94999999999999,938,6718,159.57,136.22]
[6,0,"IA",-1,5043,1866,155.19,1112,8708,178.2,156.55000000000001]
[6,0,"ID",-1,3514,1331,158.51,833,6522,180.8,141.08000000000001]
[6,0,"IL",-1,13538,5025,154.1,3080,24241,182.7,148.54]
[6,0,"IN",-1,10376,3718,150.25,2581,18788,182.25,149.94999999999999]
[6,0,"KS",-1,4554,1661,153.66,1125,8793,173.53,143.18]
[6,0,"KY",-1,8231,2876,149,2052,14933,170.3,142.35]
[6,0,"LA",-1,10378,3163,136.94,2466,19133,167.88,142.32]
[6,0,"MA",-1,6069,2171,154.28,1502,10892,179.31,147.41]
[6,0,"MD",-1,11338,3234,125.96,2771,22153,144.71,122.35]
[6,0,"ME",-1,2463,972,168.69,560,4134,197.06,163.91]
[6,0,"MI",-1,12697,4520,152.02000000000001,2944,22894,176.8,146.71]
[6,0,"MN",-1,7519,2595,152.44,1855,14380,173.45,148.59]
[6,0,"MO",-1,11522,4183,152.66,2672,20667,185.59,151.61000000000001]
[6,0,"MS",-1,7487,2349,138,1829,13720,169.26,144.91]
[6,0,"MT",-1,2641,975,155.66,607,4288,198.39,164.11]
[6,0,"NC",-1,26310,7782,130.16,6633,53737,147.34,123.69]
[6,0,"ND",-1,1371,496,150.19999999999999,293,2425,179.2,144.04]
[6,0,"NE",-1,3768,1172,139.35,884,7085,155.41999999999999,137.63]
[6,0,"NH",-1,1936,713,159.57,429,3317,204.07,155.38999999999999]
[6,0,"NJ",-1,7573,2614,150.38,1729,12925,183.7,152.46]
[6,0,"NM",-1,4195,1515,150.81,968,7447,175.11,145.30000000000001]
[6,0,"NV",-1,8173,2715,141.66999999999999,1924,14126,173.44,139.38999999999999]
[6,0,"NY",-1,14395,5354,158.02000000000001,3475,26061,185.52,156.11000000000001]
[6,0,"OH",-1,17491,6168,149.66,4074,31623,184.83,147.66]
[6,0,"OK",-1,10961,3345,135.28,2737,20408,163.31,135.02000000000001]
[6,0,"OR",-1,7287,2911,171.36,1638,12539,194.06,161.06]
[6,0,"OT",-1,7714,4250,207.22,1162,9772,219.38,184.03]
[6,0,"PA",-1,16039,5962,160.30000000000001,3672,27624,193.06,156.03]
[6,0,"PR",-1,4270,1392,141.72,1349,9633,131.96,135.34]
[6,0,"RI",-1,1629,554,146.88999999999999,386,2739,203.87,152.22]
[6,0,"SC",-1,15223,4847,139.37,3873,30501,157.78,135.96]
[6,0,"SD",-1,2172,793,150.09,477,3821,177.95,154.57]
[6,0,"TN",-1,15088,5036,146.84,3974,30311,169.12,138.37]
[6,0,"TX",-1,65884,19060,127.86,16423,129324,151.1,126.49]
[6,0,"UT",-1,3295,1095,142.05000000000001,776,6522,164.12,134.29]
[6,0,"VA",-1,23696,7177,130.81,5817,45347,151.62,125.42]
[6,0,"VT",-1,629,252,183.49,148,1199,214,183.88]
[6,0,"WA",-1,13138,4741,151.65,3182,24037,169.48,135.61000000000001]
[6,0,"WI",-1,8539,3004,152.49,2021,15279,175.71,152.41]
[6,0,"WV",-1,3849,1395,154.91999999999999,1022,7400,189.02,159.16]
[6,0,"WY",-1,1388,487,148.57,299,2469,192.51,162.94999999999999]
[6,0,35,-1,7714,4250,207.22,1162,9772,219.38,184.03]
[6,0,384,-1,116722,35933,134.94999999999999,28720,224413,158.27000000000001,132.52000000000001]
[6,0,393,-1,218924,69543,137.58000000000001,53891,420424,160.81,134.58000000000001]
[6,0,394,-1,142101,50427,151.63999999999999,33493,255113,181.05,148.74]
[6,0,395,-1,106884,36699,147.82,25720,195954,168.88,137.84]
[6,11,35,-1,7362,4121,210.25,1059,9053,226.27,189.6]
[6,11,384,-1,111864,35000,137.03,27074,209939,163.28,137.30000000000001]
[6,11,393,-1,208983,67780,140.12,50702,391741,165.85,139.69]
[6,11,394,-1,134675,49049,155.12,31337,237175,187.46,154.78]
[6,11,395,-1,101826,35756,150.77000000000001,24043,181611,175.21,143.56]
[6,12,35,-1,206,70,136.47,46,284,135.02000000000001,100.23]
[6,12,384,-1,4203,758,82.65,1178,9120,85.6,63.67]
[6,12,393,-1,8637,1458,80.7,2257,18101,88.84,63.75]
[6,12,394,-1,6730,1172,84.2,1745,13586,84.12,63.62]
[6,12,395,-1,4248,755,86.35,1146,8834,89.19,67.22]
[6,13,35,-1,146,59,154.12,57,435,159.47,122.91]
[6,13,384,-1,655,175,115.49,468,5353,50.91,62.51]
[6,13,393,-1,1304,305,107.74,932,10581,60.71,66.33]
[6,13,394,-1,695,206,131.02000000000001,410,4350,103.69,84.98]
[6,13,395,-1,809,188,100.04,531,5509,54.21,62.33]
[6,14,384,-1,null,null,null,null,1,null,247]
[6,14,393,-1,null,null,null,null,1,null,287]
[6,14,394,-1,1,null,57,1,2,306,161.5]
[6,14,395,-1,1,null,17]
[5,0,"AK-1",499,293,112,146.43,null,null,null,null,17,143,111,19,3]
[5,11,"AK-1",499,279,104,145.09,null,null,null,null,16,137,106,18,2]
[5,12,"AK-1",499,4,2,263.25,null,null,null,null,1,3]
[5,13,"AK-1",499,10,6,137.1,null,null,null,null,null,3,5,1,1]
[5,0,"AK463",499,24,4,51.58,null,null,null,null,13,9,1,1]
[5,11,"AK463",499,24,4,51.58,null,null,null,null,13,9,1,1]
[5,0,"AK499",499,1680,620,153.59,null,null,null,null,11,1217,452]
[5,11,"AK499",499,1617,604,155.63,null,null,null,null,3,1168,446]
[5,12,"AK499",499,36,8,87.58,null,null,null,null,8,23,5]
[5,13,"AK499",499,27,8,119.81,null,null,null,null,null,26,1]
[5,0,"AL-1",499,1960,776,165.33,null,null,null,null,192,919,711,101,37]
[5,11,"AL-1",499,1896,763,167.72,null,null,null,null,186,899,689,92,30]
[5,12,"AL-1",499,41,7,88.12,null,null,null,null,5,18,2,9,7]
[5,13,"AL-1",499,23,6,106.35,null,null,null,null,1,2,20]
[5,0,"AL322",499,259,49,68.73,null,null,null,null,109,54,69,11,16]
[5,11,"AL322",499,247,48,70.290000000000006,null,null,null,null,103,52,66,10,16]
[5,12,"AL322",499,7,null,2.71,null,null,null,null,6,null,null,1]
[5,13,"AL322",499,5,1,84.2,null,null,null,null,null,2,3]
[5,0,"AL499",499,12325,3584,132,null,null,null,null,291,7110,4919,5]
[5,11,"AL499",499,11666,3471,134.41,null,null,null,null,104,6711,4850,1]
[5,12,"AL499",499,615,97,85,null,null,null,null,187,356,68,4]
[5,13,"AL499",499,44,16,151.09,null,null,null,null,null,43,1]
[5,0,"AR-1",499,903,435,226.94,null,null,null,null,65,482,289,55,12]
[5,11,"AR-1",499,872,429,232.1,null,null,null,null,54,473,284,49,12]
[5,12,"AR-1",499,27,5,62.78,null,null,null,null,11,8,2,6]
[5,13,"AR-1",499,4,1,210.5,null,null,null,null,null,1,3]
[5,0,"AR350",499,153,25,67.709999999999994,null,null,null,null,66,55,30,1,1]
[5,11,"AR350",499,149,25,69.44,null,null,null,null,62,55,30,1,1]
[5,12,"AR350",499,4,null,3,null,null,null,null,4]
[5,0,"AR499",499,5588,1834,143.52000000000001,null,null,null,null,138,3389,2056,5]
[5,11,"AR499",499,5296,1782,146.72999999999999,null,null,null,null,46,3223,2027]
[5,12,"AR499",499,261,42,77.14,null,null,null,null,92,137,28,4]
[5,13,"AR499",499,31,10,152.9,null,null,null,null,null,29,1,1]
[5,0,"AZ-1",499,1726,754,192.4,null,null,null,null,155,910,561,79,21]
[5,11,"AZ-1",499,1676,745,195.71,null,null,null,null,149,889,555,68,15]
[5,12,"AZ-1",499,39,9,90.26,null,null,null,null,6,13,3,11,6]
[5,13,"AZ-1",499,11,null,50.45,null,null,null,null,null,8,3]
[5,0,"AZ345",499,331,66,85.65,null,null,null,null,120,123,60,23,5]
[5,11,"AZ345",499,314,65,89.06,null,null,null,null,106,122,59,22,5]
[5,12,"AZ345",499,15,null,2.67,null,null,null,null,14,null,null,1]
[5,13,"AZ345",499,2,1,172,null,null,null,null,null,1,1]
[5,0,"AZ499",499,11296,3834,143.85,null,null,null,null,227,6855,4198,16]
[5,11,"AZ499",499,10698,3733,147.29,null,null,null,null,65,6485,4145,3]
[5,12,"AZ499",499,538,88,80.430000000000007,null,null,null,null,162,311,52,13]
[5,13,"AZ499",499,60,13,98.92,null,null,null,null,null,59,1]
[5,0,"CA-1",499,5879,2565,195.23,null,null,null,null,525,3030,1916,339,69]
[5,11,"CA-1",499,5688,2524,199.05,null,null,null,null,499,2957,1878,294,60]
[5,12,"CA-1",499,125,28,88.77,null,null,null,null,26,45,7,39,8]
[5,13,"CA-1",499,66,13,67.44,null,null,null,null,null,28,31,6,1]
[5,0,"CA343",499,319,70,89.62,null,null,null,null,102,134,70,9,4]
[5,11,"CA343",499,304,68,90.84,null,null,null,null,95,131,67,7,4]
[5,12,"CA343",499,9,null,2.67,null,null,null,null,7,1,null,1]
[5,13,"CA343",499,6,2,158.33000000000001,null,null,null,null,null,2,3,1]
[5,0,"CA344",499,539,122,94.55,null,null,null,null,152,204,169,5,9]
[5,11,"CA344",499,516,121,97.74,null,null,null,null,135,202,165,5,9]
[5,12,"CA344",499,18,null,3.61,null,null,null,null,17,1]
[5,13,"CA344",499,5,1,93,null,null,null,null,null,1,4]
[5,0,"CA377",499,614,138,117.96,null,null,null,null,96,261,235,17,5]
[5,11,"CA377",499,575,135,121.27,null,null,null,null,91,249,213,17,5]
[5,12,"CA377",499,6,null,3.83,null,null,null,null,5,1]
[5,13,"CA377",499,33,3,81.03,null,null,null,null,null,11,22]
[5,0,"CA499",499,41030,12887,137.22999999999999,null,null,null,null,728,24690,15586,26]
[5,11,"CA499",499,39108,12563,139.71,null,null,null,null,225,23464,15417,2]
[5,12,"CA499",499,1656,271,85.73,null,null,null,null,503,974,158,21]
[5,13,"CA499",499,265,53,92.29,null,null,null,null,null,252,10,3]
[5,14,"CA499",499,1,null,17,null,null,null,null,null,null,1]
[5,0,"CO-1",499,1399,554,172.82,null,null,null,null,123,673,513,69,21]
[5,11,"CO-1",499,1358,547,175.91,null,null,null,null,114,660,502,63,19]
[5,12,"CO-1",499,26,4,74.150000000000006,null,null,null,null,9,8,3,5,1]
[5,13,"CO-1",499,15,3,63.87,null,null,null,null,null,5,8,1,1]
[5,0,"CO339",499,274,49,76.930000000000007,null,null,null,null,100,98,66,8,2]
[5,11,"CO339",499,257,49,80.040000000000006,null,null,null,null,94,94,59,8,2]
[5,12,"CO339",499,6,null,3.33,null,null,null,null,6]
[5,13,"CO339",499,11,null,44.45,null,null,null,null,null,4,7]
[5,0,"CO499",499,9748,2880,131.22999999999999,null,null,null,null,142,5514,4088,4]
[5,11,"CO499",499,9336,2789,132.75,null,null,null,null,45,5234,4055,2]
[5,12,"CO499",499,334,64,82.59,null,null,null,null,97,207,29,1]
[5,13,"CO499",499,78,27,156.71,null,null,null,null,null,73,4,1]
[5,0,"CT-1",499,430,204,231.68,null,null,null,null,30,239,134,21,6]
[5,11,"CT-1",499,411,200,237.4,null,null,null,null,27,232,132,16,4]
[5,12,"CT-1",499,15,3,97.87,null,null,null,null,3,5,1,4,2]
[5,13,"CT-1",499,4,1,145.5,null,null,null,null,null,2,1,1]
[5,0,"CT308",499,54,10,71.91,null,null,null,null,18,26,4,4,2]
[5,11,"CT308",499,49,10,78.650000000000006,null,null,null,null,15,24,4,4,2]
[5,12,"CT308",499,4,null,3.25,null,null,null,null,3,1]
[5,13,"CT308",499,1,null,16,null,null,null,null,null,1]
[5,0,"CT499",499,2879,980,147.22999999999999,null,null,null,null,61,1907,906,5]
[5,11,"CT499",499,2699,953,150.88,null,null,null,null,19,1787,893]
[5,12,"CT499",499,161,24,88.53,null,null,null,null,42,102,12,5]
[5,13,"CT499",499,19,3,126.42,null,null,null,null,null,18,1]
[5,0,"DC-1",499,126,46,161.13999999999999,null,null,null,null,14,49,53,6,4]
[5,11,"DC-1",499,121,45,165.16,null,null,null,null,13,47,51,6,4]
[5,12,"DC-1",499,2,1,138,null,null,null,null,1,1]
[5,13,"DC-1",499,3,null,14.67,null,null,null,null,null,1,2]
[5,0,"DC499",499,629,196,133.94,null,null,null,null,16,349,263,1]
[5,11,"DC499",499,597,189,136.49,null,null,null,null,7,330,260]
[5,12,"DC499",499,24,5,90.38,null,null,null,null,9,12,3]
[5,13,"DC499",499,8,2,74.5,null,null,null,null,null,7,null,1]
[5,0,"DE-1",499,227,97,165.22,null,null,null,null,16,105,92,13,1]
[5,11,"DE-1",499,222,94,166.62,null,null,null,null,14,104,91,13]
[5,12,"DE-1",499,3,1,51,null,null,null,null,2,null,null,null,1]
[5,13,"DE-1",499,2,2,181,null,null,null,null,null,1,1]
[5,0,"DE460",499,26,2,60.23,null,null,null,null,14,9,2,1]
[5,11,"DE460",499,25,2,62.56,null,null,null,null,14,9,2]
[5,12,"DE460",499,1,null,2,null,null,null,null,null,null,null,1]
[5,0,"DE499",499,1496,448,130.51,null,null,null,null,26,883,586,1]
[5,11,"DE499",499,1416,437,134.25,null,null,null,null,7,834,575]
[5,12,"DE499",499,68,10,63.22,null,null,null,null,19,39,10]
[5,13,"DE499",499,12,1,70.5,null,null,null,null,null,10,1,1]
[5,0,"FL-1",499,6512,2627,176.17,null,null,null,null,599,3301,2155,326,130]
[5,11,"FL-1",499,6318,2588,178.8,null,null,null,null,567,3240,2109,280,121]
[5,12,"FL-1",499,134,27,92.42,null,null,null,null,32,44,8,42,8]
[5,13,"FL-1",499,60,12,86.38,null,null,null,null,null,17,38,4,1]
[5,0,"FL317",499,1531,584,148.85,null,null,null,null,415,541,491,56,28]
[5,11,"FL317",499,1480,583,153.11000000000001,null,null,null,null,387,531,483,51,28]
[5,12,"FL317",499,32,null,3.34,null,null,null,null,28,2,null,2]
[5,13,"FL317",499,19,1,62.42,null,null,null,null,null,8,8,3]
[5,0,"FL499",499,46658,15496,136.57,null,null,null,null,840,25769,20020,29]
[5,11,"FL499",499,44633,15127,138.72999999999999,null,null,null,null,293,24493,19835,12]
[5,12,"FL499",499,1770,298,85.11,null,null,null,null,547,1033,174,16]
[5,13,"FL499",499,255,71,116.71,null,null,null,null,null,243,11,1]
[5,0,"GA-1",499,3303,1164,156.11000000000001,null,null,null,null,270,1633,1167,169,64]
[5,11,"GA-1",499,3219,1148,157.87,null,null,null,null,249,1603,1152,153,62]
[5,12,"GA-1",499,65,8,68.22,null,null,null,null,21,24,3,15,2]
[5,13,"GA-1",499,19,8,158.26,null,null,null,null,null,6,12,1]
[5,0,"GA316",499,822,247,109.35,null,null,null,null,215,285,291,9,22]
[5,11,"GA316",499,797,244,111.67,null,null,null,null,204,282,281,9,21]
[5,12,"GA316",499,13,null,2.08,null,null,null,null,11,2]
[5,13,"GA316",499,12,3,71.42,null,null,null,null,null,1,10,null,1]
[5,0,"GA499",499,24378,6705,124.62,null,null,null,null,475,14132,9759,12]
[5,11,"GA499",499,23301,6519,126.21,null,null,null,null,152,13507,9638,4]
[5,12,"GA499",499,963,168,89.56,null,null,null,null,323,521,113,6]
[5,13,"GA499",499,114,18,95.58,null,null,null,null,null,104,8,2]
[5,0,"HI-1",499,456,201,193.27,null,null,null,null,32,249,151,16,8]
[5,11,"HI-1",499,447,197,194.97,null,null,null,null,32,243,148,16,8]
[5,12,"HI-1",499,3,1,114,null,null,null,null,null,3]
[5,13,"HI-1",499,6,3,106.17,null,null,null,null,null,3,3]
[5,0,"HI459",499,47,7,64.98,null,null,null,null,24,10,13]
[5,11,"HI459",499,39,7,72.260000000000005,null,null,null,null,19,8,12]
[5,12,"HI459",499,5,null,2.6,null,null,null,null,5]
[5,13,"HI459",499,3,null,74.33,null,null,null,null,null,2,1]
[5,0,"HI499",499,3048,1011,142.44999999999999,null,null,null,null,25,2009,1013,1]
[5,11,"HI499",499,2936,984,143.27000000000001,null,null,null,null,10,1924,1002]
[5,12,"HI499",499,72,14,121.18,null,null,null,null,15,47,9,1]
[5,13,"HI499",499,40,13,120.15,null,null,null,null,null,38,2]
[5,0,"IA-1",499,591,273,209.04,null,null,null,null,46,340,162,32,11]
[5,11,"IA-1",499,567,267,214.15,null,null,null,null,41,330,159,27,10]
[5,12,"IA-1",499,19,4,71.260000000000005,null,null,null,null,5,7,1,5,1]
[5,13,"IA-1",499,5,2,152.6,null,null,null,null,null,3,2]
[5,0,"IA333",499,108,24,109.37,null,null,null,null,43,32,24,8,1]
[5,11,"IA333",499,102,24,115.4,null,null,null,null,38,32,23,8,1]
[5,12,"IA333",499,5,null,2.6,null,null,null,null,5]
[5,13,"IA333",499,1,null,28,null,null,null,null,null,null,1]
[5,0,"IA499",499,4344,1569,149.01,null,null,null,null,80,2687,1575,2]
[5,11,"IA499",499,4087,1519,152.82,null,null,null,null,22,2513,1552]
[5,12,"IA499",499,241,43,84.95,null,null,null,null,58,160,22,1]
[5,13,"IA499",499,16,7,138.88,null,null,null,null,null,14,1,1]
[5,0,"ID-1",499,511,230,202.85,null,null,null,null,41,260,173,30,7]
[5,11,"ID-1",499,498,227,206.48,null,null,null,null,38,258,171,24,7]
[5,12,"ID-1",499,9,3,66.89,null,null,null,null,3,1,null,5]
[5,13,"ID-1",499,4,null,57.25,null,null,null,null,null,1,2,1]
[5,0,"ID347",499,45,4,42.04,null,null,null,null,31,5,5,4]
[5,11,"ID347",499,41,4,45.9,null,null,null,null,28,5,5,3]
[5,12,"ID347",499,4,null,2.5,null,null,null,null,3,null,null,1]
[5,0,"ID499",499,2958,1097,152.62,null,null,null,null,38,1773,1147]
[5,11,"ID499",499,2828,1078,155.49,null,null,null,null,12,1686,1130]
[5,12,"ID499",499,103,13,78.459999999999994,null,null,null,null,26,61,16]
[5,13,"ID499",499,27,6,134.66999999999999,null,null,null,null,null,26,1]
[5,0,"IL-1",499,1768,815,191.01,null,null,null,null,155,853,637,96,27]
[5,11,"IL-1",499,1720,799,193.83,null,null,null,null,149,838,630,81,22]
[5,12,"IL-1",499,38,12,84.74,null,null,null,null,6,11,2,14,5]
[5,13,"IL-1",499,10,4,110.2,null,null,null,null,null,4,5,1]
[5,0,"IL328",499,318,48,71.31,null,null,null,null,120,80,100,12,6]
[5,11,"IL328",499,307,48,73.599999999999994,null,null,null,null,111,79,99,12,6]
[5,12,"IL328",499,10,null,2.2999999999999998,null,null,null,null,9,1]
[5,13,"IL328",499,1,null,57,null,null,null,null,null,null,1]
[5,0,"IL499",499,11452,4162,150.69999999999999,null,null,null,null,231,6788,4426,7]
[5,11,"IL499",499,10856,4031,153.46,null,null,null,null,68,6424,4363,1]
[5,12,"IL499",499,556,120,98.04,null,null,null,null,163,326,61,6]
[5,13,"IL499",499,40,11,133.13,null,null,null,null,null,38,2]
[5,0,"IN-1",499,1393,604,186.47,null,null,null,null,110,713,470,69,31]
[5,11,"IN-1",499,1355,594,188.58,null,null,null,null,107,697,464,59,28]
[5,12,"IN-1",499,33,9,117.73,null,null,null,null,3,16,1,10,3]
[5,13,"IN-1",499,5,1,68.400000000000006,null,null,null,null,null,null,5]
[5,0,"IN326",499,241,41,60.85,null,null,null,null,95,81,56,2,7]
[5,11,"IN326",499,231,41,62.9,null,null,null,null,87,81,54,2,7]
[5,12,"IN326",499,8,null,2.25,null,null,null,null,8]
[5,13,"IN326",499,2,null,58.5,null,null,null,null,null,null,2]
[5,0,"IN499",499,8742,3073,146.94,null,null,null,null,156,5350,3227,9]
[5,11,"IN499",499,8355,3002,149.55000000000001,null,null,null,null,60,5114,3181]
[5,12,"IN499",499,361,63,88.62,null,null,null,null,96,212,44,9]
[5,13,"IN499",499,26,8,119.23,null,null,null,null,null,24,2]
[5,0,"KS-1",499,626,289,207.41,null,null,null,null,36,328,206,42,14]
[5,11,"KS-1",499,610,285,210.45,null,null,null,null,36,319,202,41,12]
[5,12,"KS-1",499,11,4,119.91,null,null,null,null,null,7,1,1,2]
[5,13,"KS-1",499,5,null,29.2,null,null,null,null,null,2,3]
[5,0,"KS452",499,69,15,85.59,null,null,null,null,28,25,8,8]
[5,11,"KS452",499,68,15,86.82,null,null,null,null,27,25,8,8]
[5,12,"KS452",499,1,null,2,null,null,null,null,1]
[5,0,"KS499",499,3859,1357,146.15,null,null,null,null,75,2321,1460,3]
[5,11,"KS499",499,3634,1326,150.11000000000001,null,null,null,null,20,2172,1441,1]
[5,12,"KS499",499,203,29,83.6,null,null,null,null,55,129,17,2]
[5,13,"KS499",499,22,2,70.27,null,null,null,null,null,20,2]
[5,0,"KY-1",499,1075,482,185.74,null,null,null,null,93,521,379,60,22]
[5,11,"KY-1",499,1049,477,188.52,null,null,null,null,91,514,374,51,19]
[5,12,"KY-1",499,20,5,86.5,null,null,null,null,2,6,2,8,2]
[5,13,"KY-1",499,6,null,30.5,null,null,null,null,null,1,3,1,1]
[5,0,"KY327",499,122,18,67.94,null,null,null,null,44,47,25,4,2]
[5,11,"KY327",499,116,17,67.11,null,null,null,null,39,46,25,4,2]
[5,12,"KY327",499,5,1,77.400000000000006,null,null,null,null,5]
[5,13,"KY327",499,1,null,117,null,null,null,null,null,1]
[5,0,"KY499",499,7034,2376,144.80000000000001,null,null,null,null,138,4267,2625,4]
[5,11,"KY499",499,6687,2314,148.19,null,null,null,null,43,4066,2578]
[5,12,"KY499",499,317,49,72.97,null,null,null,null,95,172,46,4]
[5,13,"KY499",499,30,13,146.30000000000001,null,null,null,null,null,29,1]
[5,0,"LA-1",499,1369,571,182.67,null,null,null,null,139,675,472,72,11]
[5,11,"LA-1",499,1332,563,185.18,null,null,null,null,133,657,466,65,11]
[5,12,"LA-1",499,27,7,103.59,null,null,null,null,6,14,1,6]
[5,13,"LA-1",499,10,1,61.7,null,null,null,null,null,4,5,1]
[5,0,"LA321",499,196,34,75.930000000000007,null,null,null,null,70,62,54,6,4]
[5,11,"LA321",499,193,34,76.930000000000007,null,null,null,null,68,62,53,6,4]
[5,12,"LA321",499,2,null,3,null,null,null,null,2]
[5,13,"LA321",499,1,null,28,null,null,null,null,null,null,1]
[5,0,"LA499",499,8813,2558,131.19,null,null,null,null,194,5253,3361,5]
[5,11,"LA499",499,8368,2483,134.03,null,null,null,null,58,4977,3331,2]
[5,12,"LA499",499,396,66,77.08,null,null,null,null,136,227,30,3]
[5,13,"LA499",499,49,9,84.39,null,null,null,null,null,49]
[5,0,"MA-1",499,814,355,189.45,null,null,null,null,72,453,223,53,13]
[5,11,"MA-1",499,797,349,190.87,null,null,null,null,69,447,220,48,13]
[5,12,"MA-1",499,12,4,108,null,null,null,null,3,4,null,5]
[5,13,"MA-1",499,5,2,157.6,null,null,null,null,null,2,3]
[5,0,"MA301",499,120,30,96.73,null,null,null,null,41,26,52,null,1]
[5,11,"MA301",499,112,28,97.46,null,null,null,null,35,25,51,null,1]
[5,12,"MA301",499,6,null,2.5,null,null,null,null,6]
[5,13,"MA301",499,2,2,339,null,null,null,null,null,1,1]
[5,0,"MA499",499,5135,1786,150.05000000000001,null,null,null,null,92,3363,1675,5]
[5,11,"MA499",499,4871,1736,153.03,null,null,null,null,24,3196,1650,1]
[5,12,"MA499",499,242,44,90.95,null,null,null,null,68,146,24,4]
[5,13,"MA499",499,22,6,141.5,null,null,null,null,null,21,1]
[5,0,"MD-1",499,1569,600,159.24,null,null,null,null,133,741,577,78,40]
[5,11,"MD-1",499,1515,590,161.69999999999999,null,null,null,null,127,718,560,71,39]
[5,12,"MD-1",499,24,8,122.67,null,null,null,null,6,13,1,4]
[5,13,"MD-1",499,30,2,64.47,null,null,null,null,null,10,16,3,1]
[5,0,"MD313",499,227,33,65.61,null,null,null,null,91,80,42,7,7]
[5,11,"MD313",499,219,32,65.400000000000006,null,null,null,null,89,78,38,7,7]
[5,12,"MD313",499,2,null,2.5,null,null,null,null,2]
[5,13,"MD313",499,6,1,94.33,null,null,null,null,null,2,4]
[5,0,"MD499",499,9542,2601,121.93,null,null,null,null,147,5369,4016,10]
[5,11,"MD499",499,9117,2514,123.1,null,null,null,null,53,5081,3979,4]
[5,12,"MD499",499,330,59,88.09,null,null,null,null,94,196,35,5]
[5,13,"MD499",499,95,28,126.61,null,null,null,null,null,92,2,1]
[5,0,"ME-1",499,345,171,219.87,null,null,null,null,22,204,98,13,8]
[5,11,"ME-1",499,339,171,222.65,null,null,null,null,19,202,98,12,8]
[5,12,"ME-1",499,5,null,69.599999999999994,null,null,null,null,3,2]
[5,13,"ME-1",499,1,null,28,null,null,null,null,null,null,null,1]
[5,0,"ME402",499,53,13,74.42,null,null,null,null,24,22,6,1]
[5,11,"ME402",499,47,13,81.17,null,null,null,null,19,21,6,1]
[5,12,"ME402",499,5,null,2.4,null,null,null,null,5]
[5,13,"ME402",499,1,null,117,null,null,null,null,null,1]
[5,0,"ME499",499,2065,788,162.56,null,null,null,null,33,1303,729]
[5,11,"ME499",499,1983,769,164.38,null,null,null,null,8,1256,719]
[5,12,"ME499",499,73,14,93.4,null,null,null,null,25,38,10]
[5,13,"ME499",499,9,5,322.67,null,null,null,null,null,9]
[5,0,"MI-1",499,1673,701,189.01,null,null,null,null,154,879,512,97,31]
[5,11,"MI-1",499,1607,688,193,null,null,null,null,141,856,504,82,24]
[5,12,"MI-1",499,54,10,94.94,null,null,null,null,13,18,4,14,5]
[5,13,"MI-1",499,12,3,78.08,null,null,null,null,null,5,4,1,2]
[5,0,"MI329",499,237,39,71.7,null,null,null,null,110,72,50,5]
[5,11,"MI329",499,226,39,75.08,null,null,null,null,99,72,50,5]
[5,12,"MI329",499,11,null,2.4500000000000002,null,null,null,null,11]
[5,0,"MI499",499,10787,3780,148.05000000000001,null,null,null,null,222,6671,3892,2]
[5,11,"MI499",499,10132,3655,151.59,null,null,null,null,51,6246,3835]
[5,12,"MI499",499,616,110,90.2,null,null,null,null,171,389,54,2]
[5,13,"MI499",499,39,15,143.22999999999999,null,null,null,null,null,36,3]
[5,0,"MN-1",499,999,453,224.68,null,null,null,null,103,537,301,51,7]
[5,11,"MN-1",499,980,448,227.55,null,null,null,null,98,529,297,49,7]
[5,12,"MN-1",499,14,3,64,null,null,null,null,5,6,1,2]
[5,13,"MN-1",499,5,2,113,null,null,null,null,null,2,3]
[5,0,"MN335",499,154,32,76.73,null,null,null,null,48,63,26,14,3]
[5,11,"MN335",499,139,28,77.48,null,null,null,null,41,59,25,11,3]
[5,12,"MN335",499,13,2,55.31,null,null,null,null,7,2,1,3]
[5,13,"MN335",499,2,2,163.5,null,null,null,null,null,2]
[5,0,"MN499",499,6366,2110,142.93,null,null,null,null,101,3908,2354,3]
[5,11,"MN499",499,6084,2056,145.19999999999999,null,null,null,null,28,3732,2323,1]
[5,12,"MN499",499,269,50,89.8,null,null,null,null,73,163,31,2]
[5,13,"MN499",499,13,4,183.77,null,null,null,null,null,13]
[5,0,"MO-1",499,1459,639,204.69,null,null,null,null,120,757,496,65,21]
[5,11,"MO-1",499,1411,628,208.48,null,null,null,null,114,736,482,60,19]
[5,12,"MO-1",499,34,7,86.29,null,null,null,null,6,18,4,5,1]
[5,13,"MO-1",499,14,4,110.36,null,null,null,null,null,3,10,null,1]
[5,0,"MO331",499,234,61,96.58,null,null,null,null,82,96,51,1,4]
[5,11,"MO331",499,221,61,101.28,null,null,null,null,72,95,49,1,4]
[5,12,"MO331",499,10,null,2.4,null,null,null,null,10]
[5,13,"MO331",499,3,null,64.33,null,null,null,null,null,1,2]
[5,0,"MO499",499,9829,3483,146.27000000000001,null,null,null,null,205,5854,3755,15]
[5,11,"MO499",499,9303,3378,149.04,null,null,null,null,56,5541,3704,2]
[5,12,"MO499",499,492,95,95.11,null,null,null,null,149,280,50,13]
[5,13,"MO499",499,34,10,128.59,null,null,null,null,null,33,1]
[5,0,"MS-1",499,1015,429,189.59,null,null,null,null,94,495,344,65,17]
[5,11,"MS-1",499,985,425,192.92,null,null,null,null,89,487,337,57,15]
[5,12,"MS-1",499,25,3,76.72,null,null,null,null,5,7,3,8,2]
[5,13,"MS-1",499,5,1,97.4,null,null,null,null,null,1,4]
[5,0,"MS323",499,184,30,65.400000000000006,null,null,null,null,78,66,35,3,2]
[5,11,"MS323",499,177,30,66.44,null,null,null,null,75,65,32,3,2]
[5,12,"MS323",499,3,null,3.67,null,null,null,null,3]
[5,13,"MS323",499,4,null,66,null,null,null,null,null,1,3]
[5,0,"MS499",499,6288,1890,131.79,null,null,null,null,152,3805,2327,4]
[5,11,"MS499",499,5970,1835,134.19,null,null,null,null,49,3619,2302]
[5,12,"MS499",499,299,48,85.4,null,null,null,null,103,168,24,4]
[5,13,"MS499",499,19,7,108.05,null,null,null,null,null,18,1]
[5,0,"MT-1",499,303,140,217.2,null,null,null,null,23,170,97,9,4]
[5,11,"MT-1",499,297,139,218.75,null,null,null,null,22,165,97,9,4]
[5,12,"MT-1",499,4,null,101.25,null,null,null,null,1,3]
[5,13,"MT-1",499,2,1,219,null,null,null,null,null,2]
[5,0,"MT436",499,38,8,74.84,null,null,null,null,20,10,7,1]
[5,11,"MT436",499,37,8,73.7,null,null,null,null,20,10,6,1]
[5,13,"MT436",499,1,null,117,null,null,null,null,null,null,1]
[5,0,"MT499",499,2300,827,148.88,null,null,null,null,28,1415,856,1]
[5,11,"MT499",499,2207,811,151.09,null,null,null,null,7,1355,845]
[5,12,"MT499",499,83,10,84.13,null,null,null,null,21,52,9,1]
[5,13,"MT499",499,10,6,200,null,null,null,null,null,8,2]
[5,0,"NC-1",499,3273,1278,167.02,null,null,null,null,287,1586,1148,188,64]
[5,11,"NC-1",499,3170,1258,169.4,null,null,null,null,271,1554,1120,167,58]
[5,12,"NC-1",499,68,15,98.4,null,null,null,null,16,21,7,19,5]
[5,13,"NC-1",499,35,5,85.26,null,null,null,null,null,11,21,2,1]
[5,0,"NC318",499,708,116,71.680000000000007,null,null,null,null,245,225,187,35,16]
[5,11,"NC318",499,684,116,73.66,null,null,null,null,230,221,184,34,15]
[5,12,"NC318",499,15,null,2.5299999999999998,null,null,null,null,15]
[5,13,"NC318",499,9,null,36.33,null,null,null,null,null,4,3,1,1]
[5,0,"NC499",499,22329,6388,126.61,null,null,null,null,382,13063,8870,13,1]
[5,11,"NC499",499,21351,6198,128.12,null,null,null,null,158,12457,8732,4]
[5,12,"NC499",499,844,163,91.5,null,null,null,null,224,484,128,7,1]
[5,13,"NC499",499,134,27,106.14,null,null,null,null,null,122,10,2]
[5,0,"ND-1",499,177,65,179.85,null,null,null,null,14,93,53,12,5]
[5,11,"ND-1",499,173,64,182.1,null,null,null,null,14,92,52,10,5]
[5,12,"ND-1",499,1,null,94,null,null,null,null,null,null,null,1]
[5,13,"ND-1",499,3,1,78.67,null,null,null,null,null,1,1,1]
[5,0,"ND437",499,16,2,35.880000000000003,null,null,null,null,9,4,3]
[5,11,"ND437",499,16,2,35.880000000000003,null,null,null,null,9,4,3]
[5,0,"ND499",499,1178,429,147.30000000000001,null,null,null,null,11,758,409]
[5,11,"ND499",499,1123,419,149.93,null,null,null,null,2,719,402]
[5,12,"ND499",499,48,10,99.54,null,null,null,null,9,32,7]
[5,13,"ND499",499,7,null,52.14,null,null,null,null,null,7]
[5,0,"NE-1",499,441,168,176.02,null,null,null,null,42,214,151,25,9]
[5,11,"NE-1",499,434,167,177.78,null,null,null,null,39,212,149,25,9]
[5,12,"NE-1",499,5,1,69.2,null,null,null,null,3,2]
[5,13,"NE-1",499,2,null,62,null,null,null,null,null,null,2]
[5,0,"NE334",499,104,13,69.239999999999995,null,null,null,null,31,47,21,3,2]
[5,11,"NE334",499,102,13,70.55,null,null,null,null,29,47,21,3,2]
[5,12,"NE334",499,2,null,2.5,null,null,null,null,2]
[5,0,"NE499",499,3223,991,136.59,null,null,null,null,45,1982,1196]
[5,11,"NE499",499,3102,963,138.11000000000001,null,null,null,null,18,1907,1177]
[5,12,"NE499",499,109,25,98.04,null,null,null,null,27,64,18]
[5,13,"NE499",499,12,3,95.42,null,null,null,null,null,11,1]
[5,0,"NH-1",499,250,122,207.86,null,null,null,null,17,139,75,16,3]
[5,11,"NH-1",499,241,118,211.71,null,null,null,null,15,135,75,14,2]
[5,12,"NH-1",499,8,4,110.88,null,null,null,null,2,3,null,2,1]
[5,13,"NH-1",499,1,null,58,null,null,null,null,null,1]
[5,0,"NH373",499,25,5,119.72,null,null,null,null,11,6,8]
[5,11,"NH373",499,25,5,119.72,null,null,null,null,11,6,8]
[5,0,"NH499",499,1661,586,152.9,null,null,null,null,27,1093,539,2]
[5,11,"NH499",499,1577,569,155.25,null,null,null,null,6,1039,531,1]
[5,12,"NH499",499,78,13,87.12,null,null,null,null,21,48,8,1]
[5,13,"NH499",499,6,4,388.33,null,null,null,null,null,6]
[5,0,"NJ-1",499,1052,457,180.22,null,null,null,null,91,560,337,59,5]
[5,11,"NJ-1",499,1013,447,183.55,null,null,null,null,84,543,325,56,5]
[5,12,"NJ-1",499,25,8,80.56,null,null,null,null,7,10,5,3]
[5,13,"NJ-1",499,14,2,117.21,null,null,null,null,null,7,7]
[5,0,"NJ309",499,65,4,35.369999999999997,null,null,null,null,40,16,9]
[5,11,"NJ309",499,60,4,38.119999999999997,null,null,null,null,36,15,9]
[5,12,"NJ309",499,5,null,2.4,null,null,null,null,4,1]
[5,0,"NJ499",499,6456,2153,146.66999999999999,null,null,null,null,150,4164,2134,8]
[5,11,"NJ499",499,6072,2081,149.86000000000001,null,null,null,null,50,3912,2109,1]
[5,12,"NJ499",499,357,60,88.62,null,null,null,null,100,225,25,7]
[5,13,"NJ499",499,27,12,196.67,null,null,null,null,null,27]
[5,0,"NM-1",499,580,245,192.34,null,null,null,null,55,294,189,31,11]
[5,11,"NM-1",499,563,241,193.13,null,null,null,null,52,288,184,29,10]
[5,12,"NM-1",499,9,1,83.33,null,null,null,null,3,2,1,2,1]
[5,13,"NM-1",499,8,3,259,null,null,null,null,null,4,4]
[5,0,"NM340",499,71,14,75.8,null,null,null,null,32,13,20,5,1]
[5,11,"NM340",499,66,14,79.14,null,null,null,null,31,13,17,4,1]
[5,12,"NM340",499,2,null,3,null,null,null,null,1,null,null,1]
[5,13,"NM340",499,3,null,51,null,null,null,null,null,null,3]
[5,0,"NM499",499,3544,1256,145.52000000000001,null,null,null,null,60,2342,1141,1]
[5,11,"NM499",499,3367,1215,147.4,null,null,null,null,19,2219,1129]
[5,12,"NM499",499,156,33,104.03,null,null,null,null,41,102,12,1]
[5,13,"NM499",499,21,8,151.43,null,null,null,null,null,21]
[5,0,"NV-1",499,1129,511,190.11,null,null,null,null,80,575,388,68,18]
[5,11,"NV-1",499,1087,502,194.15,null,null,null,null,74,566,377,54,16]
[5,12,"NV-1",499,31,7,82.1,null,null,null,null,6,8,2,13,2]
[5,13,"NV-1",499,11,2,95.82,null,null,null,null,null,1,9,1]
[5,0,"NV354",499,200,20,51.92,null,null,null,null,128,37,31,2,2]
[5,11,"NV354",499,191,20,53.67,null,null,null,null,120,37,31,1,2]
[5,12,"NV354",499,8,null,13.13,null,null,null,null,8]
[5,13,"NV354",499,1,null,28,null,null,null,null,null,null,null,1]
[5,0,"NV499",499,6844,2184,136.30000000000001,null,null,null,null,96,4031,2712,5]
[5,11,"NV499",499,6541,2114,137.88999999999999,null,null,null,null,29,3837,2674,1]
[5,12,"NV499",499,281,65,101.98,null,null,null,null,67,173,37,4]
[5,13,"NV499",499,22,5,103.82,null,null,null,null,null,21,1]
[5,0,"NY-1",499,1951,863,188.73,null,null,null,null,143,987,665,114,42]
[5,11,"NY-1",499,1876,848,192.15,null,null,null,null,124,960,654,99,39]
[5,12,"NY-1",499,59,9,87.17,null,null,null,null,19,20,4,14,2]
[5,13,"NY-1",499,16,6,162.44,null,null,null,null,null,7,7,1,1]
[5,0,"NY306",499,151,23,61.07,null,null,null,null,82,42,19,6,2]
[5,11,"NY306",499,142,23,64.7,null,null,null,null,73,42,19,6,2]
[5,12,"NY306",499,9,null,3.89,null,null,null,null,9]
[5,0,"NY307",499,92,21,118.2,null,null,null,null,26,30,36]
[5,11,"NY307",499,89,21,122.1,null,null,null,null,23,30,36]
[5,12,"NY307",499,3,null,2.33,null,null,null,null,3]
[5,0,"NY499",499,12201,4447,154.6,null,null,null,null,254,7628,4309,10]
[5,11,"NY499",499,11518,4345,158.72999999999999,null,null,null,null,65,7208,4243,2]
[5,12,"NY499",499,617,85,82.85,null,null,null,null,189,356,64,8]
[5,13,"NY499",499,66,17,104.73,null,null,null,null,null,64,2]
[5,0,"OH-1",499,2275,941,181.45,null,null,null,null,209,1182,710,140,34]
[5,11,"OH-1",499,2195,926,185.04,null,null,null,null,194,1158,697,112,34]
[5,12,"OH-1",499,68,12,80.72,null,null,null,null,15,23,3,27]
[5,13,"OH-1",499,12,3,95.83,null,null,null,null,null,1,10,1]
[5,0,"OH325",499,306,85,107.76,null,null,null,null,125,75,98,6,2]
[5,11,"OH325",499,291,84,112.31,null,null,null,null,113,73,97,6,2]
[5,12,"OH325",499,12,null,2.5,null,null,null,null,12]
[5,13,"OH325",499,3,1,87.67,null,null,null,null,null,2,1]
[5,0,"OH499",499,14910,5142,145.66999999999999,null,null,null,null,316,9092,5478,24]
[5,11,"OH499",499,14030,4989,149.61000000000001,null,null,null,null,74,8539,5416,1]
[5,12,"OH499",499,831,136,80.09,null,null,null,null,242,506,60,23]
[5,13,"OH499",499,49,17,128.04,null,null,null,null,null,47,2]
[5,0,"OK-1",499,1427,601,186.65,null,null,null,null,127,726,479,77,18]
[5,11,"OK-1",499,1399,597,189.01,null,null,null,null,122,716,474,70,17]
[5,12,"OK-1",499,24,4,78.58,null,null,null,null,5,9,2,7,1]
[5,13,"OK-1",499,4,null,11,null,null,null,null,null,1,3]
[5,0,"OK351",499,218,47,80.62,null,null,null,null,61,66,81,5,5]
[5,11,"OK351",499,205,46,84.18,null,null,null,null,52,64,79,5,5]
[5,12,"OK351",499,9,null,2.67,null,null,null,null,9]
[5,13,"OK351",499,4,1,73.75,null,null,null,null,null,2,2]
[5,0,"OK499",499,9316,2697,128.69,null,null,null,null,177,5232,3898,9]
[5,11,"OK499",499,8879,2615,130.72,null,null,null,null,67,4961,3848,3]
[5,12,"OK499",499,398,70,83.58,null,null,null,null,110,235,49,4]
[5,13,"OK499",499,39,12,126.38,null,null,null,null,null,36,1,2]
[5,0,"OR-1",499,998,498,232.54,null,null,null,null,64,560,311,48,15]
[5,11,"OR-1",499,970,492,235.91,null,null,null,null,58,550,307,41,14]
[5,12,"OR-1",499,26,6,116.65,null,null,null,null,6,9,3,7,1]
[5,13,"OR-1",499,2,null,101.5,null,null,null,null,null,1,1]
[5,0,"OR348",499,140,26,87.38,null,null,null,null,54,47,32,1,6]
[5,11,"OR348",499,135,26,90.52,null,null,null,null,49,47,32,1,6]
[5,12,"OR348",499,5,null,2.6,null,null,null,null,5]
[5,0,"OR499",499,6149,2387,163.35,null,null,null,null,106,3698,2339,5,1]
[5,11,"OR499",499,5793,2309,167.49,null,null,null,null,27,3471,2293,2]
[5,12,"OR499",499,328,67,89.45,null,null,null,null,79,199,46,3,1]
[5,13,"OR499",499,28,11,172.36,null,null,null,null,null,28]
[5,0,"OT-1",499,1132,701,245.52,null,null,null,null,92,682,299,43,16]
[5,11,"OT-1",499,1099,688,249.15,null,null,null,null,89,664,289,42,15]
[5,12,"OT-1",499,8,3,124,null,null,null,null,3,3,1,1]
[5,13,"OT-1",499,25,10,124.64,null,null,null,null,null,15,9,null,1]
[5,0,"OT499",499,6582,3549,200.64,null,null,null,null,71,4478,2032,1]
[5,11,"OT499",499,6261,3432,203.44,null,null,null,null,36,4223,2001,1]
[5,12,"OT499",499,200,68,137.22,null,null,null,null,35,137,28]
[5,13,"OT499",499,121,49,160.21,null,null,null,null,null,118,3]
[5,0,"PA-1",499,2021,1014,220.13,null,null,null,null,165,1050,664,110,32]
[5,11,"PA-1",499,1928,991,226.2,null,null,null,null,140,1017,652,90,29]
[5,12,"PA-1",499,84,20,90.61,null,null,null,null,25,30,8,18,3]
[5,13,"PA-1",499,9,3,128.11000000000001,null,null,null,null,null,3,4,2]
[5,0,"PA310",499,331,103,121.82,null,null,null,null,78,152,86,11,4]
[5,11,"PA310",499,325,102,121.52,null,null,null,null,74,150,86,11,4]
[5,12,"PA310",499,4,null,3,null,null,null,null,4]
[5,13,"PA310",499,2,1,407,null,null,null,null,null,2]
[5,0,"PA311",499,137,10,38.44,null,null,null,null,67,49,20,1]
[5,11,"PA311",499,129,10,39.99,null,null,null,null,61,48,19,1]
[5,12,"PA311",499,7,null,2.57,null,null,null,null,6,1]
[5,13,"PA311",499,1,null,89,null,null,null,null,null,null,1]
[5,0,"PA499",499,13550,4835,153.55000000000001,null,null,null,null,343,8336,4855,16]
[5,11,"PA499",499,12625,4686,158.26,null,null,null,null,68,7782,4774,1]
[5,12,"PA499",499,888,139,87.25,null,null,null,null,275,518,80,15]
[5,13,"PA499",499,37,10,136.51,null,null,null,null,null,36,1]
[5,0,"PR-1",499,191,95,197.27,null,null,null,null,31,49,71,22,18]
[5,11,"PR-1",499,162,87,214.38,null,null,null,null,27,44,70,11,10]
[5,12,"PR-1",499,29,8,101.72,null,null,null,null,4,5,1,11,8]
[5,0,"PR355",499,546,147,122.76,null,null,null,null,90,236,177,38,5]
[5,11,"PR355",499,533,147,125.33,null,null,null,null,82,234,174,38,5]
[5,12,"PR355",499,8,null,5.88,null,null,null,null,8]
[5,13,"PR355",499,5,null,35.799999999999997,null,null,null,null,null,2,3]
[5,0,"PR499",499,3533,1150,141.65,null,null,null,null,149,2962,419,3]
[5,11,"PR499",499,3224,1107,147.61000000000001,null,null,null,null,30,2795,398,1]
[5,12,"PR499",499,298,41,79.86,null,null,null,null,119,156,21,2]
[5,13,"PR499",499,11,2,68.73,null,null,null,null,null,11]
[5,0,"RI-1",499,206,94,183.88,null,null,null,null,11,128,51,11,5]
[5,11,"RI-1",499,205,93,182.51,null,null,null,null,11,128,51,11,4]
[5,12,"RI-1",499,1,1,465,null,null,null,null,null,null,null,null,1]
[5,0,"RI304",499,30,8,142.57,null,null,null,null,9,12,6,3]
[5,11,"RI304",499,29,8,147.44999999999999,null,null,null,null,8,12,6,3]
[5,12,"RI304",499,1,null,1,null,null,null,null,1]
[5,0,"RI499",499,1393,452,141.51,null,null,null,null,28,866,498,1]
[5,11,"RI499",499,1336,439,143.51,null,null,null,null,13,832,491]
[5,12,"RI499",499,50,10,87.44,null,null,null,null,15,28,6,1]
[5,13,"RI499",499,7,3,145.57,null,null,null,null,null,6,1]
[5,0,"SC-1",499,1949,841,185.76,null,null,null,null,159,963,681,117,29]
[5,11,"SC-1",499,1895,827,187.85,null,null,null,null,144,953,665,104,29]
[5,12,"SC-1",499,44,12,111.8,null,null,null,null,15,10,6,13]
[5,13,"SC-1",499,10,2,114.7,null,null,null,null,null,null,10]
[5,0,"SC319",499,320,59,71.06,null,null,null,null,109,114,80,13,4]
[5,11,"SC319",499,308,59,72.72,null,null,null,null,102,112,77,13,4]
[5,12,"SC319",499,7,null,2.14,null,null,null,null,7]
[5,13,"SC319",499,5,null,65.2,null,null,null,null,null,2,3]
[5,0,"SC499",499,12954,3947,134.08000000000001,null,null,null,null,266,7425,5257,6]
[5,11,"SC499",499,12327,3827,136.08000000000001,null,null,null,null,94,7040,5192,1]
[5,12,"SC499",499,578,112,95.75,null,null,null,null,172,337,64,5]
[5,13,"SC499",499,49,8,81.98,null,null,null,null,null,48,1]
[5,0,"SD-1",499,269,110,180.76,null,null,null,null,25,149,77,15,3]
[5,11,"SD-1",499,265,109,182.34,null,null,null,null,24,147,77,14,3]
[5,12,"SD-1",499,3,null,55,null,null,null,null,1,1,null,1]
[5,13,"SD-1",499,1,1,138,null,null,null,null,null,1]
[5,0,"SD438",499,21,5,116.1,null,null,null,null,9,7,5]
[5,11,"SD438",499,21,5,116.1,null,null,null,null,9,7,5]
[5,0,"SD499",499,1882,678,146.09,null,null,null,null,21,1146,714,1]
[5,11,"SD499",499,1826,670,148.43,null,null,null,null,6,1109,710,1]
[5,12,"SD499",499,46,6,65.52,null,null,null,null,15,28,3]
[5,13,"SD499",499,10,2,88.7,null,null,null,null,null,9,1]
[5,0,"TN-1",499,2110,889,189.38,null,null,null,null,194,1042,728,122,24]
[5,11,"TN-1",499,2062,879,191.65,null,null,null,null,187,1022,720,113,20]
[5,12,"TN-1",499,35,8,100.46,null,null,null,null,7,12,4,9,3]
[5,13,"TN-1",499,13,2,67.459999999999994,null,null,null,null,null,8,4,null,1]
[5,0,"TN320",499,220,49,83.58,null,null,null,null,98,62,54,3,3]
[5,11,"TN320",499,204,49,89.2,null,null,null,null,90,61,49,1,3]
[5,12,"TN320",499,10,null,2.6,null,null,null,null,8,1,null,1]
[5,13,"TN320",499,6,null,27.5,null,null,null,null,null,null,5,1]
[5,0,"TN499",499,12758,4098,140.88999999999999,null,null,null,null,265,7631,4855,7]
[5,11,"TN499",499,12073,3961,143.6,null,null,null,null,79,7220,4773,1]
[5,12,"TN499",499,630,122,91.1,null,null,null,null,186,362,79,3]
[5,13,"TN499",499,55,15,117.22,null,null,null,null,null,49,3,3]
[5,0,"TX-1",499,7765,2987,164.38,null,null,null,null,689,3840,2688,417,129]
[5,11,"TX-1",499,7537,2946,166.7,null,null,null,null,649,3759,2635,375,117]
[5,12,"TX-1",499,156,24,76.48,null,null,null,null,39,55,15,37,10]
[5,13,"TX-1",499,72,17,112.38,null,null,null,null,1,26,38,5,2]
[5,0,"TX349",499,1183,314,108.61,null,null,null,null,263,499,339,61,21]
[5,11,"TX349",499,1140,309,110.72,null,null,null,null,248,493,320,60,19]
[5,12,"TX349",499,16,null,3.38,null,null,null,null,15,null,1]
[5,13,"TX349",499,27,5,81.7,null,null,null,null,null,6,18,1,2]
[5,0,"TX362",499,902,196,81.48,null,null,null,null,257,288,293,31,33]
[5,11,"TX362",499,869,195,83.85,null,null,null,null,238,284,286,30,31]
[5,12,"TX362",499,19,null,2.58,null,null,null,null,19]
[5,13,"TX362",499,14,1,41.29,null,null,null,null,null,4,7,1,2]
[5,0,"TX499",499,56034,15563,123.95,null,null,null,null,879,32236,22878,39,2]
[5,11,"TX499",499,53841,15164,125.5,null,null,null,null,307,30883,22640,11]
[5,12,"TX499",499,1927,327,81.39,null,null,null,null,572,1102,227,26]
[5,13,"TX499",499,266,72,118.79,null,null,null,null,null,251,11,2,2]
[5,0,"UT-1",499,441,183,187.46,null,null,null,null,30,229,150,25,7]
[5,11,"UT-1",499,420,179,193.39,null,null,null,null,27,225,143,20,5]
[5,12,"UT-1",499,14,2,64.569999999999993,null,null,null,null,3,3,1,5,2]
[5,13,"UT-1",499,7,2,77,null,null,null,null,null,1,6]
[5,0,"UT341",499,74,17,90.34,null,null,null,null,29,18,16,10,1]
[5,11,"UT341",499,66,17,98.65,null,null,null,null,25,18,13,9,1]
[5,12,"UT341",499,4,null,2.25,null,null,null,null,4]
[5,13,"UT341",499,4,null,41.25,null,null,null,null,null,null,3,1]
[5,0,"UT499",499,2780,895,136.22,null,null,null,null,56,1596,1127,1]
[5,11,"UT499",499,2640,877,139.19999999999999,null,null,null,null,19,1506,1115]
[5,12,"UT499",499,125,16,79.48,null,null,null,null,37,75,12,1]
[5,13,"UT499",499,15,2,84.33,null,null,null,null,null,15]
[5,0,"VA-1",499,3009,1123,163,null,null,null,null,285,1422,1084,168,50]
[5,11,"VA-1",499,2944,1110,164.68,null,null,null,null,277,1399,1057,163,48]
[5,12,"VA-1",499,27,6,90,null,null,null,null,8,10,4,4,1]
[5,13,"VA-1",499,38,7,84.66,null,null,null,null,null,13,23,1,1]
[5,0,"VA314",499,748,391,137.51,null,null,null,null,174,167,364,19,24]
[5,11,"VA314",499,729,391,140.78,null,null,null,null,166,164,357,18,24]
[5,12,"VA314",499,9,null,2.44,null,null,null,null,8,null,null,1]
[5,13,"VA314",499,10,null,20.9,null,null,null,null,null,3,7]
[5,0,"VA499",499,19939,5663,125.71,null,null,null,null,296,11000,8634,9]
[5,11,"VA499",499,19151,5520,127.09,null,null,null,null,101,10475,8571,4]
[5,12,"VA499",499,584,88,80.02,null,null,null,null,195,328,56,5]
[5,13,"VA499",499,204,55,126.5,null,null,null,null,null,197,7]
[5,0,"VT-1",499,124,64,218.41,null,null,null,null,3,62,49,8,2]
[5,11,"VT-1",499,119,63,225.16,null,null,null,null,2,61,46,8,2]
[5,12,"VT-1",499,3,null,34,null,null,null,null,1,1,1]
[5,13,"VT-1",499,2,1,93.5,null,null,null,null,null,null,2]
[5,0,"VT405",499,6,1,144.66999999999999,null,null,null,null,1,1,3,1]
[5,11,"VT405",499,4,1,202,null,null,null,null,1,1,2]
[5,12,"VT405",499,1,null,2,null,null,null,null,null,null,null,1]
[5,13,"VT405",499,1,null,58,null,null,null,null,null,null,1]
[5,0,"VT499",499,499,187,175.28,null,null,null,null,7,305,187]
[5,11,"VT499",499,478,182,178.56,null,null,null,null,4,291,183]
[5,12,"VT499",499,19,4,96.32,null,null,null,null,3,12,4]
[5,13,"VT499",499,2,1,139.5,null,null,null,null,null,2]
[5,0,"WA-1",499,1748,802,200.47,null,null,null,null,134,917,586,91,20]
[5,11,"WA-1",499,1690,792,204.79,null,null,null,null,126,897,564,84,19]
[5,12,"WA-1",499,29,6,83.97,null,null,null,null,8,11,5,4,1]
[5,13,"WA-1",499,29,4,65.28,null,null,null,null,null,9,17,3]
[5,0,"WA346",499,264,54,74.790000000000006,null,null,null,null,77,84,82,14,7]
[5,11,"WA346",499,256,52,75.069999999999993,null,null,null,null,75,81,79,14,7]
[5,12,"WA346",499,2,null,2.5,null,null,null,null,2]
[5,13,"WA346",499,6,2,86.83,null,null,null,null,null,3,3]
[5,0,"WA499",499,11126,3885,145.80000000000001,null,null,null,null,168,6565,4391,2]
[5,11,"WA499",499,10639,3779,147.82,null,null,null,null,62,6225,4350,2]
[5,12,"WA499",499,400,79,101.92,null,null,null,null,106,255,39]
[5,13,"WA499",499,87,27,100.93,null,null,null,null,null,85,2]
[5,0,"WI-1",499,1122,475,201.37,null,null,null,null,89,603,351,62,17]
[5,11,"WI-1",499,1104,470,202.76,null,null,null,null,86,595,346,60,17]
[5,12,"WI-1",499,12,4,95.67,null,null,null,null,3,6,1,2]
[5,13,"WI-1",499,6,1,156.33000000000001,null,null,null,null,null,2,4]
[5,0,"WI330",499,144,25,83.12,null,null,null,null,50,43,40,8,3]
[5,11,"WI330",499,130,24,87.01,null,null,null,null,46,39,39,4,2]
[5,12,"WI330",499,13,1,44,null,null,null,null,4,4,1,4]
[5,13,"WI330",499,1,null,86,null,null,null,null,null,null,null,null,1]
[5,0,"WI499",499,7273,2504,146.32,null,null,null,null,114,4353,2802,4]
[5,11,"WI499",499,6939,2440,148.93,null,null,null,null,46,4135,2758]
[5,12,"WI499",499,306,51,83.34,null,null,null,null,68,191,43,4]
[5,13,"WI499",499,27,13,191.52,null,null,null,null,null,27]
[5,14,"WI499",499,1,null,57,null,null,null,null,null,null,1]
[5,0,"WV-1",499,487,253,218.13,null,null,null,null,36,241,159,44,7]
[5,11,"WV-1",499,474,251,221.91,null,null,null,null,34,235,157,41,7]
[5,12,"WV-1",499,11,1,76.09,null,null,null,null,2,5,1,3]
[5,13,"WV-1",499,2,1,104,null,null,null,null,null,1,1]
[5,0,"WV315",499,92,11,71.430000000000007,null,null,null,null,25,42,18,5,2]
[5,11,"WV315",499,90,10,64.03,null,null,null,null,23,42,18,5,2]
[5,12,"WV315",499,2,1,404.5,null,null,null,null,2]
[5,0,"WV499",499,3270,1131,147.86000000000001,null,null,null,null,66,2040,1159,5]
[5,11,"WV499",499,3089,1107,151.81,null,null,null,null,17,1934,1137,1]
[5,12,"WV499",499,174,21,75.91,null,null,null,null,49,99,22,4]
[5,13,"WV499",499,7,3,191.86,null,null,null,null,null,7]
[5,0,"WY-1",499,166,69,203.2,null,null,null,null,13,88,54,8,3]
[5,11,"WY-1",499,160,68,207.89,null,null,null,null,12,86,52,7,3]
[5,12,"WY-1",499,5,1,92.4,null,null,null,null,1,2,1,1]
[5,13,"WY-1",499,1,null,8,null,null,null,null,null,null,1]
[5,0,"WY442",499,20,7,136.85,null,null,null,null,8,5,4,3]
[5,11,"WY442",499,18,6,141.94,null,null,null,null,7,5,3,3]
[5,12,"WY442",499,1,null,3,null,null,null,null,1]
[5,13,"WY442",499,1,1,179,null,null,null,null,null,null,1]
[5,0,"WY499",499,1202,411,141.22,null,null,null,null,11,806,385]
[5,11,"WY499",499,1169,403,142.77000000000001,null,null,null,null,5,782,382]
[5,12,"WY499",499,27,5,82.85,null,null,null,null,6,18,3]
[5,13,"WY499",499,6,3,102.17,null,null,null,null,null,6]
[5,11,"AK100",499,1920,712,152.79,null,null,null,null,32,1314,553,19,2]
[5,12,"AK100",499,40,10,105.15,null,null,null,null,9,26,5]
[5,13,"AK100",499,37,14,124.49,null,null,null,null,null,29,6,1,1]
[5,0,"AK100",499,1997,736,151.32,null,null,null,null,41,1369,564,20,3]
[5,11,"AL100",499,13809,4282,137.84,null,null,null,null,393,7662,5605,103,46]
[5,12,"AL100",499,663,104,84.33,null,null,null,null,198,374,70,14,7]
[5,13,"AL100",499,72,23,132.15,null,null,null,null,1,47,24]
[5,0,"AL100",499,14544,4409,135.37,null,null,null,null,592,8083,5699,117,53]
[5,11,"AR100",499,6317,2236,156.69,null,null,null,null,162,3751,2341,50,13]
[5,12,"AR100",499,292,47,74.790000000000006,null,null,null,null,107,145,30,10]
[5,13,"AR100",499,35,11,159.49,null,null,null,null,null,30,4,1]
[5,0,"AR100",499,6644,2294,153.11000000000001,null,null,null,null,269,3926,2375,61,13]
[5,11,"AZ100",499,12688,4543,152.25,null,null,null,null,320,7496,4759,93,20]
[5,12,"AZ100",499,592,97,79.11,null,null,null,null,182,324,55,25,6]
[5,13,"AZ100",499,73,14,93.62,null,null,null,null,null,68,5]
[5,0,"AZ100",499,13353,4654,148.68,null,null,null,null,502,7888,4819,118,26]
[5,11,"CA100",499,46191,15411,146,null,null,null,null,1045,27003,17740,325,78]
[5,12,"CA100",499,1814,299,84.44,null,null,null,null,558,1022,165,61,8]
[5,13,"CA100",499,375,72,87.99,null,null,null,null,null,294,70,10,1]
[5,14,"CA100",499,1,null,17,null,null,null,null,null,null,1]
[5,0,"CA100",499,48381,15782,143.24,null,null,null,null,1603,28319,17976,396,87]
[5,11,"CO100",499,10951,3385,136.87,null,null,null,null,253,5988,4616,73,21]
[5,12,"CO100",499,366,68,80.69,null,null,null,null,112,215,32,6,1]
[5,13,"CO100",499,104,30,131.44,null,null,null,null,null,82,19,2,1]
[5,0,"CO100",499,11421,3483,135.02000000000001,null,null,null,null,365,6285,4667,81,23]
[5,11,"CT100",499,3159,1163,161.01,null,null,null,null,61,2043,1029,20,6]
[5,12,"CT100",499,180,27,87.42,null,null,null,null,48,108,13,9,2]
[5,13,"CT100",499,24,4,125,null,null,null,null,null,21,2,1]
[5,0,"CT100",499,3363,1194,156.82,null,null,null,null,109,2172,1044,30,8]
[5,11,"DC100",499,718,234,141.32,null,null,null,null,20,377,311,6,4]
[5,12,"DC100",499,26,6,94.04,null,null,null,null,10,13,3]
[5,13,"DC100",499,11,2,58.18,null,null,null,null,null,8,2,1]
[5,0,"DC100",499,755,242,138.47999999999999,null,null,null,null,30,398,316,7,4]
[5,11,"DE100",499,1663,533,137.49,null,null,null,null,35,947,668,13]
[5,12,"DE100",499,72,11,61.86,null,null,null,null,21,39,10,1,1]
[5,13,"DE100",499,14,3,86.29,null,null,null,null,null,11,2,1]
[5,0,"DE100",499,1749,547,133.97,null,null,null,null,56,997,680,15,1]
[5,11,"FL100",499,52431,18298,143.96,null,null,null,null,1247,28264,22427,343,149]
[5,12,"FL100",499,1936,325,84.26,null,null,null,null,607,1079,182,60,8]
[5,13,"FL100",499,334,84,108.18,null,null,null,null,null,268,57,8,1]
[5,0,"FL100",499,54701,18707,141.63,null,null,null,null,1854,29611,22666,411,158]
[5,11,"GA100",499,27317,7911,129.52000000000001,null,null,null,null,605,15392,11071,166,83]
[5,12,"GA100",499,1041,176,87.14,null,null,null,null,355,547,116,21,2]
[5,13,"GA100",499,145,29,101.79,null,null,null,null,null,111,30,3,1]
[5,0,"GA100",499,28503,8116,127.83,null,null,null,null,960,16050,11217,190,86]
[5,11,"HI100",499,3422,1188,149.22,null,null,null,null,61,2175,1162,16,8]
[5,12,"HI100",499,80,15,113.5,null,null,null,null,20,50,9,1]
[5,13,"HI100",499,49,16,115.63,null,null,null,null,null,43,6]
[5,0,"HI100",499,3551,1219,147.94999999999999,null,null,null,null,81,2268,1177,17,8]
[5,11,"IA100",499,4756,1810,159.33000000000001,null,null,null,null,101,2875,1734,35,11]
[5,12,"IA100",499,265,47,82.42,null,null,null,null,68,167,23,6,1]
[5,13,"IA100",499,22,9,136.94999999999999,null,null,null,null,null,17,4,1]
[5,0,"IA100",499,5043,1866,155.19,null,null,null,null,169,3059,1761,42,12]
[5,11,"ID100",499,3367,1309,161.69999999999999,null,null,null,null,78,1949,1306,27,7]
[5,12,"ID100",499,116,16,74.94,null,null,null,null,32,62,16,6]
[5,13,"ID100",499,31,6,124.68,null,null,null,null,null,27,3,1]
[5,0,"ID100",499,3514,1331,158.51,null,null,null,null,110,2038,1325,34,7]
[5,11,"IL100",499,12883,4878,156.94999999999999,null,null,null,null,328,7341,5092,94,28]
[5,12,"IL100",499,604,132,95.61,null,null,null,null,178,338,63,20,5]
[5,13,"IL100",499,51,15,127.14,null,null,null,null,null,42,8,1]
[5,0,"IL100",499,13538,5025,154.1,null,null,null,null,506,7721,5163,115,33]
[5,11,"IN100",499,9941,3637,152.85,null,null,null,null,254,5892,3699,61,35]
[5,12,"IN100",499,402,72,89.29,null,null,null,null,107,228,45,19,3]
[5,13,"IN100",499,33,9,107.85,null,null,null,null,null,24,9]
[5,0,"IN100",499,10376,3718,150.25,null,null,null,null,361,6144,3753,80,38]
[5,11,"KS100",499,4312,1626,157.63999999999999,null,null,null,null,83,2516,1651,50,12]
[5,12,"KS100",499,215,33,85.07,null,null,null,null,56,136,18,3,2]
[5,13,"KS100",499,27,2,62.67,null,null,null,null,null,22,5]
[5,0,"KS100",499,4554,1661,153.66,null,null,null,null,139,2674,1674,53,14]
[5,11,"KY100",499,7852,2808,152.38,null,null,null,null,173,4626,2977,55,21]
[5,12,"KY100",499,342,55,73.819999999999993,null,null,null,null,102,178,48,12,2]
[5,13,"KY100",499,37,13,126.73,null,null,null,null,null,31,4,1,1]
[5,0,"KY100",499,8231,2876,149,null,null,null,null,275,4835,3029,68,24]
[5,11,"LA100",499,9893,3080,139.80000000000001,null,null,null,null,259,5696,3850,73,15]
[5,12,"LA100",499,425,73,78.42,null,null,null,null,144,241,31,9]
[5,13,"LA100",499,60,10,79.67,null,null,null,null,null,53,6,1]
[5,0,"LA100",499,10378,3163,136.94,null,null,null,null,403,5990,3887,83,15]
[5,11,"MA100",499,5780,2113,157.16999999999999,null,null,null,null,128,3668,1921,49,14]
[5,12,"MA100",499,260,48,89.69,null,null,null,null,77,150,24,9]
[5,13,"MA100",499,29,10,157.9,null,null,null,null,null,24,5]
[5,0,"MA100",499,6069,2171,154.28,null,null,null,null,205,3842,1950,58,14]
[5,11,"MD100",499,10851,3136,127.33,null,null,null,null,269,5877,4577,82,46]
[5,12,"MD100",499,356,67,89.94,null,null,null,null,102,209,36,9]
[5,13,"MD100",499,131,31,110.9,null,null,null,null,null,104,22,4,1]
[5,0,"MD100",499,11338,3234,125.96,null,null,null,null,371,6190,4635,95,47]
[5,11,"ME100",499,2369,953,171.07,null,null,null,null,46,1479,823,13,8]
[5,12,"ME100",499,83,14,86.48,null,null,null,null,33,40,10]
[5,13,"ME100",499,11,5,277.18,null,null,null,null,null,10,null,1]
[5,0,"ME100",499,2463,972,168.69,null,null,null,null,79,1529,833,14,8]
[5,11,"MI100",499,11965,4382,155.71,null,null,null,null,291,7174,4389,87,24]
[5,12,"MI100",499,681,120,89.16,null,null,null,null,195,407,58,16,5]
[5,13,"MI100",499,51,18,127.9,null,null,null,null,null,41,7,1,2]
[5,0,"MI100",499,12697,4520,152.02000000000001,null,null,null,null,486,7622,4454,104,31]
[5,11,"MN100",499,7203,2532,155.09,null,null,null,null,167,4320,2645,61,10]
[5,12,"MN100",499,296,55,87.06,null,null,null,null,85,171,33,7]
[5,13,"MN100",499,20,8,164.05,null,null,null,null,null,17,3]
[5,0,"MN100",499,7519,2595,152.44,null,null,null,null,252,4508,2681,68,10]
[5,11,"MO100",499,10935,4067,155.75,null,null,null,null,242,6372,4235,63,23]
[5,12,"MO100",499,536,102,92.82,null,null,null,null,165,298,54,18,1]
[5,13,"MO100",499,51,14,119.8,null,null,null,null,null,37,13,null,1]
[5,0,"MO100",499,11522,4183,152.66,null,null,null,null,407,6707,4302,81,25]
[5,11,"MS100",499,7132,2290,140.62,null,null,null,null,213,4171,2671,60,17]
[5,12,"MS100",499,327,51,83.99,null,null,null,null,111,175,27,12,2]
[5,13,"MS100",499,28,8,100.14,null,null,null,null,null,20,8]
[5,0,"MS100",499,7487,2349,138,null,null,null,null,324,4366,2706,72,19]
[5,11,"MT100",499,2541,958,157.87,null,null,null,null,49,1530,948,10,4]
[5,12,"MT100",499,87,10,84.92,null,null,null,null,22,55,9,1]
[5,13,"MT100",499,13,7,196.54,null,null,null,null,null,10,3]
[5,0,"MT100",499,2641,975,155.66,null,null,null,null,71,1595,960,11,4]
[5,11,"NC100",499,25205,7572,131.84,null,null,null,null,659,14232,10036,205,73]
[5,12,"NC100",499,927,178,90.57,null,null,null,null,255,505,135,26,6]
[5,13,"NC100",499,178,32,98.51,null,null,null,null,null,137,34,5,2]
[5,0,"NC100",499,26310,7782,130.16,null,null,null,null,914,14874,10205,236,81]
[5,11,"ND100",499,1312,485,152.78,null,null,null,null,25,815,457,10,5]
[5,12,"ND100",499,49,10,99.43,null,null,null,null,9,32,7,1]
[5,13,"ND100",499,10,1,60.1,null,null,null,null,null,8,1,1]
[5,0,"ND100",499,1371,496,150.19999999999999,null,null,null,null,34,855,465,12,5]
[5,11,"NE100",499,3638,1143,140.94999999999999,null,null,null,null,86,2166,1347,28,11]
[5,12,"NE100",499,116,26,95.15,null,null,null,null,32,66,18]
[5,13,"NE100",499,14,3,90.64,null,null,null,null,null,11,3]
[5,0,"NE100",499,3768,1172,139.35,null,null,null,null,118,2243,1368,28,11]
[5,11,"NH100",499,1843,692,162.15,null,null,null,null,32,1180,614,15,2]
[5,12,"NH100",499,86,17,89.33,null,null,null,null,23,51,8,3,1]
[5,13,"NH100",499,7,4,341.14,null,null,null,null,null,7]
[5,0,"NH100",499,1936,713,159.57,null,null,null,null,55,1238,622,18,3]
[5,11,"NJ100",499,7145,2532,153.69999999999999,null,null,null,null,170,4470,2443,57,5]
[5,12,"NJ100",499,387,68,86.98,null,null,null,null,111,236,30,10]
[5,13,"NJ100",499,41,14,169.54,null,null,null,null,null,34,7]
[5,0,"NJ100",499,7573,2614,150.38,null,null,null,null,281,4740,2480,67,5]
[5,11,"NM100",499,3996,1470,152.72,null,null,null,null,102,2520,1330,33,11]
[5,12,"NM100",499,167,34,101.7,null,null,null,null,45,104,13,4,1]
[5,13,"NM100",499,32,11,168.91,null,null,null,null,null,25,7]
[5,0,"NM100",499,4195,1515,150.81,null,null,null,null,147,2649,1350,37,12]
[5,11,"NV100",499,7819,2636,143.65,null,null,null,null,223,4440,3082,56,18]
[5,12,"NV100",499,320,72,97.83,null,null,null,null,81,181,39,17,2]
[5,13,"NV100",499,34,7,99,null,null,null,null,null,22,10,2]
[5,0,"NV100",499,8173,2715,141.66999999999999,null,null,null,null,304,4643,3131,75,20]
[5,11,"NY100",499,13625,5237,162.12,null,null,null,null,285,8240,4952,107,41]
[5,12,"NY100",499,688,94,81.83,null,null,null,null,220,376,68,22,2]
[5,13,"NY100",499,82,23,115.99,null,null,null,null,null,71,9,1,1]
[5,0,"NY100",499,14395,5354,158.02000000000001,null,null,null,null,505,8687,5029,130,44]
[5,11,"OH100",499,16516,5999,153.66,null,null,null,null,381,9770,6210,119,36]
[5,12,"OH100",499,911,148,79.12,null,null,null,null,269,529,63,50]
[5,13,"OH100",499,64,21,120.11,null,null,null,null,null,50,13,1]
[5,0,"OH100",499,17491,6168,149.66,null,null,null,null,650,10349,6286,170,36]
[5,11,"OK100",499,10483,3258,137.59,null,null,null,null,241,5741,4401,78,22]
[5,12,"OK100",499,431,74,81.61,null,null,null,null,124,244,51,11,1]
[5,13,"OK100",499,47,13,112.09,null,null,null,null,null,39,6,2]
[5,0,"OK100",499,10961,3345,135.28,null,null,null,null,365,6024,4458,91,23]
[5,11,"OR100",499,6898,2827,175.6,null,null,null,null,134,4068,2632,44,20]
[5,12,"OR100",499,359,73,90.21,null,null,null,null,90,208,49,10,2]
[5,13,"OR100",499,30,11,167.63,null,null,null,null,null,29,1]
[5,0,"OR100",499,7287,2911,171.36,null,null,null,null,224,4305,2682,54,22]
[5,11,"OT100",499,7360,4120,210.27,null,null,null,null,125,4887,2290,43,15]
[5,12,"OT100",499,208,71,136.71,null,null,null,null,38,140,29,1]
[5,13,"OT100",499,146,59,154.12,null,null,null,null,null,133,12,null,1]
[5,0,"OT100",499,7714,4250,207.22,null,null,null,null,163,5160,2331,44,16]
[5,11,"PA100",499,15007,5789,165.18,null,null,null,null,343,8997,5531,103,33]
[5,12,"PA100",499,983,159,86.59,null,null,null,null,310,549,88,33,3]
[5,13,"PA100",499,49,14,145.04,null,null,null,null,null,41,6,2]
[5,0,"PA100",499,16039,5962,160.30000000000001,null,null,null,null,653,9587,5625,138,36]
[5,11,"PR100",499,3919,1341,147.34,null,null,null,null,139,3073,642,50,15]
[5,12,"PR100",499,335,49,79.98,null,null,null,null,131,161,22,13,8]
[5,13,"PR100",499,16,2,58.44,null,null,null,null,null,13,3]
[5,0,"PR100",499,4270,1392,141.72,null,null,null,null,270,3247,667,63,23]
[5,11,"RI100",499,1570,540,148.68,null,null,null,null,32,972,548,14,4]
[5,12,"RI100",499,52,11,93.04,null,null,null,null,16,28,6,1,1]
[5,13,"RI100",499,7,3,145.57,null,null,null,null,null,6,1]
[5,0,"RI100",499,1629,554,146.88999999999999,null,null,null,null,48,1006,555,15,5]
[5,11,"SC100",499,14530,4713,141.49,null,null,null,null,340,8105,5934,118,33]
[5,12,"SC100",499,629,124,95.83,null,null,null,null,194,347,70,18]
[5,13,"SC100",499,64,10,85.78,null,null,null,null,null,50,14]
[5,0,"SC100",499,15223,4847,139.37,null,null,null,null,534,8502,6018,136,33]
[5,11,"SD100",499,2112,784,152.37,null,null,null,null,39,1263,792,15,3]
[5,12,"SD100",499,49,6,64.88,null,null,null,null,16,29,3,1]
[5,13,"SD100",499,11,3,93.18,null,null,null,null,null,10,1]
[5,0,"SD100",499,2172,793,150.09,null,null,null,null,55,1302,796,16,3]
[5,11,"TN100",499,14339,4889,149.74,null,null,null,null,356,8303,5542,115,23]
[5,12,"TN100",499,675,130,90.27,null,null,null,null,201,375,83,13,3]
[5,13,"TN100",499,74,17,101.2,null,null,null,null,null,57,12,4,1]
[5,0,"TN100",499,15088,5036,146.84,null,null,null,null,557,8735,5637,132,27]
[5,11,"TX100",499,63387,18614,129.56,null,null,null,null,1442,35419,25881,476,167]
[5,12,"TX100",499,2118,351,79.739999999999995,null,null,null,null,645,1157,243,63,10]
[5,13,"TX100",499,379,95,112.07,null,null,null,null,1,287,74,9,8]
[5,0,"TX100",499,65884,19060,127.86,null,null,null,null,2088,36863,26198,548,185]
[5,11,"UT100",499,3126,1073,145.63,null,null,null,null,71,1749,1271,29,6]
[5,12,"UT100",499,143,18,75.86,null,null,null,null,44,78,13,6,2]
[5,13,"UT100",499,26,4,75.73,null,null,null,null,null,16,9,1]
[5,0,"UT100",499,3295,1095,142.05000000000001,null,null,null,null,115,1843,1293,36,8]
[5,11,"VA100",499,22824,7021,132.38,null,null,null,null,544,12038,9985,185,72]
[5,12,"VA100",499,620,94,79.33,null,null,null,null,211,338,60,10,1]
[5,13,"VA100",499,252,62,116,null,null,null,null,null,213,37,1,1]
[5,0,"VA100",499,23696,7177,130.81,null,null,null,null,755,12589,10082,196,74]
[5,11,"VT100",499,601,246,187.95,null,null,null,null,7,353,231,8,2]
[5,12,"VT100",499,23,4,84.09,null,null,null,null,4,13,5,1]
[5,13,"VT100",499,5,2,104.8,null,null,null,null,null,2,3]
[5,0,"VT100",499,629,252,183.49,null,null,null,null,11,368,239,9,2]
[5,11,"WA100",499,12585,4623,153.99,null,null,null,null,263,7203,4993,100,26]
[5,12,"WA100",499,431,85,100.25,null,null,null,null,116,266,44,4,1]
[5,13,"WA100",499,122,33,91.76,null,null,null,null,null,97,22,3]
[5,0,"WA100",499,13138,4741,151.65,null,null,null,null,379,7566,5059,107,27]
[5,11,"WI100",499,8173,2934,155.22,null,null,null,null,178,4769,3143,64,19]
[5,12,"WI100",499,331,56,82.24,null,null,null,null,75,201,45,10]
[5,13,"WI100",499,34,14,182.21,null,null,null,null,null,29,4,null,1]
[5,14,"WI100",499,1,null,57,null,null,null,null,null,null,1]
[5,0,"WI100",499,8539,3004,152.49,null,null,null,null,253,4999,3193,74,20]
[5,11,"WV100",499,3653,1368,158.74,null,null,null,null,74,2211,1312,47,9]
[5,12,"WV100",499,187,23,79.430000000000007,null,null,null,null,53,104,23,7]
[5,13,"WV100",499,9,4,172.33,null,null,null,null,null,8,1]
[5,0,"WV100",499,3849,1395,154.91999999999999,null,null,null,null,127,2323,1336,54,9]
[5,11,"WY100",499,1347,477,150.49,null,null,null,null,24,873,437,10,3]
[5,12,"WY100",499,33,6,81.88,null,null,null,null,8,20,4,1]
[5,13,"WY100",499,8,4,100,null,null,null,null,null,6,2]
[5,0,"WY100",499,1388,487,148.57,null,null,null,null,32,899,443,11,3]
[5,0,35,499,7714,4250,207.22,1162,9772,219.38,184.03,163,5160,2331,44,16]
[5,0,384,499,116722,35933,134.94999999999999,28720,224413,158.27000000000001,132.52000000000001,3688,66307,45471,961,293]
[5,0,393,499,218924,69543,137.58000000000001,53891,420424,160.81,134.58000000000001,7834,123131,85524,1819,615]
[5,0,394,499,142101,50427,151.63999999999999,33493,255113,181.05,148.74,5066,84296,51159,1220,360]
[5,0,395,499,106884,36699,147.82,25720,195954,168.88,137.84,3506,62888,39376,894,220]
[5,11,35,499,7360,4120,210.27,1090,9195,223.82,188.61,125,4887,2290,43,15]
[5,11,384,499,112042,35072,136.97999999999999,27475,212584,162.54,136.68,2510,63506,44909,846,269]
[5,11,393,499,209221,67809,139.88,51457,397030,165.01,138.9,5164,117524,84393,1570,569]
[5,11,394,499,134744,49065,154.96,31787,239791,186.4,154.19999999999999,3102,79921,50416,975,330]
[5,11,395,499,102012,35792,150.59,24407,184017,174.35,142.91,2329,59917,38828,742,196]
[5,12,35,499,208,71,136.71,15,142,124.4,74.63,38,140,29,1]
[5,12,384,499,4025,686,81.66,777,6475,71.72,53.8,1177,2292,441,100,15]
[5,12,393,499,8399,1429,84.97,1502,12812,78.849999999999994,56.8,2669,4569,897,225,39]
[5,12,394,499,6661,1156,86.79,1295,10970,74.34,54.65,1964,3813,629,231,24]
[5,12,395,499,4062,719,87.82,782,6428,75.930000000000007,57.27,1177,2321,408,134,22]
[5,13,35,499,146,59,154.12,57,435,159.47,122.91,null,133,12,null,1]
[5,13,384,499,655,175,115.49,468,5353,50.91,62.51,1,509,121,15,9]
[5,13,393,499,1304,305,107.74,932,10581,60.71,66.33,1,1038,234,24,7]
[5,13,394,499,695,206,131.02000000000001,410,4350,103.69,84.98,null,562,113,14,6]
[5,13,395,499,809,188,100.04,531,5509,54.21,62.33,null,650,139,18,2]
[5,14,384,499,null,null,null,null,1,null,247]
[5,14,393,499,null,null,null,null,1,null,287]
[5,14,394,499,1,null,57,1,2,306,161.5,null,null,1]
[5,14,395,499,1,null,17,null,null,null,null,null,null,1]
[5,0,499,499,502855,161540,138.25,122,1094,103.08,168.48,9236,298779,194489,347,4]
[5,0,499,499,null,null,null,3,27,1,30.59]
[5,11,499,499,478756,157069,140.63999999999999,113,1037,108.81,172.06,2937,283639,192105,75]
[5,12,499,499,21378,3718,86.98,9,57,31.11,103.44,6299,12551,2275,251,2]
[5,13,499,499,2719,753,121.2,null,null,null,null,null,2589,107,21,2]
[5,13,499,499,null,null,null,3,27,1,30.59]
[5,14,499,499,2,null,37,null,null,null,null,null,null,2]
[7,1,100,8,13,null,1261.77]
[7,1,100,3,28239,null,275.75]
[7,1,100,2,1202,null,1136.3399999999999]
[7,1,100,1,785,null,1608.26]
[7,1,100,9,577,null,1815.36]
[7,1,100,10,10718,null,19.079999999999998]
[7,1,100,6,13,null,1261.77]
[7,2,-1,2000,26773,null,266.91000000000003]
[7,2,301,2000,2,null,906.5]
[7,2,304,2000,3,null,914.33]
[7,2,306,2000,1,null,1384]
[7,2,307,2000,3,null,850]
[7,2,308,2000,1,null,957]
[7,2,309,2000,3,null,776.67]
[7,2,310,2000,8,null,763.25]
[7,2,311,2000,163,null,548.66]
[7,2,313,2000,5,null,909]
[7,2,314,2000,5,null,1478.8]
[7,2,315,2000,2,null,1324.5]
[7,2,316,2000,6,null,900.33]
[7,2,317,2000,16,null,918.63]
[7,2,318,2000,3,null,1066]
[7,2,319,2000,3,null,1072.33]
[7,2,320,2000,3,null,990.67]
[7,2,321,2000,7,null,917.86]
[7,2,322,2000,2,null,846]
[7,2,323,2000,226,null,620.01]
[7,2,325,2000,7,null,1175.71]
[7,2,327,2000,264,null,437.55]
[7,2,328,2000,5,null,1118.4000000000001]
[7,2,329,2000,2,null,1115.5]
[7,2,330,2000,1,null,977]
[7,2,331,2000,5,null,1131.5999999999999]
[7,2,333,2000,2,null,2757]
[7,2,334,2000,3,null,1532.67]
[7,2,335,2000,302,null,449.48]
[7,2,339,2000,19,null,831.95]
[7,2,340,2000,3,null,1115.67]
[7,2,341,2000,5,null,1308.2]
[7,2,343,2000,3,null,428]
[7,2,344,2000,10,null,723.3]
[7,2,345,2000,2,null,1205.5]
[7,2,346,2000,1,null,1338]
[7,2,347,2000,1,null,891]
[7,2,348,2000,4,null,1045.5]
[7,2,349,2000,2,null,884]
[7,2,350,2000,2,null,1167]
[7,2,351,2000,32,null,666.53]
[7,2,354,2000,7,null,885.14]
[7,2,355,2000,12,null,803.5]
[7,2,358,2000,75,null,539.57000000000005]
[7,2,362,2000,13,null,901.38]
[7,2,377,2000,3,null,1109]
[7,2,397,2000,1860,null,1291.25]
[7,2,436,2000,1,null,1578]
[7,2,437,2000,3,null,971.33]
[7,2,452,2000,2,null,1399]
[7,2,459,2000,2,null,462]
[7,2,100,2000,29888,null,343.94]
[7,2,-1,3000,336,null,399.71]
[7,2,310,3000,1,null,16]
[7,2,330,3000,1,null,1612]
[7,2,100,3000,338,null,402.16]
[7,2,35,2000,28633,null,333.47]
[7,2,384,2000,379,null,537.65]
[7,2,393,2000,551,null,572.4]
[7,2,394,2000,209,null,643.77]
[7,2,395,2000,116,null,673.64]
[10,1,-1,-1,23458]
[8,11,306,"2022-05-13",1,1,0.88710999999999995,8.4169999999999995E-2,0.87538000000000005,7.9380000000000006E-2]
[8,11,325,"2022-05-13",0.88451999999999997,0.93742999999999999,0.92212000000000005,7.8299999999999995E-2,0.95308000000000004,5.0790000000000002E-2]
[8,11,327,"2022-05-13",0.92244999999999999,0.79747000000000001,0.90812999999999999,7.7939999999999995E-2,0.87426999999999999,0.10539999999999999]
[8,11,331,"2022-05-13",0.92354999999999998,0.80130000000000001,0.91298000000000001,6.676E-2,0.87526000000000004,9.4869999999999996E-2]
[8,11,333,"2022-05-13",0.96921999999999997,0.83599999999999997,0.93478000000000006,7.1609999999999993E-2,0.94391000000000003,6.0260000000000001E-2]
[8,11,335,"2022-05-13",0.9738,0.90700000000000003,0.95572999999999997,4.9110000000000001E-2,0.97182999999999997,4.3159999999999997E-2]
[8,11,344,"2022-05-13",0.95967000000000002,0.88915999999999995,0.82857000000000003,0.10774,0.92512000000000005,6.2869999999999995E-2]
[8,11,349,"2022-05-13",0.99204000000000003,0.93706,0.90995999999999999,8.616E-2,0.93647000000000002,5.2269999999999997E-2]
[8,11,373,"2022-05-13",0.96696000000000004,0.87005999999999994,0.88453999999999999,8.097E-2,0.85267999999999999,8.344E-2]
[8,11,442,"2022-05-13",0.97350999999999999,0.91627000000000003,0.90115000000000001,8.2350000000000007E-2,0.84682000000000002,9.2480000000000007E-2]
[8,11,459,"2022-05-13",0.94828000000000001,0.82872000000000001,0.91717000000000004,8.3419999999999994E-2,0.92381999999999997,7.7329999999999996E-2]
[8,11,384,"2022-05-13",0.97882999999999998,0.91473000000000004,0.91969000000000001,2.6530000000000001E-2,0.94245000000000001,3.5319999999999997E-2]
[8,11,307,"2022-05-13",0.79020999999999997,0.87465999999999999,0.87702000000000002,8.541E-2,0.94893000000000005,5.5280000000000003E-2]
[8,11,308,"2022-05-13",0.95428999999999997,0.83284999999999998,0.88175999999999999,7.2539999999999993E-2,0.84340000000000004,0.11122]
[8,11,315,"2022-05-13",0.89466999999999997,0.92068000000000005,0.89785999999999999,8.1570000000000004E-2,0.94764000000000004,5.6800000000000003E-2]
[8,11,319,"2022-05-13",0.94660999999999995,0.92227999999999999,0.93849000000000005,6.0339999999999998E-2,0.91244000000000003,9.5920000000000005E-2]
[8,11,437,"2022-05-13",0.94345000000000001,0.94650000000000001,0.89129999999999998,8.2629999999999995E-2,0.91637999999999997,6.862E-2]
[8,11,310,"2022-05-13",0.97067000000000003,0.89115,0.91930999999999996,8.2580000000000001E-2,0.91891,8.2089999999999996E-2]
[8,11,316,"2022-05-13",0.96709999999999996,0.90414000000000005,0.85294000000000003,8.6540000000000006E-2,0.74729000000000001,0.11335000000000001]
[8,11,340,"2022-05-13",0.96262999999999999,0.82552000000000003,0.86570000000000003,8.548E-2,0.93445,5.534E-2]
[8,11,341,"2022-05-13",0.96770999999999996,0.90015000000000001,0.93767999999999996,6.4299999999999996E-2,1,0]
[8,11,346,"2022-05-13",0.98499999999999999,0.84953999999999996,0.89127000000000001,0.10253,0.98272999999999999,2.6419999999999999E-2]
[8,11,347,"2022-05-13",0.95587,0.88941000000000003,0.91000999999999999,8.7489999999999998E-2,1,0]
[8,11,350,"2022-05-13",0.98138999999999998,0.94906000000000001,0.89854000000000001,6.4380000000000007E-2,0.89170000000000005,7.979E-2]
[8,11,351,"2022-05-13",0.97287999999999997,0.91932000000000003,0.91912000000000005,8.165E-2,0.9415,7.1919999999999998E-2]
[8,11,372,"2022-05-13",null,null,null,null,0.87034,5.3530000000000001E-2]
[8,11,377,"2022-05-13",0.90390999999999999,0.74746000000000001,0.87539,8.7929999999999994E-2,0.90439999999999998,7.5160000000000005E-2]
[8,11,313,"2022-05-13",0.97541,1,0.93162,6.0519999999999997E-2,0.91622000000000003,7.1209999999999996E-2]
[8,11,329,"2022-05-13",0.97221000000000002,0.91839000000000004,0.84006000000000003,8.1839999999999996E-2,0.87463999999999997,9.3479999999999994E-2]
[8,11,330,"2022-05-13",0.98823000000000005,0.94494999999999996,0.94993000000000005,5.4120000000000001E-2,0.96858999999999995,4.811E-2]
[8,11,334,"2022-05-13",0.98202999999999996,0.91861000000000004,0.98133000000000004,2.8160000000000001E-2,0.84806999999999999,0.12250999999999999]
[8,11,358,"2022-05-13",0.97992000000000001,0.86421000000000003,0.91244000000000003,7.4749999999999997E-2,1,0]
[8,11,438,"2022-05-13",0.96733999999999998,0.89912999999999998,0.86351999999999995,9.0959999999999999E-2,0.94993000000000005,5.3609999999999998E-2]
[8,11,460,"2022-05-13",0.95735000000000003,0.77929999999999999,0.87155000000000005,8.9950000000000002E-2,0.95104,5.3129999999999997E-2]
[8,11,463,"2022-05-13",1,1,0.94801000000000002,5.389E-2,0.90234000000000003,6.4259999999999998E-2]
[8,11,301,"2022-05-13",0.90317000000000003,0.86628000000000005,0.90749999999999997,8.4199999999999997E-2,0.85226000000000002,0.10163]
[8,11,309,"2022-05-13",0.89119999999999999,0.84963,0.89285999999999999,7.17E-2,0.76941999999999999,0.14077000000000001]
[8,11,321,"2022-05-13",0.80867,0.86670999999999998,0.92366000000000004,6.7909999999999998E-2,0.82796000000000003,9.5630000000000007E-2]
[8,11,348,"2022-05-13",1,1,0.92481999999999998,6.5390000000000004E-2,0.84404000000000001,0.13153999999999999]
[8,11,452,"2022-05-13",0.99097000000000002,0.93033999999999994,0.92688999999999999,8.0189999999999997E-2,0.78559999999999997,0.11236]
[8,11,395,"2022-05-13",0.96562000000000003,0.84636999999999996,0.89349999999999996,3.8780000000000002E-2,0.92754000000000003,4.2759999999999999E-2]
[8,11,null,"2022-05-13",0.94230000000000003,0.90183000000000002,0.89666000000000001,2.009E-2,0.90498000000000001,3.3399999999999999E-2]
[8,11,318,"2022-05-13",1,1,0.93211999999999995,5.9369999999999999E-2,0.94698000000000004,5.7590000000000002E-2]
[8,11,323,"2022-05-13",0.94669000000000003,0.79393999999999998,0.82887,8.5010000000000002E-2,0.85960999999999999,8.1040000000000001E-2]
[8,11,326,"2022-05-13",0.96601999999999999,0.85526999999999997,0.85582000000000003,8.2530000000000006E-2,0.81672,9.3119999999999994E-2]
[8,11,402,"2022-05-13",0.80113999999999996,0.67918999999999996,0.89158999999999999,8.4989999999999996E-2,0.86441000000000001,0.10725999999999999]
[8,11,405,"2022-05-13",1,1,0.90976999999999997,6.9989999999999997E-2,0.86965999999999999,9.7000000000000003E-2]
[8,11,1,"2022-05-13",0.96203000000000005,0.89849000000000001,0.90203,1.4019999999999999E-2,0.91776999999999997,1.8319999999999999E-2]
[8,11,311,"2022-05-13",0.92901999999999996,0.85445000000000004,0.83436999999999995,9.6379999999999993E-2,0.97679000000000005,3.4939999999999999E-2]
[8,11,314,"2022-05-13",0.96819,0.86365999999999998,0.89756000000000002,0.10578,0.91757999999999995,9.0279999999999999E-2]
[8,11,320,"2022-05-13",0.99258999999999997,1,0.95901000000000003,4.9700000000000001E-2,0.88929999999999998,9.7629999999999995E-2]
[8,11,345,"2022-05-13",0.97626000000000002,0.88651999999999997,0.96387,5.4649999999999997E-2,0.91525999999999996,7.5050000000000006E-2]
[8,11,354,"2022-05-13",0.97797000000000001,0.86370999999999998,0.89576,0.10381,0.95516999999999996,4.7419999999999997E-2]
[8,11,355,"2022-05-13",0.93293000000000004,0.71884000000000003,0.80889,9.6530000000000005E-2,0.75378999999999996,9.6579999999999999E-2]
[8,11,362,"2022-05-13",0.96750000000000003,0.90754999999999997,0.89414000000000005,7.3480000000000004E-2,0.94286999999999999,5.74E-2]
[8,11,393,"2022-05-13",0.96118000000000003,0.91947999999999996,0.90024999999999999,2.4590000000000001E-2,0.90388000000000002,3.5200000000000002E-2]
[8,11,304,"2022-05-13",0.95279999999999998,0.95208999999999999,0.91791999999999996,7.6319999999999999E-2,0.95106999999999997,4.6859999999999999E-2]
[8,11,317,"2022-05-13",0.97394000000000003,0.96204000000000001,0.86519000000000001,0.10449,0.91471999999999998,7.2330000000000005E-2]
[8,11,322,"2022-05-13",0.96586000000000005,0.88732999999999995,0.89907000000000004,6.8529999999999994E-2,0.90185999999999999,7.9519999999999993E-2]
[8,11,328,"2022-05-13",1,1,0.95833999999999997,5.0610000000000002E-2,0.88795999999999997,9.3450000000000005E-2]
[8,11,339,"2022-05-13",0.99214000000000002,0.93344000000000005,0.94257000000000002,6.2469999999999998E-2,0.82352999999999998,0.11455]
[8,11,343,"2022-05-13",0.95882000000000001,0.9133,0.90576999999999996,0.10346,0.91098000000000001,8.0240000000000006E-2]
[8,11,436,"2022-05-13",0.98985999999999996,0.94867999999999997,0.92378000000000005,6.8750000000000006E-2,0.91210999999999998,8.7959999999999997E-2]
[8,12,335,"2022-05-13",null,0.86909000000000003,0.93742000000000003,7.7829999999999996E-2,0.95308000000000004,3.2140000000000002E-2]
[8,12,310,"2022-05-13",null,1,0.98009999999999997,1.9230000000000001E-2,0.95818000000000003,4.2340000000000003E-2]
[8,12,1,"2022-05-13",null,0.95891999999999999,0.97023999999999999,3.1910000000000001E-2,0.95535000000000003,3.5549999999999998E-2]
[8,12,330,"2022-05-13",null,1,1,0,0.95516000000000001,6.7180000000000004E-2]
[9,1,307,"2022-05-27",3392,3486,-94]
[9,1,351,"2022-05-27",1936,2431,-495]
[9,1,1,"2022-05-27",5328,5917,-589]
[9,2,307,"2022-05-27",20031,22015,-1984]
[9,2,351,"2022-05-27",25296,27823,-2527]
[9,2,1,"2022-05-27",45327,49838,-4511]
[1,2000,-1,-1,22861,5076,93.3]
[1,2000,100,-1,102222,11039,70.98]
[1,2000,301,-1,390,16,32.26]
[1,2000,304,-1,577,57,43.28]
[1,2000,306,-1,729,49,44.39]
[1,2000,307,-1,503,18,35.68]
[1,2000,308,-1,282,13,38.46]
[1,2000,309,-1,409,24,38.89]
[1,2000,310,-1,2846,182,39.46]
[1,2000,311,-1,677,29,37.24]
[1,2000,313,-1,960,43,36.299999999999997]
[1,2000,314,-1,2478,107,34.270000000000003]
[1,2000,315,-1,358,28,50.78]
[1,2000,316,-1,2246,114,46.2]
[1,2000,317,-1,3977,249,40.85]
[1,2000,318,-1,3334,238,48.04]
[1,2000,319,-1,3742,253,47.17]
[1,2000,320,-1,1890,205,58.59]
[1,2000,321,-1,764,36,37.14]
[1,2000,322,-1,1152,60,37.06]
[1,2000,323,-1,803,48,52.62]
[1,2000,325,-1,1905,194,57.62]
[1,2000,326,-1,5086,327,46.12]
[1,2000,327,-1,3189,254,57.77]
[1,2000,328,-1,994,56,40.61]
[1,2000,329,-1,2158,202,52.82]
[1,2000,330,-1,4941,505,55.62]
[1,2000,331,-1,1163,117,55.59]
[1,2000,333,-1,456,27,41.94]
[1,2000,334,-1,1433,85,41.27]
[1,2000,335,-1,3473,344,51.59]
[1,2000,339,-1,999,43,34.03]
[1,2000,340,-1,332,15,39.81]
[1,2000,341,-1,2502,121,49.66]
[1,2000,343,-1,1256,53,35.380000000000003]
[1,2000,344,-1,1317,88,43.66]
[1,2000,345,-1,1181,97,44.33]
[1,2000,346,-1,2133,208,58.74]
[1,2000,347,-1,424,36,52.67]
[1,2000,348,-1,740,30,31.03]
[1,2000,349,-1,3767,482,60.39]
[1,2000,350,-1,812,89,61.39]
[1,2000,351,-1,1464,149,58.43]
[1,2000,354,-1,537,24,38.74]
[1,2000,355,-1,548,25,43.59]
[1,2000,358,-1,122,35,112.47]
[1,2000,362,-1,3044,169,42.25]
[1,2000,372,-1,547,9,2436.96]
[1,2000,373,-1,184,34,68.260000000000005]
[1,2000,376,-1,2,1,241]
[1,2000,377,-1,2420,242,57.4]
[1,2000,402,-1,341,29,62.91]
[1,2000,405,-1,61,2,36.1]
[1,2000,436,-1,249,21,50.48]
[1,2000,437,-1,171,10,44.5]
[1,2000,438,-1,162,15,54.36]
[1,2000,442,-1,110,9,49.85]
[1,2000,452,-1,364,14,33.43]
[1,2000,459,-1,354,21,39.950000000000003]
[1,2000,460,-1,123,3,28.62]
[1,2000,463,-1,180,9,37.909999999999997]
[1,3000,-1,-1,2620,529,73.48]
[1,3000,100,-1,5716,995,67.56]
[1,3000,310,-1,318,24,59.75]
[1,3000,330,-1,1424,216,62.82]
[1,3000,335,-1,1354,226,62.93]
[1,2000,35,-1,22861,5076,93.3]
[1,2000,384,-1,15692,1368,49.69]
[1,2000,393,-1,25293,1706,46.97]
[1,2000,394,-1,24878,1910,100.42]
[1,2000,395,-1,13498,979,48.65]
[2,2100,-1,-1,149890,42185]
[2,2100,100,-1,529894,152334]
[2,2100,301,-1,3006,893]
[2,2100,304,-1,2330,607]
[2,2100,306,-1,5404,1727]
[2,2100,307,-1,3578,1108]
[2,2100,308,-1,2037,676]
[2,2100,309,-1,3414,1032]
[2,2100,310,-1,9369,2943]
[2,2100,311,-1,6206,2272]
[2,2100,313,-1,7175,1899]
[2,2100,314,-1,16685,4588]
[2,2100,315,-1,2283,673]
[2,2100,316,-1,18700,4914]
[2,2100,317,-1,30806,9200]
[2,2100,318,-1,17611,4658]
[2,2100,319,-1,9522,2576]
[2,2100,320,-1,9361,2666]
[2,2100,321,-1,6279,1646]
[2,2100,322,-1,8061,2139]
[2,2100,323,-1,4747,1328]
[2,2100,325,-1,10201,3126]
[2,2100,326,-1,6004,1805]
[2,2100,327,-1,4816,1465]
[2,2100,328,-1,8256,2580]
[2,2100,329,-1,6926,2107]
[2,2100,330,-1,6846,2253]
[2,2100,331,-1,6862,2096]
[2,2100,333,-1,2723,822]
[2,2100,334,-1,2543,720]
[2,2100,335,-1,7180,2194]
[2,2100,339,-1,7700,2000]
[2,2100,340,-1,2523,794]
[2,2100,341,-1,2897,811]
[2,2100,343,-1,10637,3153]
[2,2100,344,-1,10300,2954]
[2,2100,345,-1,7400,2081]
[2,2100,346,-1,11768,3827]
[2,2100,347,-1,2221,751]
[2,2100,348,-1,4176,1371]
[2,2100,349,-1,22022,6090]
[2,2100,350,-1,4114,1267]
[2,2100,351,-1,6863,1737]
[2,2100,354,-1,5055,1441]
[2,2100,355,-1,2139,634]
[2,2100,358,-1,421,157]
[2,2100,362,-1,21117,5447]
[2,2100,372,-1,217,55]
[2,2100,373,-1,1137,358]
[2,2100,376,-1,203,202]
[2,2100,377,-1,12122,3369]
[2,2100,402,-1,1635,542]
[2,2100,405,-1,397,129]
[2,2100,436,-1,1697,541]
[2,2100,437,-1,1209,339]
[2,2100,438,-1,1514,469]
[2,2100,442,-1,984,304]
[2,2100,452,-1,2936,925]
[2,2100,459,-1,3306,992]
[2,2100,460,-1,981,260]
[2,2100,463,-1,1382,436]
[2,2200,-1,-1,23607,5406]
[2,2200,100,-1,209869,44978]
[2,2200,301,-1,1035,120]
[2,2200,304,-1,1176,210]
[2,2200,306,-1,1785,255]
[2,2200,307,-1,1289,164]
[2,2200,308,-1,756,113]
[2,2200,309,-1,985,134]
[2,2200,310,-1,8017,4032]
[2,2200,311,-1,1633,178]
[2,2200,313,-1,1807,152]
[2,2200,314,-1,4072,373]
[2,2200,315,-1,763,129]
[2,2200,316,-1,4249,531]
[2,2200,317,-1,6735,822]
[2,2200,318,-1,11306,2458]
[2,2200,319,-1,5210,589]
[2,2200,320,-1,8355,2056]
[2,2200,321,-1,1593,171]
[2,2200,322,-1,2152,232]
[2,2200,323,-1,1550,181]
[2,2200,325,-1,3403,464]
[2,2200,326,-1,6134,543]
[2,2200,327,-1,4177,484]
[2,2200,328,-1,1986,268]
[2,2200,329,-1,7078,1705]
[2,2200,330,-1,15353,5625]
[2,2200,331,-1,2071,288]
[2,2200,333,-1,994,138]
[2,2200,334,-1,1970,215]
[2,2200,335,-1,16593,6043]
[2,2200,339,-1,2328,261]
[2,2200,340,-1,654,69]
[2,2200,341,-1,3142,225]
[2,2200,343,-1,2567,247]
[2,2200,344,-1,2428,274]
[2,2200,345,-1,2199,268]
[2,2200,346,-1,4281,816]
[2,2200,347,-1,861,127]
[2,2200,348,-1,1462,161]
[2,2200,349,-1,5956,909]
[2,2200,350,-1,2969,788]
[2,2200,351,-1,7714,1967]
[2,2200,354,-1,1028,104]
[2,2200,355,-1,1446,85]
[2,2200,358,-1,426,113]
[2,2200,362,-1,5031,570]
[2,2200,372,-1,594,14]
[2,2200,373,-1,431,76]
[2,2200,376,-1,2,1]
[2,2200,377,-1,11478,3092]
[2,2200,402,-1,702,119]
[2,2200,405,-1,177,25]
[2,2200,436,-1,518,68]
[2,2200,437,-1,408,62]
[2,2200,438,-1,601,141]
[2,2200,442,-1,222,38]
[2,2200,452,-1,887,116]
[2,2200,459,-1,874,105]
[2,2200,460,-1,276,22]
[2,2200,463,-1,373,36]
[2,2300,-1,-1,118,15]
[2,2300,100,-1,5188,361]
[2,2300,301,-1,51,2]
[2,2300,304,-1,30]
[2,2300,306,-1,67,5]
[2,2300,307,-1,48,3]
[2,2300,308,-1,21,1]
[2,2300,309,-1,37]
[2,2300,310,-1,141,5]
[2,2300,311,-1,59,3]
[2,2300,313,-1,84]
[2,2300,314,-1,168,1]
[2,2300,315,-1,45,1]
[2,2300,316,-1,136,2]
[2,2300,317,-1,368,8]
[2,2300,318,-1,276,11]
[2,2300,319,-1,126,3]
[2,2300,320,-1,139,6]
[2,2300,321,-1,50,2]
[2,2300,322,-1,75,1]
[2,2300,323,-1,35,2]
[2,2300,325,-1,128,6]
[2,2300,326,-1,81,3]
[2,2300,327,-1,324,186]
[2,2300,328,-1,106]
[2,2300,329,-1,84,7]
[2,2300,330,-1,182,6]
[2,2300,331,-1,101,3]
[2,2300,333,-1,45]
[2,2300,334,-1,32,1]
[2,2300,335,-1,170,10]
[2,2300,339,-1,109,3]
[2,2300,340,-1,28,2]
[2,2300,341,-1,26,1]
[2,2300,343,-1,152,2]
[2,2300,344,-1,125,4]
[2,2300,345,-1,92,3]
[2,2300,346,-1,123,5]
[2,2300,347,-1,35,2]
[2,2300,348,-1,54,1]
[2,2300,349,-1,217,7]
[2,2300,350,-1,66,5]
[2,2300,351,-1,88,1]
[2,2300,354,-1,48]
[2,2300,355,-1,33,1]
[2,2300,358,-1,6,1]
[2,2300,362,-1,252,5]
[2,2300,372,-1,4]
[2,2300,373,-1,18]
[2,2300,377,-1,189,21]
[2,2300,402,-1,25,1]
[2,2300,405,-1,3]
[2,2300,436,-1,12]
[2,2300,437,-1,33]
[2,2300,438,-1,19]
[2,2300,442,-1,20]
[2,2300,452,-1,36,2]
[2,2300,459,-1,13]
[2,2300,460,-1,14,1]
[2,2300,463,-1,21]
[2,2400,-1,-1,48155,28639]
[2,2400,100,-1,111768,56976]
[2,2400,301,-1,199,124]
[2,2400,304,-1,194,112]
[2,2400,306,-1,380,155]
[2,2400,307,-1,215,130]
[2,2400,308,-1,202,98]
[2,2400,309,-1,232,99]
[2,2400,310,-1,1397,974]
[2,2400,311,-1,366,196]
[2,2400,313,-1,834,170]
[2,2400,314,-1,1649,1134]
[2,2400,315,-1,661,590]
[2,2400,316,-1,1077,463]
[2,2400,317,-1,5427,2722]
[2,2400,318,-1,1113,534]
[2,2400,319,-1,894,318]
[2,2400,320,-1,789,407]
[2,2400,321,-1,322,149]
[2,2400,322,-1,429,195]
[2,2400,323,-1,393,149]
[2,2400,325,-1,1528,1165]
[2,2400,326,-1,367,228]
[2,2400,327,-1,421,245]
[2,2400,328,-1,552,273]
[2,2400,329,-1,784,386]
[2,2400,330,-1,1087,682]
[2,2400,331,-1,1025,765]
[2,2400,333,-1,262,173]
[2,2400,334,-1,1096,849]
[2,2400,335,-1,2293,1655]
[2,2400,339,-1,420,217]
[2,2400,340,-1,162,108]
[2,2400,341,-1,2113,1943]
[2,2400,343,-1,1143,801]
[2,2400,344,-1,779,441]
[2,2400,345,-1,1097,878]
[2,2400,346,-1,4198,1767]
[2,2400,347,-1,200,153]
[2,2400,348,-1,461,337]
[2,2400,349,-1,2739,1903]
[2,2400,350,-1,435,233]
[2,2400,351,-1,711,347]
[2,2400,354,-1,528,398]
[2,2400,355,-1,221,85]
[2,2400,358,-1,86,43]
[2,2400,362,-1,1909,741]
[2,2400,372,-1,47,9]
[2,2400,373,-1,72,48]
[2,2400,376,-1,17358,961]
[2,2400,377,-1,955,517]
[2,2400,402,-1,704,599]
[2,2400,405,-1,27,17]
[2,2400,436,-1,151,106]
[2,2400,437,-1,132,93]
[2,2400,438,-1,120,88]
[2,2400,442,-1,67,43]
[2,2400,452,-1,208,128]
[2,2400,459,-1,227,105]
[2,2400,460,-1,45,30]
[2,2400,463,-1,110,58]
[2,2500,-1,-1,2665,694]
[2,2500,100,-1,8996,3227]
[2,2500,301,-1,29,11]
[2,2500,304,-1,18,4]
[2,2500,306,-1,66,16]
[2,2500,307,-1,50,10]
[2,2500,308,-1,20,7]
[2,2500,309,-1,23,5]
[2,2500,310,-1,898,382]
[2,2500,311,-1,53,16]
[2,2500,313,-1,37,11]
[2,2500,314,-1,100,23]
[2,2500,315,-1,68,50]
[2,2500,316,-1,107,32]
[2,2500,317,-1,265,79]
[2,2500,318,-1,173,45]
[2,2500,319,-1,68,19]
[2,2500,320,-1,95,22]
[2,2500,321,-1,58,11]
[2,2500,322,-1,111,30]
[2,2500,323,-1,42,12]
[2,2500,325,-1,112,31]
[2,2500,326,-1,48,15]
[2,2500,327,-1,32,12]
[2,2500,328,-1,100,26]
[2,2500,329,-1,101,22]
[2,2500,330,-1,746,236]
[2,2500,331,-1,79,27]
[2,2500,333,-1,36,9]
[2,2500,334,-1,25,7]
[2,2500,335,-1,724,257]
[2,2500,339,-1,61,20]
[2,2500,340,-1,27,3]
[2,2500,341,-1,153,137]
[2,2500,343,-1,110,24]
[2,2500,344,-1,77,20]
[2,2500,345,-1,146,101]
[2,2500,346,-1,91,25]
[2,2500,347,-1,11,2]
[2,2500,348,-1,70,18]
[2,2500,349,-1,435,306]
[2,2500,350,-1,47,13]
[2,2500,351,-1,91,29]
[2,2500,354,-1,38,11]
[2,2500,355,-1,28,5]
[2,2500,358,-1,24,12]
[2,2500,362,-1,121,37]
[2,2500,372,-1,1]
[2,2500,373,-1,12,1]
[2,2500,376,-1,1,1]
[2,2500,377,-1,64,18]
[2,2500,402,-1,311,293]
[2,2500,405,-1,3,1]
[2,2500,436,-1,15,4]
[2,2500,437,-1,19,6]
[2,2500,438,-1,15,4]
[2,2500,442,-1,6,1]
[2,2500,452,-1,36,7]
[2,2500,459,-1,18,4]
[2,2500,460,-1,8,2]
[2,2500,463,-1,8,1]
[2,2600,-1,-1,654,276]
[2,2600,100,-1,11216,10617]
[2,2600,301,-1,1]
[2,2600,304,-1,2,1]
[2,2600,306,-1,7]
[2,2600,309,-1,7,6]
[2,2600,313,-1,1,1]
[2,2600,314,-1,5,4]
[2,2600,315,-1,399,394]
[2,2600,316,-1,1,1]
[2,2600,317,-1,48,36]
[2,2600,318,-1,9,7]
[2,2600,319,-1,8,3]
[2,2600,320,-1,4,3]
[2,2600,321,-1,2,1]
[2,2600,322,-1,4,1]
[2,2600,323,-1,1]
[2,2600,325,-1,12,5]
[2,2600,326,-1,11,8]
[2,2600,327,-1,9,5]
[2,2600,328,-1,6,4]
[2,2600,329,-1,7,2]
[2,2600,331,-1,5,4]
[2,2600,333,-1,7,1]
[2,2600,334,-1,5,2]
[2,2600,339,-1,2,2]
[2,2600,340,-1,3,3]
[2,2600,341,-1,5290,5283]
[2,2600,343,-1,2]
[2,2600,344,-1,5,3]
[2,2600,345,-1,1568,1562]
[2,2600,346,-1,40,15]
[2,2600,347,-1,3,3]
[2,2600,348,-1,4,2]
[2,2600,349,-1,1912,1864]
[2,2600,350,-1,3]
[2,2600,351,-1,34,18]
[2,2600,354,-1,1,1]
[2,2600,355,-1,2,1]
[2,2600,358,-1,2,2]
[2,2600,362,-1,4,2]
[2,2600,373,-1,1]
[2,2600,377,-1,5,2]
[2,2600,402,-1,1091,1075]
[2,2600,405,-1,2,2]
[2,2600,436,-1,3,1]
[2,2600,437,-1,5,3]
[2,2600,438,-1,8,3]
[2,2600,442,-1,3,1]
[2,2600,452,-1,6,3]
[2,2600,460,-1,1,1]
[2,2600,463,-1,1]
[2,3100,-1,-1,12466,893]
[2,3100,100,-1,15647,1190]
[2,3100,310,-1,1025,79]
[2,3100,330,-1,995,124]
[2,3100,335,-1,1161,94]
[2,3200,-1,-1,2628,529]
[2,3200,100,-1,5863,1008]
[2,3200,310,-1,337,25]
[2,3200,330,-1,1511,222]
[2,3200,335,-1,1387,232]
[2,3300,-1,-1,4156,3]
[2,3300,100,-1,4830,596]
[2,3300,310,-1,154,154]
[2,3300,330,-1,233,187]
[2,3300,335,-1,287,252]
[2,3400,-1,-1,118,18]
[2,3400,100,-1,118,18]
[2,3600,100,-1,3420,2109]
[2,3600,310,-1,1928,1227]
[2,3600,330,-1,545,306]
[2,3600,335,-1,947,576]
[2,2100,35,-1,149890,42185]
[2,2100,384,-1,78488,21588]
[2,2100,393,-1,135124,37754]
[2,2100,394,-1,92184,28670]
[2,2100,395,-1,74208,22137]
[2,2200,35,-1,23607,5406]
[2,2200,384,-1,43222,10528]
[2,2200,393,-1,54577,8899]
[2,2200,394,-1,56690,14508]
[2,2200,395,-1,31773,5637]
[2,2300,35,-1,118,15]
[2,2300,384,-1,1033,29]
[2,2300,393,-1,1841,229]
[2,2300,394,-1,1284,46]
[2,2300,395,-1,912,42]
[2,2400,35,-1,48155,28639]
[2,2400,384,-1,10108,6343]
[2,2400,393,-1,13831,7224]
[2,2400,394,-1,27615,7221]
[2,2400,395,-1,12059,7549]
[2,2500,35,-1,2665,694]
[2,2500,384,-1,1584,687]
[2,2500,393,-1,1194,353]
[2,2500,394,-1,2716,1117]
[2,2500,395,-1,837,376]
[2,2600,35,-1,654,276]
[2,2600,384,-1,1989,1900]
[2,2600,393,-1,495,456]
[2,2600,394,-1,1154,1109]
[2,2600,395,-1,6924,6876]
[3,2100,100,10,48734,19548]
[3,2100,100,20,264970,69910]
[3,2100,100,40,92207,27390]
[3,2100,100,95,12,1]
[3,2100,100,110,88719,31584]
[3,2100,100,140,14090,3831]
[3,2100,100,320,1582,51]
[3,2100,100,410,44,14]
[3,2100,100,420,12,5]
[3,2200,100,"130G",48868,2373]
[3,2200,100,133,3,1]
[3,2200,100,135,312,35]
[3,2200,100,"290G",53354,8666]
[3,2200,100,"310G",7278,1913]
[3,2200,100,450,11,7]
[3,2200,100,"600G",100043,31983]
[3,2300,100,330,2970,95]
[3,2300,100,"680G",15,15]
[3,2300,100,684,2,1]
[3,2300,100,685,245,184]
[3,2300,100,690,4]
[3,2300,100,"690G",1952,66]
[3,2400,100,293,1]
[3,2400,100,335,14355,12994]
[3,2400,100,"400G",15243,3774]
[3,2400,100,409,22]
[3,2400,100,"500G",477,29]
[3,2400,100,510,37476,2669]
[3,2400,100,681,1204,928]
[3,2400,100,687,1885,1881]
[3,2400,100,688,26436,25946]
[3,2400,100,"930G",14147,8611]
[3,2400,100,"960G",522,144]
[3,2500,100,"160G",8996,3227]
[3,2600,100,165,11216,10617]
[3,3100,100,120,4232,309]
[3,3100,100,180,7107,567]
[3,3100,100,190,4308,314]
[3,3200,100,135,138,13]
[3,3200,100,137,6,3]
[3,3200,100,"150G",5701,986]
[3,3200,100,297,9,6]
[3,3200,100,607,9]
[3,3300,100,154,4165,2]
[3,3300,100,696,665,594]
[3,3400,100,407,117,17]
[3,3400,100,937,1,1]
[3,3600,100,165,3420,2109]
[3.1,2100,100,40,111731,27390]
[12,9000,100,1,10175,39,18.322063882063883]
[12,9000,100,1.1000000000000001,9998,32,18.129425885177035]
[12,9000,100,1.2,177,7,29.203389830508474]
[12,9000,100,2,15034,4361,119.64799787149128]
[12,9000,100,2.1,14786,4290,119.45644528608143]
[12,9000,100,2.2000000000000002,248,71,131.06854838709677]
[12,9000,100,3,4490,1451,139.08975501113585]
[12,9000,100,3.1,4389,1427,139.75620870357713]
[12,9000,100,3.2,101,24,110.12871287128714]
[12,9000,100,4,543,53,53.02209944751381]
[12,9000,100,4.0999999999999996,525,50,52.695238095238096]
[12,9000,100,4.2,18,3,62.555555555555557]
[11,2100,100,10,17769,1701]
[11,2100,100,20,738,126]
[11,2100,100,110,3186,249]
[11,2200,100,"130G",28,1]
[11,2200,100,"290G",22,4]
[11,2300,100,330,1766,3]
[11,2400,100,"400G",86,1]
[11,2400,100,"930G",2]
[4,0,-1,-1,175591,65581,149.85,42528,347766,173.18,145.27000000000001,6172,94431,72693,1730,563]
[4,0,100,-1,592345,196852,143.19,142986,1105676,166.97,138.44,20257,341782,223861,4938,1504]
[4,0,301,-1,3238,994,131.75,836,5695,159.30000000000001,123.62,108,2075,1019,30,6]
[4,0,304,-1,2472,677,121.28,1898,14438,58.06,46.3,75,1392,875,59,71]
[4,0,306,-1,5765,1852,134.63,1373,9539,166.21,140.37,210,3678,1821,43,13]
[4,0,307,-1,3909,1245,136.33000000000001,966,7033,183.53,148.30000000000001,114,2407,1354,24,10]
[4,0,308,-1,2213,742,145.96,520,3781,168.68,141.07,64,1431,690,22,6]
[4,0,309,-1,3652,1119,134.59,823,6258,168.12,138.34,145,2317,1163,24,3]
[4,0,310,-1,11091,3793,152.72,2516,17968,162.1,140.85,582,6834,3546,107,22]
[4,0,311,-1,6621,2418,145.81,1297,10826,177.32,139.5,218,4153,2197,39,14]
[4,0,313,-1,7491,2016,120.05,1808,13522,148.87,122.54,246,4336,2838,53,18]
[4,0,314,-1,18198,5654,136.63,4118,31540,172.4,137.1,486,10020,7510,141,41]
[4,0,315,-1,2880,1182,175.25,675,4664,194.46,155.43,78,1623,1145,29,5]
[4,0,316,-1,19622,5267,123.48,4516,35465,158.76,133.65,614,11482,7380,108,37]
[4,0,317,-1,33751,11009,147.52000000000001,7698,57254,179.19,151.77000000000001,1093,19355,12985,236,82]
[4,0,318,-1,18466,5007,123.06,4453,36519,151.88999999999999,124.37,618,10864,6797,141,46]
[4,0,319,-1,10115,2790,123.52,2534,18816,150.25,126.95,354,5769,3902,77,13]
[4,0,320,-1,9966,2938,133.34,2492,18322,165.49,131.47999999999999,342,6060,3482,64,18]
[4,0,321,-1,6624,1756,116.03,1564,11409,155.58000000000001,126.43,232,3977,2355,47,13]
[4,0,322,-1,8551,2303,123.94,1999,15301,165.05,136.19999999999999,372,4950,3122,75,32]
[4,0,323,-1,5004,1429,129.83000000000001,1215,8544,179.9,149.11000000000001,191,3086,1665,48,14]
[4,0,325,-1,11774,4145,163.41,2675,19924,202.54,167.23,426,7151,4088,88,21]
[4,0,326,-1,6466,2004,134.77000000000001,1542,11291,177.9,137.66999999999999,249,4026,2137,43,11]
[4,0,327,-1,5122,1596,135.41,1225,8856,172.36,133.08000000000001,171,3130,1771,37,13]
[4,0,328,-1,8879,2829,131.97999999999999,1959,14678,166.58,131.94999999999999,333,5247,3211,69,19]
[4,0,329,-1,7636,2392,137.63999999999999,1729,13050,169.63,136.82,305,4804,2453,57,17]
[4,0,330,-1,8100,2752,166.05,1956,15466,173.61,151.9,458,5119,2408,94,21]
[4,0,331,-1,7845,2727,145.97,1770,13129,190.13,149.77000000000001,273,4667,2845,46,14]
[4,0,333,-1,2989,960,132.9,624,4801,163.26,138.97,102,1921,938,22,6]
[4,0,334,-1,3541,1492,170.99,769,5587,189.32,155.94999999999999,83,1857,1569,27,5]
[4,0,335,-1,9349,3470,175.84,2220,17289,177.18,151.62,574,5649,2999,107,20]
[4,0,339,-1,8043,2169,119.37,1850,14522,147.86000000000001,121.13,256,4617,3116,43,11]
[4,0,340,-1,2694,871,145.05000000000001,617,4648,175.56,156.27000000000001,100,1768,806,17,3]
[4,0,341,-1,4951,2691,222.79,1012,7059,223.11,186.3,105,2217,2530,90,9]
[4,0,343,-1,11843,3877,140.51,2759,19813,163.03,134.18,368,7308,4062,86,19]
[4,0,344,-1,10917,3211,123.75,2545,18743,152.66999999999999,118.49,396,6445,3986,69,21]
[4,0,345,-1,8528,2867,144.49,1983,14565,162.85,139.37,319,5089,3042,67,11]
[4,0,346,-1,12540,4281,167.56,5145,39932,122.07,102.23,299,7206,4901,116,18]
[4,0,347,-1,2422,880,151.32,539,4174,180.43,136.38999999999999,80,1502,820,16,4]
[4,0,348,-1,4639,1634,155.52000000000001,1050,7677,185.31,157.55000000000001,141,2877,1579,31,11]
[4,0,349,-1,24503,7832,141.75,5715,43219,167.02,140.1,677,14377,9227,171,51]
[4,0,350,-1,4452,1432,143.54,1022,7973,169.68,139.96,185,2705,1522,29,11]
[4,0,351,-1,7261,1934,128.69999999999999,1855,13343,169.74,136.88999999999999,208,4229,2759,47,18]
[4,0,354,-1,5580,1799,137.56,1213,8774,171.52,136.51,227,3192,2103,48,10]
[4,0,355,-1,2341,672,127.31,641,4783,133.06,133.62,183,1792,326,30,10]
[4,0,358,-1,457,184,169.11,133,844,172.65,141.86000000000001,18,341,95,1,2]
[4,0,362,-1,22051,5899,128.33000000000001,5171,39577,156.19,132.72999999999999,656,12618,8552,168,57]
[4,0,372,-1,232,59,125.06,54,557,190.11,127.65,5,115,108,2,2]
[4,0,373,-1,1232,396,132.22999999999999,274,1982,175.83,137.27000000000001,39,796,389,6,2]
[4,0,376,-1,248,247,389.44,52,688,373.92,238.29,null,92,155,1]
[4,0,377,-1,12834,3756,140.13,3189,25360,173.23,134,269,7542,4908,92,23]
[4,0,402,-1,2269,1104,191.25,423,3056,183.75,156.75,58,1240,952,15,4]
[4,0,405,-1,431,143,145.36000000000001,87,717,187.83,146.01,9,281,136,5]
[4,0,436,-1,1834,616,137.80000000000001,441,2843,194.22,161.59,47,1160,617,5,5]
[4,0,437,-1,1341,416,136.72999999999999,252,2201,175.9,130.25,40,882,407,9,3]
[4,0,438,-1,1635,543,143.6,330,2698,191.69,153.72,38,1031,552,12,2]
[4,0,442,-1,1043,339,144.1,208,1671,195.07,160.65,18,699,316,9,1]
[4,0,452,-1,3169,1032,137.53,764,5806,174.22,136.66,92,1936,1099,37,5]
[4,0,459,-1,3454,1066,127.96,796,5730,164.06,135.72,81,2307,1040,14,12]
[4,0,460,-1,1029,285,112.95,233,1710,134.37,117.24,30,600,386,10,3]
[4,0,463,-1,1451,478,150.63999999999999,335,2280,166.38,153.47,25,1007,412,5,2]
[4,11,-1,-1,169771,64376,151.94999999999999,40877,332252,176.37,148.76,4799,90879,72029,1547,515]
[4,11,301,-1,3077,969,134.69,794,5356,163.80000000000001,127.89,64,1983,1001,23,6]
[4,11,304,-1,2385,655,122.33,1878,14247,58,46.14,53,1339,866,57,70]
[4,11,306,-1,5475,1808,137.37,1297,8881,171.7,146.51,124,3505,1798,35,13]
[4,11,307,-1,3713,1216,139.21,894,6462,193.21,157.44,60,2299,1331,13,10]
[4,11,308,-1,2083,720,150.24,491,3480,174.43,147.76,29,1355,681,14,4]
[4,11,309,-1,3463,1090,137.78,763,5802,176.93,145.33000000000001,82,2212,1146,20,3]
[4,11,310,-1,10391,3729,158.44999999999999,2330,16427,167.81,147.33000000000001,281,6473,3536,83,18]
[4,11,311,-1,6043,2276,150.08000000000001,1120,9170,190.14,149.30000000000001,126,3745,2136,25,11]
[4,11,313,-1,7142,1952,121.54,1683,12462,154.33000000000001,127,163,4121,2796,45,17]
[4,11,314,-1,17568,5550,138.66999999999999,3855,29146,179.84,143.81,325,9646,7431,130,36]
[4,11,315,-1,2749,1166,179.99,632,4339,203.98,162.36000000000001,41,1548,1132,23,5]
[4,11,316,-1,18843,5147,125.32,4258,33113,164.23,138.85,367,11065,7285,92,33]
[4,11,317,-1,32358,10789,150.49,7245,53410,186.03,158.66,678,18586,12826,194,74]
[4,11,318,-1,17643,4862,125.05,4117,33409,159.68,131.16,429,10394,6666,115,39]
[4,11,319,-1,9631,2712,125.61,2368,17269,156.21,133.16999999999999,216,5504,3837,61,13]
[4,11,320,-1,9482,2853,136.19999999999999,2341,16960,171.35,137.51,204,5787,3430,48,13]
[4,11,321,-1,6256,1694,118.4,1451,10457,160.97,132,129,3757,2320,38,12]
[4,11,322,-1,8058,2235,126.72,1857,14128,171.14,141.6,219,4693,3057,62,27]
[4,11,323,-1,4755,1385,132.6,1125,7968,188.16,154.49,118,2950,1638,38,11]
[4,11,325,-1,11186,4063,168.16,2507,18659,211.08,175.01,234,6829,4043,60,20]
[4,11,326,-1,6158,1951,137.38999999999999,1449,10509,184.4,143.66999999999999,163,3848,2110,28,9]
[4,11,327,-1,4842,1541,138.66999999999999,1141,8032,179.35,141.44999999999999,87,2977,1741,26,11]
[4,11,328,-1,8428,2744,134.82,1823,13628,173.56,137.88,196,5002,3160,57,13]
[4,11,329,-1,7162,2306,141.33000000000001,1596,12018,178.1,143.75,170,4526,2409,45,12]
[4,11,330,-1,6527,2340,175.38,1512,11829,187.98,166.83,196,4036,2232,49,14]
[4,11,331,-1,7417,2647,149.72999999999999,1630,11953,200.13,158.66999999999999,150,4432,2790,34,11]
[4,11,333,-1,2806,930,136.57,574,4405,171.65,146.75,56,1807,920,19,4]
[4,11,334,-1,3448,1473,173.49,722,5165,197.86,163.54,57,1804,1555,27,5]
[4,11,335,-1,7504,3037,189.92,1734,13678,186.86,162.41,177,4505,2751,58,13]
[4,11,339,-1,7727,2111,120.83,1714,13264,154.72999999999999,128.1,175,4425,3081,36,10]
[4,11,340,-1,2551,849,148.94999999999999,568,4271,186.32,164.53,62,1682,792,15]
[4,11,341,-1,4810,2674,226.54,966,6632,230.29,194.18,67,2136,2516,84,7]
[4,11,343,-1,11245,3781,143.63999999999999,2573,18294,170.14,139.72,205,6955,4005,68,12]
[4,11,344,-1,10364,3110,125.92,2379,17361,158.58000000000001,123.47,224,6143,3927,53,17]
[4,11,345,-1,8095,2808,148.47999999999999,1823,13477,170.9,144.87,187,4845,3003,53,7]
[4,11,346,-1,12156,4210,170.16,4993,38676,122.4,103.48,217,6953,4856,113,17]
[4,11,347,-1,2321,866,154.1,492,3766,192.14,146.13999999999999,57,1441,807,12,4]
[4,11,348,-1,4407,1587,159.29,992,7128,192.84,165.48,79,2740,1554,24,10]
[4,11,349,-1,23509,7672,144.43,5323,39957,174.27,146.77000000000001,405,13816,9099,143,46]
[4,11,350,-1,4215,1392,147.21,956,7293,175.32,147.79,111,2580,1494,20,10]
[4,11,351,-1,6903,1866,131.09,1699,12019,179.83,146.02000000000001,128,4014,2706,40,15]
[4,11,354,-1,5336,1757,140.5,1120,8052,180.55,143.74,170,3059,2064,33,10]
[4,11,355,-1,2114,644,133.38999999999999,597,4440,137.37,139.13999999999999,90,1692,311,20,1]
[4,11,358,-1,411,165,174.09,126,771,178.71,148.49,14,308,87,null,2]
[4,11,362,-1,21288,5751,130.02000000000001,4915,37205,160.99,137.59,442,12209,8448,142,47]
[4,11,372,-1,223,54,114.7,54,505,190.11,129.22,5,107,107,2,2]
[4,11,373,-1,1176,391,135.32,259,1830,177.99,142.93,23,762,385,5,1]
[4,11,376,-1,240,239,389.1,48,656,373.33,238.08,null,88,151,1]
[4,11,377,-1,12280,3667,142.74,2921,22909,183.96,142.26,190,7168,4822,78,22]
[4,11,402,-1,2188,1086,194.32,394,2821,193.98,165.29,33,1195,942,14,4]
[4,11,405,-1,407,139,148.44999999999999,84,662,192.7,154.61000000000001,4,268,131,4]
[4,11,436,-1,1769,604,139.5,419,2646,198.58,169.66,34,1119,606,5,5]
[4,11,437,-1,1291,404,138.6,239,2040,181.57,135.83000000000001,31,848,401,8,3]
[4,11,438,-1,1591,539,145.79,314,2530,199.15,160.41999999999999,25,1005,548,11,2]
[4,11,442,-1,1014,332,144.66999999999999,196,1573,200.78,167.23,11,683,312,7,1]
[4,11,452,-1,3004,1010,140.85,712,5257,182.73,145.81,56,1824,1087,34,3]
[4,11,459,-1,3328,1032,129.24,741,5143,170.55,144.97,58,2224,1021,13,12]
[4,11,460,-1,976,277,114.89,217,1581,138.81,122.99,18,569,378,9,2]
[4,11,463,-1,1407,473,153.1,317,2146,172.68,159.51,21,976,403,5,2]
[4,11,100,-1,564710,191706,145.91999999999999,134215,1029519,172.53,143.80000000000001,13135,325441,220697,4118,1316]
[4,12,-1,-1,19979,3329,77.62,5299,41598,79.42,57.27,6160,10925,2117,632,145]
[4,12,310,-1,652,52,63.39,158,1261,85.07,70.84,301,319,4,24,4]
[4,12,330,-1,1559,405,126.49,432,3529,123.51,102.04,262,1069,176,45,7]
[4,12,335,-1,1834,427,118.08,483,3537,142.63999999999999,110.14,397,1136,246,48,7]
[4,12,100,-1,24024,4213,83.5,6372,49925,87.35,64.52,7120,13449,2543,749,163]
[4,13,-1,-1,589,171,105.43,375,5660,59.93,58.9,1,483,84,15,6]
[4,13,301,-1,12,3,88.08,5,61,109.2,92.3,null,6,5,1]
[4,13,304,-1,14,6,101.36,5,38,77.599999999999994,100.45,null,12,2]
[4,13,306,-1,41,15,161.83000000000001,18,145,73.83,82.95,null,38,2,1]
[4,13,307,-1,20,3,107.7,9,101,38.67,66.959999999999994,null,15,5]
[4,13,308,-1,22,5,124.41,7,99,72.709999999999994,82.35,null,20,1,1]
[4,13,309,-1,17,6,172.06,7,65,56.14,98.17,null,16,1]
[4,13,310,-1,48,12,125.42,27,279,114.52,75.48,null,42,6]
[4,13,311,-1,303,106,130.27000000000001,103,1154,112,100.23,null,256,43,2,2]
[4,13,313,-1,100,22,108.33,61,630,80.98,84.48,null,84,15,1]
[4,13,314,-1,174,36,103.42,149,1407,57.65,60.16,null,146,26,1,1]
[4,13,315,-1,13,3,95.54,5,49,24.8,124.04,null,11,2]
[4,13,316,-1,126,28,120.75,103,994,53.67,76.91,null,94,29,2,1]
[4,13,317,-1,152,34,113.82,113,1044,55.89,69.83,null,118,30,3,1]
[4,13,318,-1,195,40,97.38,173,1686,43.32,53.81,null,151,40,3,1]
[4,13,319,-1,60,12,112.55,54,622,47.26,63.96,null,43,15,2]
[4,13,320,-1,48,9,84.25,39,393,74.180000000000007,60.31,null,35,7,5,1]
[4,13,321,-1,64,13,92.41,32,336,108.69,77.900000000000006,null,52,9,3]
[4,13,322,-1,39,12,181.97,24,243,78.5,98.75,1,25,13]
[4,13,323,-1,23,6,100.3,23,128,90.39,145.63,null,15,8]
[4,13,325,-1,26,8,182.88,14,143,96.79,89.7,null,23,3]
[4,13,326,-1,20,9,161.19999999999999,15,126,117.27,116.08,null,16,4]
[4,13,327,-1,38,13,113.74,27,266,60.52,58.8,null,30,5,2,1]
[4,13,328,-1,34,7,95.38,19,161,85.32,85.79,null,27,6,null,1]
[4,13,329,-1,24,11,181.29,6,82,50.5,107.73,null,19,4,null,1]
[4,13,330,-1,14,7,220.86,12,108,166.08,146.52000000000001,null,14]
[4,13,331,-1,57,15,110.68,37,378,101.35,78.599999999999994,null,43,13,null,1]
[4,13,333,-1,11,2,76.180000000000007,5,56,77.599999999999994,94.79,null,10,1]
[4,13,334,-1,15,3,90.4,22,218,45.64,70.260000000000005,null,10,5]
[4,13,335,-1,11,6,201.09,3,74,145.66999999999999,140,null,8,2,1]
[4,13,339,-1,76,15,107.42,62,728,69.13,50.16,null,58,15,3]
[4,13,340,-1,13,4,129.46,15,121,22.2,68.489999999999995,null,11,2]
[4,13,341,-1,23,4,100.57,11,143,17.36,62.43,null,17,5,1]
[4,13,343,-1,85,31,155.53,41,477,55.93,112.63,null,69,13,2,1]
[4,13,344,-1,90,36,172.92,53,525,65.91,64.61,null,70,19,1]
[4,13,345,-1,49,6,83.29,23,192,59.48,125.22,null,47,1,null,1]
[4,13,346,-1,95,26,108.03,69,642,151.06,79.819999999999993,null,82,13]
[4,13,347,-1,33,7,118.45,24,209,33.83,48.91,null,26,6,1]
[4,13,348,-1,17,6,147.29,2,55,43,126.93,null,15,2]
[4,13,349,-1,158,32,95.68,134,1402,54.34,61.17,null,124,28,5,1]
[4,13,350,-1,22,5,106.05,6,105,79.17,88.01,null,17,4,null,1]
[4,13,351,-1,55,14,113.22,60,575,54.07,61.19,null,42,9,3,1]
[4,13,354,-1,32,null,42.19,29,274,33,53,null,21,9,2]
[4,13,355,-1,12,2,69.75,4,39,84,111.13,null,10,2]
[4,13,358,-1,3,1,144.33000000000001,3,25,29.67,71,null,3]
[4,13,362,-1,116,29,113.49,82,990,63.01,63.48,null,87,24,2,3]
[4,13,372,-1,9,5,381.67,null,51,null,114.41,null,8,1]
[4,13,373,-1,3,1,195,1,25,274,95.64,null,2,1]
[4,13,376,-1,null,null,null,null,3,null,17]
[4,13,377,-1,257,48,90.14,202,1888,58.87,59.05,null,201,51,5]
[4,13,402,-1,13,6,211.15,3,44,49.33,122.05,null,10,2,1]
[4,13,405,-1,1,1,204,null,11,null,57.27,null,1]
[4,13,436,-1,10,4,116,7,56,239,97.3,null,7,3]
[4,13,437,-1,7,2,61.71,2,42,279.5,87.98,null,5,2]
[4,13,438,-1,8,null,59.25,4,58,8.5,79.47,null,7,1]
[4,13,442,-1,7,4,328.14,1,26,8,63.27,null,3,3,1]
[4,13,452,-1,28,2,63.36,17,230,28.76,50.34,null,24,3,1]
[4,13,459,-1,50,18,115.8,32,426,97.59,55.56,null,41,9]
[4,13,460,-1,6,null,72,4,26,43,57.23,null,6]
[4,13,463,-1,21,1,51.05,15,94,56.53,64.8,null,16,5]
[4,13,100,-1,3609,933,113.78,2398,26228,67.05,68.739999999999995,2,2892,619,71,25]
[4,14,-1,-1,null,null,null,1,3,306,203.33]
[4,14,318,-1,1,null,57,null,null,null,null,null,null,1]
[4,14,377,-1,1,null,17,null,1,null,247,null,null,1]
[4,14,100,-1,2,null,37,1,4,306,214.25,null,null,2]
[4,0,384,-1,86759,26702,139.47999999999999,20199,153557,166.26,138.56,2791,50976,32151,657,184]
[4,0,35,-1,175591,65581,149.85,42528,347766,173.18,145.27000000000001,6172,94431,72693,1730,563]
[4,0,395,-1,82310,27595,148.63,21316,159599,158.80000000000001,129.41999999999999,2428,48801,30284,652,145]
[4,0,393,-1,145092,43035,133.38,34152,259446,165.99,137.03,4919,84813,53962,1062,335]
[4,0,394,-1,102593,33939,144.44,24791,185308,165.26,135.27000000000001,3947,62761,34771,837,277]
[4,11,395,-1,78711,26979,151.69,20011,148626,164.66,134.52000000000001,1551,46630,29857,551,122]
[4,13,384,-1,502,113,106.01,399,4455,61.58,62.46,null,385,96,16,5]
[4,13,393,-1,966,213,108.02,752,7312,57.69,67.33,1,747,190,21,7]
[4,11,394,-1,95860,32652,148.06,22823,168938,171.9,141.4,2174,58694,34129,623,240]
[4,11,35,-1,169771,64376,151.94999999999999,40877,332252,176.37,148.76,4799,90879,72029,1547,515]
[4,13,394,-1,784,248,134.72999999999999,353,3730,97.61,92.26,null,658,114,7,5]
[4,13,35,-1,589,171,105.43,375,5660,59.93,58.9,1,483,84,15,6]
[4,11,393,-1,138514,41970,135.97999999999999,31943,239964,172.65,143.46,3014,81179,53168,867,285]
[4,11,384,-1,81854,25729,142.15,18561,139739,173.14,145.35,1597,48059,31514,530,154]
[4,13,395,-1,768,188,111.13,519,5071,69.19,69.98,null,619,135,12,2]
[5,0,-1,-1,891,99,62.4,null,null,null,null,474,358,34,22,3]
[5,0,100,-1,592345,196852,143.19,142986,1105676,166.97,138.44,20257,341782,223861,4938,1504]
[5,0,101,-1,1434,38,16.14,4,34,31.5,70.180000000000007,1363,39,16,14,2]
[5,0,301,-1,579,179,122.79,1196,10071,150.18,127.54,80,210,269,19,1]
[5,0,304,-1,976,160,75.3,3114,24649,90.48,77.099999999999994,120,317,400,66,73]
[5,0,306,-1,627,230,142.9,1070,11559,185.53,142.28,122,269,176,54,6]
[5,0,307,-1,787,216,122.2,1112,9486,196.65,148.88999999999999,99,301,378,6,3]
[5,0,308,-1,519,216,161.93,1030,8499,183.22,148.9,36,240,199,40,4]
[5,0,309,-1,330,77,114.07,1086,8047,160.99,154.21,53,150,124,3]
[5,0,310,-1,4526,1772,146.06,5692,40758,182.76,131.63999999999999,372,2619,1246,210,79]
[5,0,311,-1,987,315,138.94,1524,12466,164.67,153.22,146,472,337,7,25]
[5,0,313,-1,485,119,98.6,875,7322,152.59,137.58000000000001,111,180,153,25,16]
[5,0,314,-1,1910,1003,193.67,2376,15318,283.98,251.25,250,770,794,62,34]
[5,0,315,-1,846,392,194.56,1525,10658,241.07,184.95,72,354,352,62,6]
[5,0,316,-1,3248,1330,160.78,5521,48299,177.43,136.88,282,1525,1349,48,44]
[5,0,317,-1,5678,2722,190.6,8036,53565,213.54,199.14,686,2338,2345,196,111]
[5,0,318,-1,3601,711,97.29,9354,71230,109.83,99.31,390,1361,1519,269,62]
[5,0,319,-1,2086,643,127.71,3979,31146,157.43,129.61000000000001,186,1086,689,103,22]
[5,0,320,-1,1521,455,119.91,3156,26225,144.37,111.17,170,684,640,13,14]
[5,0,321,-1,974,253,111.11,1659,13993,167.59,129.94999999999999,140,373,368,78,15]
[5,0,322,-1,1171,333,117.16,2005,16843,156.26,116.68,160,448,469,59,35]
[5,0,323,-1,956,338,124.63,1800,15052,151.75,131.05000000000001,119,525,276,32,4]
[5,0,325,-1,1902,752,160.63,2954,19003,230.27,212.6,260,812,685,79,65]
[5,0,326,-1,1096,332,129.72999999999999,1609,15146,170.52,133.11000000000001,149,476,443,18,10]

{"sheet":"DT","index":5,"n_rows":2,"n_cols":1,"rows_kept":2,"cut":false,"hidden":true,"merged":[]}
["ST_DATE"]
["2022-05-28"]

{"sheet":"Rating Bundle - SOO","index":6,"n_rows":35,"n_cols":15,"rows_kept":35,"cut":false,"hidden":false,"merged":[[1,3,1,10],[1,11,1,16],[2,3,2,10],[2,11,2,16],[8,3,10,3],[8,4,10,4],[8,5,10,5],[8,6,10,6],[8,7,10,7],[8,8,10,8],[8,9,10,9],[8,10,10,10],[8,11,10,16],[7,3,7,10],[7,11,7,16],[6,11,6,16]]}
[]
[null,null,"DISTRICT SELECTOR","Compensation and Pension Rating Bundle Metrics",null,null,null,null,null,null,null,"Report through"]
[null,null,null,"Station of Origin View",null,null,null,null,null,null,null,{"$f":"D_DT[]","v":"2022-05-28"}]
[null,null,null,"The Station of Origination (SOO) primarily represents pending claims based on geographic boundaries",null,null,null,null,null,null,null,"ADP = Average Days Pending",null,null,"MTD = Month to Date"]
[null,null,null,"Each Special Mission has distinct claim counts",null,null,null,null,null,null,null,"ADC = Average Days to Complete",null,null,"FYTD = Fiscal Year to Date"]
[null,null,null,"When Special Mission is set to Pension, BDD, or Quickstart, the District Selector has no impact."]
[null,null,null,null,null,null,null,null,null,null,null,"Accuracy metrics are available on Rating Bundle - SOJ tab"]
[null,null,null,"CLAIM METRICS",null,null,null,null,null,null,null,"ACCURACY METRICS"]
[null,null,"SPECIAL MISSION SELECTOR","#\nPending","#\nPending\n> 125 Days","%\nPending\n> 125 Days","ADP","#\nCompleted\nMTD","ADC\nMTD","#\nCompleted\nFYTD","ADC\nFYTD","Accuracy measurement is available on the Rating Bundle SOJ tab"]
[]
[]
[100,null,{"$f":"Driver!$C$20& \" Total\"","v":"USA - All Missions Total"},{"$f":"IF(ISNA($A12),\"\",IFERROR(SUMIFS(D_D[INV],D_D[MT],4,D_D[CAT],SMS,D_D[LOC],$A12),0))","v":592345},{"$f":"IF(ISNA($A12),\"\",IFERROR(SUMIFS(D_D[BL],D_D[MT],4,D_D[CAT],SMS,D_D[LOC],$A12),0))","v":196852},{"$f":"IF(ISNA($A12),\"\",IFERROR(E12/D12,0))","v":0.33232660020764926},{"$f":"IF(ISNA($A12),\"\",IFERROR(SUMIFS(D_D[ADP],D_D[MT],4,D_D[CAT],SMS,D_D[LOC],$A12),0))","v":143.19},{"$f":"IF(ISNA($A12),\"\",IFERROR(SUMIFS(D_D[PROD_MTD],D_D[MT],4,D_D[CAT],SMS,D_D[LOC],$A12),0))","v":142986},{"$f":"IF(ISNA($A12),\"\",IFERROR(SUMIFS(D_D[ADCM],D_D[MT],4,D_D[CAT],SMS,D_D[LOC],$A12),0))","v":166.97},{"$f":"IF(ISNA($A12),\"\",IFERROR(SUMIFS(D_D[PROD_FYTD],D_D[MT],4,D_D[CAT],SMS,D_D[LOC],$A12),0))","v":1105676},{"$f":"IF(ISNA($A12),\"\",IFERROR(SUMIFS(D_D[ADCF],D_D[MT],4,D_D[CAT],SMS,D_D[LOC],$A12),0))","v":138.44}]
[{"$f":"INDEX(RO,(MATCH($C13,RO_D,0)))","v":"395"},1,{"$f":"IFERROR(INDEX(INDIRECT(DS_RO),B13),\"\")","v":"Pacific District"},{"$f":"IF(ISNA($A13),\"\",IFERROR(SUMIFS(D_D[INV],D_D[MT],4,D_D[CAT],SMS,D_D[LOC],$A13),0))","v":82310},{"$f":"IF(ISNA($A13),\"\",IFERROR(SUMIFS(D_D[BL],D_D[MT],4,D_D[CAT],SMS,D_D[LOC],$A13),0))","v":27595},{"$f":"IF(ISNA($A13),\"\",IFERROR(E13/D13,0))","v":0.33525695541246509},{"$f":"IF(ISNA($A13),\"\",IFERROR(SUMIFS(D_D[ADP],D_D[MT],4,D_D[CAT],SMS,D_D[LOC],$A13),0))","v":148.63},{"$f":"IF(ISNA($A13),\"\",IFERROR(SUMIFS(D_D[PROD_MTD],D_D[MT],4,D_D[CAT],SMS,D_D[LOC],$A13),0))","v":21316},{"$f":"IF(ISNA($A13),\"\",IFERROR(SUMIFS(D_D[ADCM],D_D[MT],4,D_D[CAT],SMS,D_D[LOC],$A13),0))","v":158.80000000000001},{"$f":"IF(ISNA($A13),\"\",IFERROR(SUMIFS(D_D[PROD_FYTD],D_D[MT],4,D_D[CAT],SMS,D_D[LOC],$A13),0))","v":159599},{"$f":"IF(ISNA($A13),\"\",IFERROR(SUMIFS(D_D[ADCF],D_D[MT],4,D_D[CAT],SMS,D_D[LOC],$A13),0))","v":129.41999999999999}]
["340",2,"Albuquerque",{"$f":"IF(ISNA($A14),\"\",IFERROR(SUMIFS(D_D[INV],D_D[MT],4,D_D[CAT],SMS,D_D[LOC],$A14),0))","v":2694},{"$f":"IF(ISNA($A14),\"\",IFERROR(SUMIFS(D_D[BL],D_D[MT],4,D_D[CAT],SMS,D_D[LOC],$A14),0))","v":871},{"$f":"IF(ISNA($A14),\"\",IFERROR(E14/D14,0))","v":0.32331106161841128},{"$f":"IF(ISNA($A14),\"\",IFERROR(SUMIFS(D_D[ADP],D_D[MT],4,D_D[CAT],SMS,D_D[LOC],$A14),0))","v":145.05000000000001},{"$f":"IF(ISNA($A14),\"\",IFERROR(SUMIFS(D_D[PROD_MTD],D_D[MT],4,D_D[CAT],SMS,D_D[LOC],$A14),0))","v":617},{"$f":"IF(ISNA($A14),\"\",IFERROR(SUMIFS(D_D[ADCM],D_D[MT],4,D_D[CAT],SMS,D_D[LOC],$A14),0))","v":175.56},{"$f":"IF(ISNA($A14),\"\",IFERROR(SUMIFS(D_D[PROD_FYTD],D_D[MT],4,D_D[CAT],SMS,D_D[LOC],$A14),0))","v":4648},{"$f":"IF(ISNA($A14),\"\",IFERROR(SUMIFS(D_D[ADCF],D_D[MT],4,D_D[CAT],SMS,D_D[LOC],$A14),0))","v":156.27000000000001}]
["463",3,{"$f":"IFERROR(INDEX(INDIRECT(DS_RO),B15),\"\")","v":"Anchorage"},{"$f":"IF(ISNA($A15),\"\",IFERROR(SUMIFS(D_D[INV],D_D[MT],4,D_D[CAT],SMS,D_D[LOC],$A15),0))","v":1451},{"$f":"IF(ISNA($A15),\"\",IFERROR(SUMIFS(D_D[BL],D_D[MT],4,D_D[CAT],SMS,D_D[LOC],$A15),0))","v":478},{"$f":"IF(ISNA($A15),\"\",IFERROR(E15/D15,0))","v":0.32942798070296347},{"$f":"IF(ISNA($A15),\"\",IFERROR(SUMIFS(D_D[ADP],D_D[MT],4,D_D[CAT],SMS,D_D[LOC],$A15),0))","v":150.63999999999999},{"$f":"IF(ISNA($A15),\"\",IFERROR(SUMIFS(D_D[PROD_MTD],D_D[MT],4,D_D[CAT],SMS,D_D[LOC],$A15),0))","v":335},{"$f":"IF(ISNA($A15),\"\",IFERROR(SUMIFS(D_D[ADCM],D_D[MT],4,D_D[CAT],SMS,D_D[LOC],$A15),0))","v":166.38},{"$f":"IF(ISNA($A15),\"\",IFERROR(SUMIFS(D_D[PROD_FYTD],D_D[MT],4,D_D[CAT],SMS,D_D[LOC],$A15),0))","v":2280},{"$f":"IF(ISNA($A15),\"\",IFERROR(SUMIFS(D_D[ADCF],D_D[MT],4,D_D[CAT],SMS,D_D[LOC],$A15),0))","v":153.47}]
["347",4,"Boise",{"$f":"IF(ISNA($A16),\"\",IFERROR(SUMIFS(D_D[INV],D_D[MT],4,D_D[CAT],SMS,D_D[LOC],$A16),0))","v":2422},{"$f":"IF(ISNA($A16),\"\",IFERROR(SUMIFS(D_D[BL],D_D[MT],4,D_D[CAT],SMS,D_D[LOC],$A16),0))","v":880},0.3633360858794385,{"$f":"IF(ISNA($A16),\"\",IFERROR(SUMIFS(D_D[ADP],D_D[MT],4,D_D[CAT],SMS,D_D[LOC],$A16),0))","v":151.32},{"$f":"IF(ISNA($A16),\"\",IFERROR(SUMIFS(D_D[PROD_MTD],D_D[MT],4,D_D[CAT],SMS,D_D[LOC],$A16),0))","v":539},{"$f":"IF(ISNA($A16),\"\",IFERROR(SUMIFS(D_D[ADCM],D_D[MT],4,D_D[CAT],SMS,D_D[LOC],$A16),0))","v":180.43},{"$f":"IF(ISNA($A16),\"\",IFERROR(SUMIFS(D_D[PROD_FYTD],D_D[MT],4,D_D[CAT],SMS,D_D[LOC],$A16),0))","v":4174},{"$f":"IF(ISNA($A16),\"\",IFERROR(SUMIFS(D_D[ADCF],D_D[MT],4,D_D[CAT],SMS,D_D[LOC],$A16),0))","v":136.38999999999999}]
["459",5,"Honolulu",{"$f":"IF(ISNA($A17),\"\",IFERROR(SUMIFS(D_D[INV],D_D[MT],4,D_D[CAT],SMS,D_D[LOC],$A17),0))","v":3454},{"$f":"IF(ISNA($A17),\"\",IFERROR(SUMIFS(D_D[BL],D_D[MT],4,D_D[CAT],SMS,D_D[LOC],$A17),0))","v":1066},0.30862767805442964,{"$f":"IF(ISNA($A17),\"\",IFERROR(SUMIFS(D_D[ADP],D_D[MT],4,D_D[CAT],SMS,D_D[LOC],$A17),0))","v":127.96},{"$f":"IF(ISNA($A17),\"\",IFERROR(SUMIFS(D_D[PROD_MTD],D_D[MT],4,D_D[CAT],SMS,D_D[LOC],$A17),0))","v":796},{"$f":"IF(ISNA($A17),\"\",IFERROR(SUMIFS(D_D[ADCM],D_D[MT],4,D_D[CAT],SMS,D_D[LOC],$A17),0))","v":164.06},{"$f":"IF(ISNA($A17),\"\",IFERROR(SUMIFS(D_D[PROD_FYTD],D_D[MT],4,D_D[CAT],SMS,D_D[LOC],$A17),0))","v":5730},{"$f":"IF(ISNA($A17),\"\",IFERROR(SUMIFS(D_D[ADCF],D_D[MT],4,D_D[CAT],SMS,D_D[LOC],$A17),0))","v":135.72}]
["344",6,"Los Angeles",{"$f":"IF(ISNA($A18),\"\",IFERROR(SUMIFS(D_D[INV],D_D[MT],4,D_D[CAT],SMS,D_D[LOC],$A18),0))","v":10917},{"$f":"IF(ISNA($A18),\"\",IFERROR(SUMIFS(D_D[BL],D_D[MT],4,D_D[CAT],SMS,D_D[LOC],$A18),0))","v":3211},0.29412842355958596,{"$f":"IF(ISNA($A18),\"\",IFERROR(SUMIFS(D_D[ADP],D_D[MT],4,D_D[CAT],SMS,D_D[LOC],$A18),0))","v":123.75},{"$f":"IF(ISNA($A18),\"\",IFERROR(SUMIFS(D_D[PROD_MTD],D_D[MT],4,D_D[CAT],SMS,D_D[LOC],$A18),0))","v":2545},{"$f":"IF(ISNA($A18),\"\",IFERROR(SUMIFS(D_D[ADCM],D_D[MT],4,D_D[CAT],SMS,D_D[LOC],$A18),0))","v":152.66999999999999},{"$f":"IF(ISNA($A18),\"\",IFERROR(SUMIFS(D_D[PROD_FYTD],D_D[MT],4,D_D[CAT],SMS,D_D[LOC],$A18),0))","v":18743},{"$f":"IF(ISNA($A18),\"\",IFERROR(SUMIFS(D_D[ADCF],D_D[MT],4,D_D[CAT],SMS,D_D[LOC],$A18),0))","v":118.49}]
["358",7,"Manila",{"$f":"IF(ISNA($A19),\"\",IFERROR(SUMIFS(D_D[INV],D_D[MT],4,D_D[CAT],SMS,D_D[LOC],$A19),0))","v":457},{"$f":"IF(ISNA($A19),\"\",IFERROR(SUMIFS(D_D[BL],D_D[MT],4,D_D[CAT],SMS,D_D[LOC],$A19),0))","v":184},0.40262582056892782,{"$f":"IF(ISNA($A19),\"\",IFERROR(SUMIFS(D_D[ADP],D_D[MT],4,D_D[CAT],SMS,D_D[LOC],$A19),0))","v":169.11},{"$f":"IF(ISNA($A19),\"\",IFERROR(SUMIFS(D_D[PROD_MTD],D_D[MT],4,D_D[CAT],SMS,D_D[LOC],$A19),0))","v":133},{"$f":"IF(ISNA($A19),\"\",IFERROR(SUMIFS(D_D[ADCM],D_D[MT],4,D_D[CAT],SMS,D_D[LOC],$A19),0))","v":172.65},{"$f":"IF(ISNA($A19),\"\",IFERROR(SUMIFS(D_D[PROD_FYTD],D_D[MT],4,D_D[CAT],SMS,D_D[LOC],$A19),0))","v":844},{"$f":"IF(ISNA($A19),\"\",IFERROR(SUMIFS(D_D[ADCF],D_D[MT],4,D_D[CAT],SMS,D_D[LOC],$A19),0))","v":141.86000000000001}]
["343",8,"Oakland",{"$f":"IF(ISNA($A20),\"\",IFERROR(SUMIFS(D_D[INV],D_D[MT],4,D_D[CAT],SMS,D_D[LOC],$A20),0))","v":11843},{"$f":"IF(ISNA($A20),\"\",IFERROR(SUMIFS(D_D[BL],D_D[MT],4,D_D[CAT],SMS,D_D[LOC],$A20),0))","v":3877},0.32736637676264457,{"$f":"IF(ISNA($A20),\"\",IFERROR(SUMIFS(D_D[ADP],D_D[MT],4,D_D[CAT],SMS,D_D[LOC],$A20),0))","v":140.51},{"$f":"IF(ISNA($A20),\"\",IFERROR(SUMIFS(D_D[PROD_MTD],D_D[MT],4,D_D[CAT],SMS,D_D[LOC],$A20),0))","v":2759},{"$f":"IF(ISNA($A20),\"\",IFERROR(SUMIFS(D_D[ADCM],D_D[MT],4,D_D[CAT],SMS,D_D[LOC],$A20),0))","v":163.03},{"$f":"IF(ISNA($A20),\"\",IFERROR(SUMIFS(D_D[PROD_FYTD],D_D[MT],4,D_D[CAT],SMS,D_D[LOC],$A20),0))","v":19813},{"$f":"IF(ISNA($A20),\"\",IFERROR(SUMIFS(D_D[ADCF],D_D[MT],4,D_D[CAT],SMS,D_D[LOC],$A20),0))","v":134.18}]
["345",9,"Phoenix",{"$f":"IF(ISNA($A21),\"\",IFERROR(SUMIFS(D_D[INV],D_D[MT],4,D_D[CAT],SMS,D_D[LOC],$A21),0))","v":8528},{"$f":"IF(ISNA($A21),\"\",IFERROR(SUMIFS(D_D[BL],D_D[MT],4,D_D[CAT],SMS,D_D[LOC],$A21),0))","v":2867},0.33618667917448403,{"$f":"IF(ISNA($A21),\"\",IFERROR(SUMIFS(D_D[ADP],D_D[MT],4,D_D[CAT],SMS,D_D[LOC],$A21),0))","v":144.49},{"$f":"IF(ISNA($A21),\"\",IFERROR(SUMIFS(D_D[PROD_MTD],D_D[MT],4,D_D[CAT],SMS,D_D[LOC],$A21),0))","v":1983},{"$f":"IF(ISNA($A21),\"\",IFERROR(SUMIFS(D_D[ADCM],D_D[MT],4,D_D[CAT],SMS,D_D[LOC],$A21),0))","v":162.85},{"$f":"IF(ISNA($A21),\"\",IFERROR(SUMIFS(D_D[PROD_FYTD],D_D[MT],4,D_D[CAT],SMS,D_D[LOC],$A21),0))","v":14565},{"$f":"IF(ISNA($A21),\"\",IFERROR(SUMIFS(D_D[ADCF],D_D[MT],4,D_D[CAT],SMS,D_D[LOC],$A21),0))","v":139.37}]
["348",10,"Portland",{"$f":"IF(ISNA($A22),\"\",IFERROR(SUMIFS(D_D[INV],D_D[MT],4,D_D[CAT],SMS,D_D[LOC],$A22),0))","v":4639},{"$f":"IF(ISNA($A22),\"\",IFERROR(SUMIFS(D_D[BL],D_D[MT],4,D_D[CAT],SMS,D_D[LOC],$A22),0))","v":1634},0.35223108428540634,{"$f":"IF(ISNA($A22),\"\",IFERROR(SUMIFS(D_D[ADP],D_D[MT],4,D_D[CAT],SMS,D_D[LOC],$A22),0))","v":155.52000000000001},{"$f":"IF(ISNA($A22),\"\",IFERROR(SUMIFS(D_D[PROD_MTD],D_D[MT],4,D_D[CAT],SMS,D_D[LOC],$A22),0))","v":1050},{"$f":"IF(ISNA($A22),\"\",IFERROR(SUMIFS(D_D[ADCM],D_D[MT],4,D_D[CAT],SMS,D_D[LOC],$A22),0))","v":185.31},{"$f":"IF(ISNA($A22),\"\",IFERROR(SUMIFS(D_D[PROD_FYTD],D_D[MT],4,D_D[CAT],SMS,D_D[LOC],$A22),0))","v":7677},{"$f":"IF(ISNA($A22),\"\",IFERROR(SUMIFS(D_D[ADCF],D_D[MT],4,D_D[CAT],SMS,D_D[LOC],$A22),0))","v":157.55000000000001}]
["354",11,"Reno",{"$f":"IF(ISNA($A23),\"\",IFERROR(SUMIFS(D_D[INV],D_D[MT],4,D_D[CAT],SMS,D_D[LOC],$A23),0))","v":5580},{"$f":"IF(ISNA($A23),\"\",IFERROR(SUMIFS(D_D[BL],D_D[MT],4,D_D[CAT],SMS,D_D[LOC],$A23),0))","v":1799},0.32240143369175628,{"$f":"IF(ISNA($A23),\"\",IFERROR(SUMIFS(D_D[ADP],D_D[MT],4,D_D[CAT],SMS,D_D[LOC],$A23),0))","v":137.56},{"$f":"IF(ISNA($A23),\"\",IFERROR(SUMIFS(D_D[PROD_MTD],D_D[MT],4,D_D[CAT],SMS,D_D[LOC],$A23),0))","v":1213},{"$f":"IF(ISNA($A23),\"\",IFERROR(SUMIFS(D_D[ADCM],D_D[MT],4,D_D[CAT],SMS,D_D[LOC],$A23),0))","v":171.52},{"$f":"IF(ISNA($A23),\"\",IFERROR(SUMIFS(D_D[PROD_FYTD],D_D[MT],4,D_D[CAT],SMS,D_D[LOC],$A23),0))","v":8774},{"$f":"IF(ISNA($A23),\"\",IFERROR(SUMIFS(D_D[ADCF],D_D[MT],4,D_D[CAT],SMS,D_D[LOC],$A23),0))","v":136.51}]
["341",12,"Salt Lake City",{"$f":"IF(ISNA($A24),\"\",IFERROR(SUMIFS(D_D[INV],D_D[MT],4,D_D[CAT],SMS,D_D[LOC],$A24),0))","v":4951},{"$f":"IF(ISNA($A24),\"\",IFERROR(SUMIFS(D_D[BL],D_D[MT],4,D_D[CAT],SMS,D_D[LOC],$A24),0))","v":2691},0.54352656029085034,{"$f":"IF(ISNA($A24),\"\",IFERROR(SUMIFS(D_D[ADP],D_D[MT],4,D_D[CAT],SMS,D_D[LOC],$A24),0))","v":222.79},{"$f":"IF(ISNA($A24),\"\",IFERROR(SUMIFS(D_D[PROD_MTD],D_D[MT],4,D_D[CAT],SMS,D_D[LOC],$A24),0))","v":1012},{"$f":"IF(ISNA($A24),\"\",IFERROR(SUMIFS(D_D[ADCM],D_D[MT],4,D_D[CAT],SMS,D_D[LOC],$A24),0))","v":223.11},{"$f":"IF(ISNA($A24),\"\",IFERROR(SUMIFS(D_D[PROD_FYTD],D_D[MT],4,D_D[CAT],SMS,D_D[LOC],$A24),0))","v":7059},{"$f":"IF(ISNA($A24),\"\",IFERROR(SUMIFS(D_D[ADCF],D_D[MT],4,D_D[CAT],SMS,D_D[LOC],$A24),0))","v":186.3}]
["377",13,"San Diego",{"$f":"IF(ISNA($A25),\"\",IFERROR(SUMIFS(D_D[INV],D_D[MT],4,D_D[CAT],SMS,D_D[LOC],$A25),0))","v":12834},{"$f":"IF(ISNA($A25),\"\",IFERROR(SUMIFS(D_D[BL],D_D[MT],4,D_D[CAT],SMS,D_D[LOC],$A25),0))","v":3756},0.29266012155212717,{"$f":"IF(ISNA($A25),\"\",IFERROR(SUMIFS(D_D[ADP],D_D[MT],4,D_D[CAT],SMS,D_D[LOC],$A25),0))","v":140.13},{"$f":"IF(ISNA($A25),\"\",IFERROR(SUMIFS(D_D[PROD_MTD],D_D[MT],4,D_D[CAT],SMS,D_D[LOC],$A25),0))","v":3189},{"$f":"IF(ISNA($A25),\"\",IFERROR(SUMIFS(D_D[ADCM],D_D[MT],4,D_D[CAT],SMS,D_D[LOC],$A25),0))","v":173.23},{"$f":"IF(ISNA($A25),\"\",IFERROR(SUMIFS(D_D[PROD_FYTD],D_D[MT],4,D_D[CAT],SMS,D_D[LOC],$A25),0))","v":25360},{"$f":"IF(ISNA($A25),\"\",IFERROR(SUMIFS(D_D[ADCF],D_D[MT],4,D_D[CAT],SMS,D_D[LOC],$A25),0))","v":134}]
["346",14,"Seattle",{"$f":"IF(ISNA($A26),\"\",IFERROR(SUMIFS(D_D[INV],D_D[MT],4,D_D[CAT],SMS,D_D[LOC],$A26),0))","v":12540},{"$f":"IF(ISNA($A26),\"\",IFERROR(SUMIFS(D_D[BL],D_D[MT],4,D_D[CAT],SMS,D_D[LOC],$A26),0))","v":4281},0.34138755980861246,{"$f":"IF(ISNA($A26),\"\",IFERROR(SUMIFS(D_D[ADP],D_D[MT],4,D_D[CAT],SMS,D_D[LOC],$A26),0))","v":167.56},{"$f":"IF(ISNA($A26),\"\",IFERROR(SUMIFS(D_D[PROD_MTD],D_D[MT],4,D_D[CAT],SMS,D_D[LOC],$A26),0))","v":5145},{"$f":"IF(ISNA($A26),\"\",IFERROR(SUMIFS(D_D[ADCM],D_D[MT],4,D_D[CAT],SMS,D_D[LOC],$A26),0))","v":122.07},{"$f":"IF(ISNA($A26),\"\",IFERROR(SUMIFS(D_D[PROD_FYTD],D_D[MT],4,D_D[CAT],SMS,D_D[LOC],$A26),0))","v":39932},{"$f":"IF(ISNA($A26),\"\",IFERROR(SUMIFS(D_D[ADCF],D_D[MT],4,D_D[CAT],SMS,D_D[LOC],$A26),0))","v":102.23}]
[{"$error":"#N/A"},15,"",{"$f":"IF(ISNA($A27),\"\",IFERROR(SUMIFS(D_D[INV],D_D[MT],4,D_D[CAT],SMS,D_D[LOC],$A27),0))","v":""},{"$f":"IF(ISNA($A27),\"\",IFERROR(SUMIFS(D_D[BL],D_D[MT],4,D_D[CAT],SMS,D_D[LOC],$A27),0))","v":""},"",{"$f":"IF(ISNA($A27),\"\",IFERROR(SUMIFS(D_D[ADP],D_D[MT],4,D_D[CAT],SMS,D_D[LOC],$A27),0))","v":""},{"$f":"IF(ISNA($A27),\"\",IFERROR(SUMIFS(D_D[PROD_MTD],D_D[MT],4,D_D[CAT],SMS,D_D[LOC],$A27),0))","v":""},{"$f":"IF(ISNA($A27),\"\",IFERROR(SUMIFS(D_D[ADCM],D_D[MT],4,D_D[CAT],SMS,D_D[LOC],$A27),0))","v":""},{"$f":"IF(ISNA($A27),\"\",IFERROR(SUMIFS(D_D[PROD_FYTD],D_D[MT],4,D_D[CAT],SMS,D_D[LOC],$A27),0))","v":""},{"$f":"IF(ISNA($A27),\"\",IFERROR(SUMIFS(D_D[ADCF],D_D[MT],4,D_D[CAT],SMS,D_D[LOC],$A27),0))","v":""}]
[{"$error":"#N/A"},16,"",{"$f":"IF(ISNA($A28),\"\",IFERROR(SUMIFS(D_D[INV],D_D[MT],4,D_D[CAT],SMS,D_D[LOC],$A28),0))","v":""},{"$f":"IF(ISNA($A28),\"\",IFERROR(SUMIFS(D_D[BL],D_D[MT],4,D_D[CAT],SMS,D_D[LOC],$A28),0))","v":""},"",{"$f":"IF(ISNA($A28),\"\",IFERROR(SUMIFS(D_D[ADP],D_D[MT],4,D_D[CAT],SMS,D_D[LOC],$A28),0))","v":""},{"$f":"IF(ISNA($A28),\"\",IFERROR(SUMIFS(D_D[PROD_MTD],D_D[MT],4,D_D[CAT],SMS,D_D[LOC],$A28),0))","v":""},{"$f":"IF(ISNA($A28),\"\",IFERROR(SUMIFS(D_D[ADCM],D_D[MT],4,D_D[CAT],SMS,D_D[LOC],$A28),0))","v":""},{"$f":"IF(ISNA($A28),\"\",IFERROR(SUMIFS(D_D[PROD_FYTD],D_D[MT],4,D_D[CAT],SMS,D_D[LOC],$A28),0))","v":""},{"$f":"IF(ISNA($A28),\"\",IFERROR(SUMIFS(D_D[ADCF],D_D[MT],4,D_D[CAT],SMS,D_D[LOC],$A28),0))","v":""}]
[{"$error":"#N/A"},17,"",{"$f":"IF(ISNA($A29),\"\",IFERROR(SUMIFS(D_D[INV],D_D[MT],4,D_D[CAT],SMS,D_D[LOC],$A29),0))","v":""},{"$f":"IF(ISNA($A29),\"\",IFERROR(SUMIFS(D_D[BL],D_D[MT],4,D_D[CAT],SMS,D_D[LOC],$A29),0))","v":""},"",{"$f":"IF(ISNA($A29),\"\",IFERROR(SUMIFS(D_D[ADP],D_D[MT],4,D_D[CAT],SMS,D_D[LOC],$A29),0))","v":""},{"$f":"IF(ISNA($A29),\"\",IFERROR(SUMIFS(D_D[PROD_MTD],D_D[MT],4,D_D[CAT],SMS,D_D[LOC],$A29),0))","v":""},{"$f":"IF(ISNA($A29),\"\",IFERROR(SUMIFS(D_D[ADCM],D_D[MT],4,D_D[CAT],SMS,D_D[LOC],$A29),0))","v":""},{"$f":"IF(ISNA($A29),\"\",IFERROR(SUMIFS(D_D[PROD_FYTD],D_D[MT],4,D_D[CAT],SMS,D_D[LOC],$A29),0))","v":""},{"$f":"IF(ISNA($A29),\"\",IFERROR(SUMIFS(D_D[ADCF],D_D[MT],4,D_D[CAT],SMS,D_D[LOC],$A29),0))","v":""}]
[{"$error":"#N/A"},18,"",{"$f":"IF(ISNA($A30),\"\",IFERROR(SUMIFS(D_D[INV],D_D[MT],4,D_D[CAT],SMS,D_D[LOC],$A30),0))","v":""},{"$f":"IF(ISNA($A30),\"\",IFERROR(SUMIFS(D_D[BL],D_D[MT],4,D_D[CAT],SMS,D_D[LOC],$A30),0))","v":""},"",{"$f":"IF(ISNA($A30),\"\",IFERROR(SUMIFS(D_D[ADP],D_D[MT],4,D_D[CAT],SMS,D_D[LOC],$A30),0))","v":""},{"$f":"IF(ISNA($A30),\"\",IFERROR(SUMIFS(D_D[PROD_MTD],D_D[MT],4,D_D[CAT],SMS,D_D[LOC],$A30),0))","v":""},{"$f":"IF(ISNA($A30),\"\",IFERROR(SUMIFS(D_D[ADCM],D_D[MT],4,D_D[CAT],SMS,D_D[LOC],$A30),0))","v":""},{"$f":"IF(ISNA($A30),\"\",IFERROR(SUMIFS(D_D[PROD_FYTD],D_D[MT],4,D_D[CAT],SMS,D_D[LOC],$A30),0))","v":""},{"$f":"IF(ISNA($A30),\"\",IFERROR(SUMIFS(D_D[ADCF],D_D[MT],4,D_D[CAT],SMS,D_D[LOC],$A30),0))","v":""}]
[{"$error":"#N/A"},19,"",{"$f":"IF(ISNA($A31),\"\",IFERROR(SUMIFS(D_D[INV],D_D[MT],4,D_D[CAT],SMS,D_D[LOC],$A31),0))","v":""},{"$f":"IF(ISNA($A31),\"\",IFERROR(SUMIFS(D_D[BL],D_D[MT],4,D_D[CAT],SMS,D_D[LOC],$A31),0))","v":""},"",{"$f":"IF(ISNA($A31),\"\",IFERROR(SUMIFS(D_D[ADP],D_D[MT],4,D_D[CAT],SMS,D_D[LOC],$A31),0))","v":""},{"$f":"IF(ISNA($A31),\"\",IFERROR(SUMIFS(D_D[PROD_MTD],D_D[MT],4,D_D[CAT],SMS,D_D[LOC],$A31),0))","v":""},{"$f":"IF(ISNA($A31),\"\",IFERROR(SUMIFS(D_D[ADCM],D_D[MT],4,D_D[CAT],SMS,D_D[LOC],$A31),0))","v":""},{"$f":"IF(ISNA($A31),\"\",IFERROR(SUMIFS(D_D[PROD_FYTD],D_D[MT],4,D_D[CAT],SMS,D_D[LOC],$A31),0))","v":""},{"$f":"IF(ISNA($A31),\"\",IFERROR(SUMIFS(D_D[ADCF],D_D[MT],4,D_D[CAT],SMS,D_D[LOC],$A31),0))","v":""}]
[{"$error":"#N/A"},20,"",{"$f":"IF(ISNA($A32),\"\",IFERROR(SUMIFS(D_D[INV],D_D[MT],4,D_D[CAT],SMS,D_D[LOC],$A32),0))","v":""},{"$f":"IF(ISNA($A32),\"\",IFERROR(SUMIFS(D_D[BL],D_D[MT],4,D_D[CAT],SMS,D_D[LOC],$A32),0))","v":""},"",{"$f":"IF(ISNA($A32),\"\",IFERROR(SUMIFS(D_D[ADP],D_D[MT],4,D_D[CAT],SMS,D_D[LOC],$A32),0))","v":""},{"$f":"IF(ISNA($A32),\"\",IFERROR(SUMIFS(D_D[PROD_MTD],D_D[MT],4,D_D[CAT],SMS,D_D[LOC],$A32),0))","v":""},{"$f":"IF(ISNA($A32),\"\",IFERROR(SUMIFS(D_D[ADCM],D_D[MT],4,D_D[CAT],SMS,D_D[LOC],$A32),0))","v":""},{"$f":"IF(ISNA($A32),\"\",IFERROR(SUMIFS(D_D[PROD_FYTD],D_D[MT],4,D_D[CAT],SMS,D_D[LOC],$A32),0))","v":""},{"$f":"IF(ISNA($A32),\"\",IFERROR(SUMIFS(D_D[ADCF],D_D[MT],4,D_D[CAT],SMS,D_D[LOC],$A32),0))","v":""}]
[{"$error":"#N/A"},21,"",{"$f":"IF(ISNA($A33),\"\",IFERROR(SUMIFS(D_D[INV],D_D[MT],4,D_D[CAT],SMS,D_D[LOC],$A33),0))","v":""},{"$f":"IF(ISNA($A33),\"\",IFERROR(SUMIFS(D_D[BL],D_D[MT],4,D_D[CAT],SMS,D_D[LOC],$A33),0))","v":""},"",{"$f":"IF(ISNA($A33),\"\",IFERROR(SUMIFS(D_D[ADP],D_D[MT],4,D_D[CAT],SMS,D_D[LOC],$A33),0))","v":""},{"$f":"IF(ISNA($A33),\"\",IFERROR(SUMIFS(D_D[PROD_MTD],D_D[MT],4,D_D[CAT],SMS,D_D[LOC],$A33),0))","v":""},{"$f":"IF(ISNA($A33),\"\",IFERROR(SUMIFS(D_D[ADCM],D_D[MT],4,D_D[CAT],SMS,D_D[LOC],$A33),0))","v":""},{"$f":"IF(ISNA($A33),\"\",IFERROR(SUMIFS(D_D[PROD_FYTD],D_D[MT],4,D_D[CAT],SMS,D_D[LOC],$A33),0))","v":""},{"$f":"IF(ISNA($A33),\"\",IFERROR(SUMIFS(D_D[ADCF],D_D[MT],4,D_D[CAT],SMS,D_D[LOC],$A33),0))","v":""}]
[{"$error":"#N/A"},22,"",{"$f":"IF(ISNA($A34),\"\",IFERROR(SUMIFS(D_D[INV],D_D[MT],4,D_D[CAT],SMS,D_D[LOC],$A34),0))","v":""},{"$f":"IF(ISNA($A34),\"\",IFERROR(SUMIFS(D_D[BL],D_D[MT],4,D_D[CAT],SMS,D_D[LOC],$A34),0))","v":""},"",{"$f":"IF(ISNA($A34),\"\",IFERROR(SUMIFS(D_D[ADP],D_D[MT],4,D_D[CAT],SMS,D_D[LOC],$A34),0))","v":""},{"$f":"IF(ISNA($A34),\"\",IFERROR(SUMIFS(D_D[PROD_MTD],D_D[MT],4,D_D[CAT],SMS,D_D[LOC],$A34),0))","v":""},{"$f":"IF(ISNA($A34),\"\",IFERROR(SUMIFS(D_D[ADCM],D_D[MT],4,D_D[CAT],SMS,D_D[LOC],$A34),0))","v":""},{"$f":"IF(ISNA($A34),\"\",IFERROR(SUMIFS(D_D[PROD_FYTD],D_D[MT],4,D_D[CAT],SMS,D_D[LOC],$A34),0))","v":""},{"$f":"IF(ISNA($A34),\"\",IFERROR(SUMIFS(D_D[ADCF],D_D[MT],4,D_D[CAT],SMS,D_D[LOC],$A34),0))","v":""}]
[{"$error":"#N/A"},23,"",{"$f":"IF(ISNA($A35),\"\",IFERROR(SUMIFS(D_D[INV],D_D[MT],4,D_D[CAT],SMS,D_D[LOC],$A35),0))","v":""},{"$f":"IF(ISNA($A35),\"\",IFERROR(SUMIFS(D_D[BL],D_D[MT],4,D_D[CAT],SMS,D_D[LOC],$A35),0))","v":""},"",{"$f":"IF(ISNA($A35),\"\",IFERROR(SUMIFS(D_D[ADP],D_D[MT],4,D_D[CAT],SMS,D_D[LOC],$A35),0))","v":""},{"$f":"IF(ISNA($A35),\"\",IFERROR(SUMIFS(D_D[PROD_MTD],D_D[MT],4,D_D[CAT],SMS,D_D[LOC],$A35),0))","v":""},{"$f":"IF(ISNA($A35),\"\",IFERROR(SUMIFS(D_D[ADCM],D_D[MT],4,D_D[CAT],SMS,D_D[LOC],$A35),0))","v":""},{"$f":"IF(ISNA($A35),\"\",IFERROR(SUMIFS(D_D[PROD_FYTD],D_D[MT],4,D_D[CAT],SMS,D_D[LOC],$A35),0))","v":""},{"$f":"IF(ISNA($A35),\"\",IFERROR(SUMIFS(D_D[ADCF],D_D[MT],4,D_D[CAT],SMS,D_D[LOC],$A35),0))","v":""}]

{"sheet":"Rating Bundle - State","index":7,"n_rows":35,"n_cols":15,"rows_kept":35,"cut":false,"hidden":false,"merged":[[8,9,10,9],[8,10,10,10],[8,11,10,16],[8,6,10,6],[1,11,1,16],[2,11,2,16],[1,3,1,10],[2,3,2,10],[7,3,7,10],[7,11,7,16],[8,3,10,3],[8,4,10,4],[8,5,10,5],[8,7,10,7],[8,8,10,8],[6,11,6,16]]}
[]
[null,null,"DISTRICT SELECTOR","Compensation and Pension Rating Bundle Metrics",null,null,null,null,null,null,null,"Report through"]
[null,null,null,"State View",null,null,null,null,null,null,null,{"$f":"D_DT[]","v":"2022-05-28"}]
[null,null,null,"The State listed is based on the address associated with the claim, not payment address",null,null,null,null,null,null,null,"ADP = Average Days Pending",null,null,"MTD = Month to Date"]
[null,null,null,"Each Special Mission has distinct claim counts",null,null,null,null,null,null,null,"ADC = Average Days to Complete",null,null,"FYTD = Fiscal Year to Date"]
[null,null,null,"When Special Mission is set to Pension, BDD, or Quickstart, the District Selector has no impact."]
[null,null,null,null,null,null,null,null,null,null,null,"Accuracy metrics are available on Rating Bundle - SOJ tab"]
[null,null,null,"CLAIM METRICS",null,null,null,null,null,null,null,"ACCURACY METRICS"]
[null,null,"SPECIAL MISSION SELECTOR","#\nPending","#\nPending\n> 125 Days","%\nPending\n> 125 Days","ADP","#\nCompleted\nMTD","ADC\nMTD","#\nCompleted\nFYTD","ADC\nFYTD","Accuracy measurement is available on the Rating Bundle SOJ tab"]
[]
[]
[100,null,{"$f":"Driver!$C$20& \" Total\"","v":"USA - All Missions Total"},{"$f":"IF(ISNA($A12),\"\",IFERROR(SUMIFS(D_D[INV],D_D[MT],6,D_D[CAT],SMS,D_D[LOC],$A12),0))","v":592345},{"$f":"IF(ISNA($A12),\"\",IFERROR(SUMIFS(D_D[BL],D_D[MT],6,D_D[CAT],SMS,D_D[LOC],$A12),0))","v":196852},{"$f":"IF(ISNA($A12),\"\",IFERROR(E12/D12,0))","v":0.33232660020764926},{"$f":"IF(ISNA($A12),\"\",IFERROR(SUMIFS(D_D[ADP],D_D[MT],6,D_D[CAT],SMS,D_D[LOC],$A12),0))","v":143.19},{"$f":"IF(ISNA($A12),\"\",IFERROR(SUMIFS(D_D[PROD_MTD],D_D[MT],6,D_D[CAT],SMS,D_D[LOC],$A12),0))","v":142986},{"$f":"IF(ISNA($A12),\"\",IFERROR(SUMIFS(D_D[ADCM],D_D[MT],6,D_D[CAT],SMS,D_D[LOC],$A12),0))","v":166.97},{"$f":"IF(ISNA($A12),\"\",IFERROR(SUMIFS(D_D[PROD_FYTD],D_D[MT],6,D_D[CAT],SMS,D_D[LOC],$A12),0))","v":1105676},{"$f":"IF(ISNA($A12),\"\",IFERROR(SUMIFS(D_D[ADCF],D_D[MT],6,D_D[CAT],SMS,D_D[LOC],$A12),0))","v":138.44}]
[{"$f":"INDEX(STATE,(MATCH($C13,STATE_D,0)))","v":"395"},1,{"$f":"IFERROR(INDEX(INDIRECT(DS_ST),B13),\"\")","v":"Pacific District"},{"$f":"IF(ISNA($A13),\"\",IFERROR(SUMIFS(D_D[INV],D_D[MT],6,D_D[CAT],SMS,D_D[LOC],$A13),0))","v":106884},{"$f":"IF(ISNA($A13),\"\",IFERROR(SUMIFS(D_D[BL],D_D[MT],6,D_D[CAT],SMS,D_D[LOC],$A13),0))","v":36699},{"$f":"IF(ISNA($A13),\"\",IFERROR(E13/D13,0))","v":0.34335354215785335},{"$f":"IF(ISNA($A13),\"\",IFERROR(SUMIFS(D_D[ADP],D_D[MT],6,D_D[CAT],SMS,D_D[LOC],$A13),0))","v":147.82},{"$f":"IF(ISNA($A13),\"\",IFERROR(SUMIFS(D_D[PROD_MTD],D_D[MT],6,D_D[CAT],SMS,D_D[LOC],$A13),0))","v":25720},{"$f":"IF(ISNA($A13),\"\",IFERROR(SUMIFS(D_D[ADCM],D_D[MT],6,D_D[CAT],SMS,D_D[LOC],$A13),0))","v":168.88},{"$f":"IF(ISNA($A13),\"\",IFERROR(SUMIFS(D_D[PROD_FYTD],D_D[MT],6,D_D[CAT],SMS,D_D[LOC],$A13),0))","v":195954},{"$f":"IF(ISNA($A13),\"\",IFERROR(SUMIFS(D_D[ADCF],D_D[MT],6,D_D[CAT],SMS,D_D[LOC],$A13),0))","v":137.84}]
["AK",2,"Alaska",{"$f":"IF(ISNA($A14),\"\",IFERROR(SUMIFS(D_D[INV],D_D[MT],6,D_D[CAT],SMS,D_D[LOC],$A14),0))","v":1997},{"$f":"IF(ISNA($A14),\"\",IFERROR(SUMIFS(D_D[BL],D_D[MT],6,D_D[CAT],SMS,D_D[LOC],$A14),0))","v":736},{"$f":"IF(ISNA($A14),\"\",IFERROR(E14/D14,0))","v":0.36855282924386579},{"$f":"IF(ISNA($A14),\"\",IFERROR(SUMIFS(D_D[ADP],D_D[MT],6,D_D[CAT],SMS,D_D[LOC],$A14),0))","v":151.32},{"$f":"IF(ISNA($A14),\"\",IFERROR(SUMIFS(D_D[PROD_MTD],D_D[MT],6,D_D[CAT],SMS,D_D[LOC],$A14),0))","v":471},{"$f":"IF(ISNA($A14),\"\",IFERROR(SUMIFS(D_D[ADCM],D_D[MT],6,D_D[CAT],SMS,D_D[LOC],$A14),0))","v":164.82},{"$f":"IF(ISNA($A14),\"\",IFERROR(SUMIFS(D_D[PROD_FYTD],D_D[MT],6,D_D[CAT],SMS,D_D[LOC],$A14),0))","v":3313},{"$f":"IF(ISNA($A14),\"\",IFERROR(SUMIFS(D_D[ADCF],D_D[MT],6,D_D[CAT],SMS,D_D[LOC],$A14),0))","v":137.80000000000001}]
["AZ",3,{"$f":"IFERROR(INDEX(INDIRECT(DS_ST),B15),\"\")","v":"Arizona"},{"$f":"IF(ISNA($A15),\"\",IFERROR(SUMIFS(D_D[INV],D_D[MT],6,D_D[CAT],SMS,D_D[LOC],$A15),0))","v":13353},{"$f":"IF(ISNA($A15),\"\",IFERROR(SUMIFS(D_D[BL],D_D[MT],6,D_D[CAT],SMS,D_D[LOC],$A15),0))","v":4654},{"$f":"IF(ISNA($A15),\"\",IFERROR(E15/D15,0))","v":0.34853590953343816},{"$f":"IF(ISNA($A15),\"\",IFERROR(SUMIFS(D_D[ADP],D_D[MT],6,D_D[CAT],SMS,D_D[LOC],$A15),0))","v":148.68},{"$f":"IF(ISNA($A15),\"\",IFERROR(SUMIFS(D_D[PROD_MTD],D_D[MT],6,D_D[CAT],SMS,D_D[LOC],$A15),0))","v":3277},{"$f":"IF(ISNA($A15),\"\",IFERROR(SUMIFS(D_D[ADCM],D_D[MT],6,D_D[CAT],SMS,D_D[LOC],$A15),0))","v":168.94},{"$f":"IF(ISNA($A15),\"\",IFERROR(SUMIFS(D_D[PROD_FYTD],D_D[MT],6,D_D[CAT],SMS,D_D[LOC],$A15),0))","v":25360},{"$f":"IF(ISNA($A15),\"\",IFERROR(SUMIFS(D_D[ADCF],D_D[MT],6,D_D[CAT],SMS,D_D[LOC],$A15),0))","v":138.21}]
["CA",4,"California",{"$f":"IF(ISNA($A16),\"\",IFERROR(SUMIFS(D_D[INV],D_D[MT],6,D_D[CAT],SMS,D_D[LOC],$A16),0))","v":48381},{"$f":"IF(ISNA($A16),\"\",IFERROR(SUMIFS(D_D[BL],D_D[MT],6,D_D[CAT],SMS,D_D[LOC],$A16),0))","v":15782},0.32620243484012318,{"$f":"IF(ISNA($A16),\"\",IFERROR(SUMIFS(D_D[ADP],D_D[MT],6,D_D[CAT],SMS,D_D[LOC],$A16),0))","v":143.24},{"$f":"IF(ISNA($A16),\"\",IFERROR(SUMIFS(D_D[PROD_MTD],D_D[MT],6,D_D[CAT],SMS,D_D[LOC],$A16),0))","v":11713},{"$f":"IF(ISNA($A16),\"\",IFERROR(SUMIFS(D_D[ADCM],D_D[MT],6,D_D[CAT],SMS,D_D[LOC],$A16),0))","v":164.29},{"$f":"IF(ISNA($A16),\"\",IFERROR(SUMIFS(D_D[PROD_FYTD],D_D[MT],6,D_D[CAT],SMS,D_D[LOC],$A16),0))","v":89370},{"$f":"IF(ISNA($A16),\"\",IFERROR(SUMIFS(D_D[ADCF],D_D[MT],6,D_D[CAT],SMS,D_D[LOC],$A16),0))","v":134.35}]
["HI",5,"Hawaii",{"$f":"IF(ISNA($A17),\"\",IFERROR(SUMIFS(D_D[INV],D_D[MT],6,D_D[CAT],SMS,D_D[LOC],$A17),0))","v":3551},{"$f":"IF(ISNA($A17),\"\",IFERROR(SUMIFS(D_D[BL],D_D[MT],6,D_D[CAT],SMS,D_D[LOC],$A17),0))","v":1219},0.34328358208955223,{"$f":"IF(ISNA($A17),\"\",IFERROR(SUMIFS(D_D[ADP],D_D[MT],6,D_D[CAT],SMS,D_D[LOC],$A17),0))","v":147.94999999999999},{"$f":"IF(ISNA($A17),\"\",IFERROR(SUMIFS(D_D[PROD_MTD],D_D[MT],6,D_D[CAT],SMS,D_D[LOC],$A17),0))","v":938},{"$f":"IF(ISNA($A17),\"\",IFERROR(SUMIFS(D_D[ADCM],D_D[MT],6,D_D[CAT],SMS,D_D[LOC],$A17),0))","v":159.57},{"$f":"IF(ISNA($A17),\"\",IFERROR(SUMIFS(D_D[PROD_FYTD],D_D[MT],6,D_D[CAT],SMS,D_D[LOC],$A17),0))","v":6718},{"$f":"IF(ISNA($A17),\"\",IFERROR(SUMIFS(D_D[ADCF],D_D[MT],6,D_D[CAT],SMS,D_D[LOC],$A17),0))","v":136.22}]
["ID",6,"Idaho",{"$f":"IF(ISNA($A18),\"\",IFERROR(SUMIFS(D_D[INV],D_D[MT],6,D_D[CAT],SMS,D_D[LOC],$A18),0))","v":3514},{"$f":"IF(ISNA($A18),\"\",IFERROR(SUMIFS(D_D[BL],D_D[MT],6,D_D[CAT],SMS,D_D[LOC],$A18),0))","v":1331},0.37877063175867959,{"$f":"IF(ISNA($A18),\"\",IFERROR(SUMIFS(D_D[ADP],D_D[MT],6,D_D[CAT],SMS,D_D[LOC],$A18),0))","v":158.51},{"$f":"IF(ISNA($A18),\"\",IFERROR(SUMIFS(D_D[PROD_MTD],D_D[MT],6,D_D[CAT],SMS,D_D[LOC],$A18),0))","v":833},{"$f":"IF(ISNA($A18),\"\",IFERROR(SUMIFS(D_D[ADCM],D_D[MT],6,D_D[CAT],SMS,D_D[LOC],$A18),0))","v":180.8},{"$f":"IF(ISNA($A18),\"\",IFERROR(SUMIFS(D_D[PROD_FYTD],D_D[MT],6,D_D[CAT],SMS,D_D[LOC],$A18),0))","v":6522},{"$f":"IF(ISNA($A18),\"\",IFERROR(SUMIFS(D_D[ADCF],D_D[MT],6,D_D[CAT],SMS,D_D[LOC],$A18),0))","v":141.08000000000001}]
["NV",7,"Nevada",{"$f":"IF(ISNA($A19),\"\",IFERROR(SUMIFS(D_D[INV],D_D[MT],6,D_D[CAT],SMS,D_D[LOC],$A19),0))","v":8173},{"$f":"IF(ISNA($A19),\"\",IFERROR(SUMIFS(D_D[BL],D_D[MT],6,D_D[CAT],SMS,D_D[LOC],$A19),0))","v":2715},0.33219136180105224,{"$f":"IF(ISNA($A19),\"\",IFERROR(SUMIFS(D_D[ADP],D_D[MT],6,D_D[CAT],SMS,D_D[LOC],$A19),0))","v":141.66999999999999},{"$f":"IF(ISNA($A19),\"\",IFERROR(SUMIFS(D_D[PROD_MTD],D_D[MT],6,D_D[CAT],SMS,D_D[LOC],$A19),0))","v":1924},{"$f":"IF(ISNA($A19),\"\",IFERROR(SUMIFS(D_D[ADCM],D_D[MT],6,D_D[CAT],SMS,D_D[LOC],$A19),0))","v":173.44},{"$f":"IF(ISNA($A19),\"\",IFERROR(SUMIFS(D_D[PROD_FYTD],D_D[MT],6,D_D[CAT],SMS,D_D[LOC],$A19),0))","v":14126},{"$f":"IF(ISNA($A19),\"\",IFERROR(SUMIFS(D_D[ADCF],D_D[MT],6,D_D[CAT],SMS,D_D[LOC],$A19),0))","v":139.38999999999999}]
["NM",8,"New Mexico",{"$f":"IF(ISNA($A20),\"\",IFERROR(SUMIFS(D_D[INV],D_D[MT],6,D_D[CAT],SMS,D_D[LOC],$A20),0))","v":4195},{"$f":"IF(ISNA($A20),\"\",IFERROR(SUMIFS(D_D[BL],D_D[MT],6,D_D[CAT],SMS,D_D[LOC],$A20),0))","v":1515},0.36114421930870083,{"$f":"IF(ISNA($A20),\"\",IFERROR(SUMIFS(D_D[ADP],D_D[MT],6,D_D[CAT],SMS,D_D[LOC],$A20),0))","v":150.81},{"$f":"IF(ISNA($A20),\"\",IFERROR(SUMIFS(D_D[PROD_MTD],D_D[MT],6,D_D[CAT],SMS,D_D[LOC],$A20),0))","v":968},{"$f":"IF(ISNA($A20),\"\",IFERROR(SUMIFS(D_D[ADCM],D_D[MT],6,D_D[CAT],SMS,D_D[LOC],$A20),0))","v":175.11},{"$f":"IF(ISNA($A20),\"\",IFERROR(SUMIFS(D_D[PROD_FYTD],D_D[MT],6,D_D[CAT],SMS,D_D[LOC],$A20),0))","v":7447},{"$f":"IF(ISNA($A20),\"\",IFERROR(SUMIFS(D_D[ADCF],D_D[MT],6,D_D[CAT],SMS,D_D[LOC],$A20),0))","v":145.30000000000001}]
["OR",9,"Oregon",{"$f":"IF(ISNA($A21),\"\",IFERROR(SUMIFS(D_D[INV],D_D[MT],6,D_D[CAT],SMS,D_D[LOC],$A21),0))","v":7287},{"$f":"IF(ISNA($A21),\"\",IFERROR(SUMIFS(D_D[BL],D_D[MT],6,D_D[CAT],SMS,D_D[LOC],$A21),0))","v":2911},0.39947852339783174,{"$f":"IF(ISNA($A21),\"\",IFERROR(SUMIFS(D_D[ADP],D_D[MT],6,D_D[CAT],SMS,D_D[LOC],$A21),0))","v":171.36},{"$f":"IF(ISNA($A21),\"\",IFERROR(SUMIFS(D_D[PROD_MTD],D_D[MT],6,D_D[CAT],SMS,D_D[LOC],$A21),0))","v":1638},{"$f":"IF(ISNA($A21),\"\",IFERROR(SUMIFS(D_D[ADCM],D_D[MT],6,D_D[CAT],SMS,D_D[LOC],$A21),0))","v":194.06},{"$f":"IF(ISNA($A21),\"\",IFERROR(SUMIFS(D_D[PROD_FYTD],D_D[MT],6,D_D[CAT],SMS,D_D[LOC],$A21),0))","v":12539},{"$f":"IF(ISNA($A21),\"\",IFERROR(SUMIFS(D_D[ADCF],D_D[MT],6,D_D[CAT],SMS,D_D[LOC],$A21),0))","v":161.06}]
["PI",10,"Philippines",{"$f":"IF(ISNA($A22),\"\",IFERROR(SUMIFS(D_D[INV],D_D[MT],6,D_D[CAT],SMS,D_D[LOC],$A22),0))","v":0},{"$f":"IF(ISNA($A22),\"\",IFERROR(SUMIFS(D_D[BL],D_D[MT],6,D_D[CAT],SMS,D_D[LOC],$A22),0))","v":0},0,{"$f":"IF(ISNA($A22),\"\",IFERROR(SUMIFS(D_D[ADP],D_D[MT],6,D_D[CAT],SMS,D_D[LOC],$A22),0))","v":0},{"$f":"IF(ISNA($A22),\"\",IFERROR(SUMIFS(D_D[PROD_MTD],D_D[MT],6,D_D[CAT],SMS,D_D[LOC],$A22),0))","v":0},{"$f":"IF(ISNA($A22),\"\",IFERROR(SUMIFS(D_D[ADCM],D_D[MT],6,D_D[CAT],SMS,D_D[LOC],$A22),0))","v":0},{"$f":"IF(ISNA($A22),\"\",IFERROR(SUMIFS(D_D[PROD_FYTD],D_D[MT],6,D_D[CAT],SMS,D_D[LOC],$A22),0))","v":0},{"$f":"IF(ISNA($A22),\"\",IFERROR(SUMIFS(D_D[ADCF],D_D[MT],6,D_D[CAT],SMS,D_D[LOC],$A22),0))","v":0}]
["UT",11,"Utah",{"$f":"IF(ISNA($A23),\"\",IFERROR(SUMIFS(D_D[INV],D_D[MT],6,D_D[CAT],SMS,D_D[LOC],$A23),0))","v":3295},{"$f":"IF(ISNA($A23),\"\",IFERROR(SUMIFS(D_D[BL],D_D[MT],6,D_D[CAT],SMS,D_D[LOC],$A23),0))","v":1095},0.33232169954476481,{"$f":"IF(ISNA($A23),\"\",IFERROR(SUMIFS(D_D[ADP],D_D[MT],6,D_D[CAT],SMS,D_D[LOC],$A23),0))","v":142.05000000000001},{"$f":"IF(ISNA($A23),\"\",IFERROR(SUMIFS(D_D[PROD_MTD],D_D[MT],6,D_D[CAT],SMS,D_D[LOC],$A23),0))","v":776},{"$f":"IF(ISNA($A23),\"\",IFERROR(SUMIFS(D_D[ADCM],D_D[MT],6,D_D[CAT],SMS,D_D[LOC],$A23),0))","v":164.12},{"$f":"IF(ISNA($A23),\"\",IFERROR(SUMIFS(D_D[PROD_FYTD],D_D[MT],6,D_D[CAT],SMS,D_D[LOC],$A23),0))","v":6522},{"$f":"IF(ISNA($A23),\"\",IFERROR(SUMIFS(D_D[ADCF],D_D[MT],6,D_D[CAT],SMS,D_D[LOC],$A23),0))","v":134.29}]
["WA",12,"Washington",{"$f":"IF(ISNA($A24),\"\",IFERROR(SUMIFS(D_D[INV],D_D[MT],6,D_D[CAT],SMS,D_D[LOC],$A24),0))","v":13138},{"$f":"IF(ISNA($A24),\"\",IFERROR(SUMIFS(D_D[BL],D_D[MT],6,D_D[CAT],SMS,D_D[LOC],$A24),0))","v":4741},0.36086162277363376,{"$f":"IF(ISNA($A24),\"\",IFERROR(SUMIFS(D_D[ADP],D_D[MT],6,D_D[CAT],SMS,D_D[LOC],$A24),0))","v":151.65},{"$f":"IF(ISNA($A24),\"\",IFERROR(SUMIFS(D_D[PROD_MTD],D_D[MT],6,D_D[CAT],SMS,D_D[LOC],$A24),0))","v":3182},{"$f":"IF(ISNA($A24),\"\",IFERROR(SUMIFS(D_D[ADCM],D_D[MT],6,D_D[CAT],SMS,D_D[LOC],$A24),0))","v":169.48},{"$f":"IF(ISNA($A24),\"\",IFERROR(SUMIFS(D_D[PROD_FYTD],D_D[MT],6,D_D[CAT],SMS,D_D[LOC],$A24),0))","v":24037},{"$f":"IF(ISNA($A24),\"\",IFERROR(SUMIFS(D_D[ADCF],D_D[MT],6,D_D[CAT],SMS,D_D[LOC],$A24),0))","v":135.61000000000001}]
[{"$error":"#N/A"},13,"",{"$f":"IF(ISNA($A25),\"\",IFERROR(SUMIFS(D_D[INV],D_D[MT],6,D_D[CAT],SMS,D_D[LOC],$A25),0))","v":""},{"$f":"IF(ISNA($A25),\"\",IFERROR(SUMIFS(D_D[BL],D_D[MT],6,D_D[CAT],SMS,D_D[LOC],$A25),0))","v":""},"",{"$f":"IF(ISNA($A25),\"\",IFERROR(SUMIFS(D_D[ADP],D_D[MT],6,D_D[CAT],SMS,D_D[LOC],$A25),0))","v":""},{"$f":"IF(ISNA($A25),\"\",IFERROR(SUMIFS(D_D[PROD_MTD],D_D[MT],6,D_D[CAT],SMS,D_D[LOC],$A25),0))","v":""},{"$f":"IF(ISNA($A25),\"\",IFERROR(SUMIFS(D_D[ADCM],D_D[MT],6,D_D[CAT],SMS,D_D[LOC],$A25),0))","v":""},{"$f":"IF(ISNA($A25),\"\",IFERROR(SUMIFS(D_D[PROD_FYTD],D_D[MT],6,D_D[CAT],SMS,D_D[LOC],$A25),0))","v":""},{"$f":"IF(ISNA($A25),\"\",IFERROR(SUMIFS(D_D[ADCF],D_D[MT],6,D_D[CAT],SMS,D_D[LOC],$A25),0))","v":""}]
[{"$error":"#N/A"},14,"",{"$f":"IF(ISNA($A26),\"\",IFERROR(SUMIFS(D_D[INV],D_D[MT],6,D_D[CAT],SMS,D_D[LOC],$A26),0))","v":""},{"$f":"IF(ISNA($A26),\"\",IFERROR(SUMIFS(D_D[BL],D_D[MT],6,D_D[CAT],SMS,D_D[LOC],$A26),0))","v":""},"",{"$f":"IF(ISNA($A26),\"\",IFERROR(SUMIFS(D_D[ADP],D_D[MT],6,D_D[CAT],SMS,D_D[LOC],$A26),0))","v":""},{"$f":"IF(ISNA($A26),\"\",IFERROR(SUMIFS(D_D[PROD_MTD],D_D[MT],6,D_D[CAT],SMS,D_D[LOC],$A26),0))","v":""},{"$f":"IF(ISNA($A26),\"\",IFERROR(SUMIFS(D_D[ADCM],D_D[MT],6,D_D[CAT],SMS,D_D[LOC],$A26),0))","v":""},{"$f":"IF(ISNA($A26),\"\",IFERROR(SUMIFS(D_D[PROD_FYTD],D_D[MT],6,D_D[CAT],SMS,D_D[LOC],$A26),0))","v":""},{"$f":"IF(ISNA($A26),\"\",IFERROR(SUMIFS(D_D[ADCF],D_D[MT],6,D_D[CAT],SMS,D_D[LOC],$A26),0))","v":""}]
[{"$error":"#N/A"},15,"",{"$f":"IF(ISNA($A27),\"\",IFERROR(SUMIFS(D_D[INV],D_D[MT],6,D_D[CAT],SMS,D_D[LOC],$A27),0))","v":""},{"$f":"IF(ISNA($A27),\"\",IFERROR(SUMIFS(D_D[BL],D_D[MT],6,D_D[CAT],SMS,D_D[LOC],$A27),0))","v":""},"",{"$f":"IF(ISNA($A27),\"\",IFERROR(SUMIFS(D_D[ADP],D_D[MT],6,D_D[CAT],SMS,D_D[LOC],$A27),0))","v":""},{"$f":"IF(ISNA($A27),\"\",IFERROR(SUMIFS(D_D[PROD_MTD],D_D[MT],6,D_D[CAT],SMS,D_D[LOC],$A27),0))","v":""},{"$f":"IF(ISNA($A27),\"\",IFERROR(SUMIFS(D_D[ADCM],D_D[MT],6,D_D[CAT],SMS,D_D[LOC],$A27),0))","v":""},{"$f":"IF(ISNA($A27),\"\",IFERROR(SUMIFS(D_D[PROD_FYTD],D_D[MT],6,D_D[CAT],SMS,D_D[LOC],$A27),0))","v":""},{"$f":"IF(ISNA($A27),\"\",IFERROR(SUMIFS(D_D[ADCF],D_D[MT],6,D_D[CAT],SMS,D_D[LOC],$A27),0))","v":""}]
[{"$error":"#N/A"},16,"",{"$f":"IF(ISNA($A28),\"\",IFERROR(SUMIFS(D_D[INV],D_D[MT],6,D_D[CAT],SMS,D_D[LOC],$A28),0))","v":""},{"$f":"IF(ISNA($A28),\"\",IFERROR(SUMIFS(D_D[BL],D_D[MT],6,D_D[CAT],SMS,D_D[LOC],$A28),0))","v":""},"",{"$f":"IF(ISNA($A28),\"\",IFERROR(SUMIFS(D_D[ADP],D_D[MT],6,D_D[CAT],SMS,D_D[LOC],$A28),0))","v":""},{"$f":"IF(ISNA($A28),\"\",IFERROR(SUMIFS(D_D[PROD_MTD],D_D[MT],6,D_D[CAT],SMS,D_D[LOC],$A28),0))","v":""},{"$f":"IF(ISNA($A28),\"\",IFERROR(SUMIFS(D_D[ADCM],D_D[MT],6,D_D[CAT],SMS,D_D[LOC],$A28),0))","v":""},{"$f":"IF(ISNA($A28),\"\",IFERROR(SUMIFS(D_D[PROD_FYTD],D_D[MT],6,D_D[CAT],SMS,D_D[LOC],$A28),0))","v":""},{"$f":"IF(ISNA($A28),\"\",IFERROR(SUMIFS(D_D[ADCF],D_D[MT],6,D_D[CAT],SMS,D_D[LOC],$A28),0))","v":""}]
[{"$error":"#N/A"},17,"",{"$f":"IF(ISNA($A29),\"\",IFERROR(SUMIFS(D_D[INV],D_D[MT],6,D_D[CAT],SMS,D_D[LOC],$A29),0))","v":""},{"$f":"IF(ISNA($A29),\"\",IFERROR(SUMIFS(D_D[BL],D_D[MT],6,D_D[CAT],SMS,D_D[LOC],$A29),0))","v":""},"",{"$f":"IF(ISNA($A29),\"\",IFERROR(SUMIFS(D_D[ADP],D_D[MT],6,D_D[CAT],SMS,D_D[LOC],$A29),0))","v":""},{"$f":"IF(ISNA($A29),\"\",IFERROR(SUMIFS(D_D[PROD_MTD],D_D[MT],6,D_D[CAT],SMS,D_D[LOC],$A29),0))","v":""},{"$f":"IF(ISNA($A29),\"\",IFERROR(SUMIFS(D_D[ADCM],D_D[MT],6,D_D[CAT],SMS,D_D[LOC],$A29),0))","v":""},{"$f":"IF(ISNA($A29),\"\",IFERROR(SUMIFS(D_D[PROD_FYTD],D_D[MT],6,D_D[CAT],SMS,D_D[LOC],$A29),0))","v":""},{"$f":"IF(ISNA($A29),\"\",IFERROR(SUMIFS(D_D[ADCF],D_D[MT],6,D_D[CAT],SMS,D_D[LOC],$A29),0))","v":""}]
[{"$error":"#N/A"},18,"",{"$f":"IF(ISNA($A30),\"\",IFERROR(SUMIFS(D_D[INV],D_D[MT],6,D_D[CAT],SMS,D_D[LOC],$A30),0))","v":""},{"$f":"IF(ISNA($A30),\"\",IFERROR(SUMIFS(D_D[BL],D_D[MT],6,D_D[CAT],SMS,D_D[LOC],$A30),0))","v":""},"",{"$f":"IF(ISNA($A30),\"\",IFERROR(SUMIFS(D_D[ADP],D_D[MT],6,D_D[CAT],SMS,D_D[LOC],$A30),0))","v":""},{"$f":"IF(ISNA($A30),\"\",IFERROR(SUMIFS(D_D[PROD_MTD],D_D[MT],6,D_D[CAT],SMS,D_D[LOC],$A30),0))","v":""},{"$f":"IF(ISNA($A30),\"\",IFERROR(SUMIFS(D_D[ADCM],D_D[MT],6,D_D[CAT],SMS,D_D[LOC],$A30),0))","v":""},{"$f":"IF(ISNA($A30),\"\",IFERROR(SUMIFS(D_D[PROD_FYTD],D_D[MT],6,D_D[CAT],SMS,D_D[LOC],$A30),0))","v":""},{"$f":"IF(ISNA($A30),\"\",IFERROR(SUMIFS(D_D[ADCF],D_D[MT],6,D_D[CAT],SMS,D_D[LOC],$A30),0))","v":""}]
[{"$error":"#N/A"},19,"",{"$f":"IF(ISNA($A31),\"\",IFERROR(SUMIFS(D_D[INV],D_D[MT],6,D_D[CAT],SMS,D_D[LOC],$A31),0))","v":""},{"$f":"IF(ISNA($A31),\"\",IFERROR(SUMIFS(D_D[BL],D_D[MT],6,D_D[CAT],SMS,D_D[LOC],$A31),0))","v":""},"",{"$f":"IF(ISNA($A31),\"\",IFERROR(SUMIFS(D_D[ADP],D_D[MT],6,D_D[CAT],SMS,D_D[LOC],$A31),0))","v":""},{"$f":"IF(ISNA($A31),\"\",IFERROR(SUMIFS(D_D[PROD_MTD],D_D[MT],6,D_D[CAT],SMS,D_D[LOC],$A31),0))","v":""},{"$f":"IF(ISNA($A31),\"\",IFERROR(SUMIFS(D_D[ADCM],D_D[MT],6,D_D[CAT],SMS,D_D[LOC],$A31),0))","v":""},{"$f":"IF(ISNA($A31),\"\",IFERROR(SUMIFS(D_D[PROD_FYTD],D_D[MT],6,D_D[CAT],SMS,D_D[LOC],$A31),0))","v":""},{"$f":"IF(ISNA($A31),\"\",IFERROR(SUMIFS(D_D[ADCF],D_D[MT],6,D_D[CAT],SMS,D_D[LOC],$A31),0))","v":""}]
[{"$error":"#N/A"},20,"",{"$f":"IF(ISNA($A32),\"\",IFERROR(SUMIFS(D_D[INV],D_D[MT],6,D_D[CAT],SMS,D_D[LOC],$A32),0))","v":""},{"$f":"IF(ISNA($A32),\"\",IFERROR(SUMIFS(D_D[BL],D_D[MT],6,D_D[CAT],SMS,D_D[LOC],$A32),0))","v":""},"",{"$f":"IF(ISNA($A32),\"\",IFERROR(SUMIFS(D_D[ADP],D_D[MT],6,D_D[CAT],SMS,D_D[LOC],$A32),0))","v":""},{"$f":"IF(ISNA($A32),\"\",IFERROR(SUMIFS(D_D[PROD_MTD],D_D[MT],6,D_D[CAT],SMS,D_D[LOC],$A32),0))","v":""},{"$f":"IF(ISNA($A32),\"\",IFERROR(SUMIFS(D_D[ADCM],D_D[MT],6,D_D[CAT],SMS,D_D[LOC],$A32),0))","v":""},{"$f":"IF(ISNA($A32),\"\",IFERROR(SUMIFS(D_D[PROD_FYTD],D_D[MT],6,D_D[CAT],SMS,D_D[LOC],$A32),0))","v":""},{"$f":"IF(ISNA($A32),\"\",IFERROR(SUMIFS(D_D[ADCF],D_D[MT],6,D_D[CAT],SMS,D_D[LOC],$A32),0))","v":""}]
[{"$error":"#N/A"},21,"",{"$f":"IF(ISNA($A33),\"\",IFERROR(SUMIFS(D_D[INV],D_D[MT],6,D_D[CAT],SMS,D_D[LOC],$A33),0))","v":""},{"$f":"IF(ISNA($A33),\"\",IFERROR(SUMIFS(D_D[BL],D_D[MT],6,D_D[CAT],SMS,D_D[LOC],$A33),0))","v":""},"",{"$f":"IF(ISNA($A33),\"\",IFERROR(SUMIFS(D_D[ADP],D_D[MT],6,D_D[CAT],SMS,D_D[LOC],$A33),0))","v":""},{"$f":"IF(ISNA($A33),\"\",IFERROR(SUMIFS(D_D[PROD_MTD],D_D[MT],6,D_D[CAT],SMS,D_D[LOC],$A33),0))","v":""},{"$f":"IF(ISNA($A33),\"\",IFERROR(SUMIFS(D_D[ADCM],D_D[MT],6,D_D[CAT],SMS,D_D[LOC],$A33),0))","v":""},{"$f":"IF(ISNA($A33),\"\",IFERROR(SUMIFS(D_D[PROD_FYTD],D_D[MT],6,D_D[CAT],SMS,D_D[LOC],$A33),0))","v":""},{"$f":"IF(ISNA($A33),\"\",IFERROR(SUMIFS(D_D[ADCF],D_D[MT],6,D_D[CAT],SMS,D_D[LOC],$A33),0))","v":""}]
[{"$error":"#N/A"},22,"",{"$f":"IF(ISNA($A34),\"\",IFERROR(SUMIFS(D_D[INV],D_D[MT],6,D_D[CAT],SMS,D_D[LOC],$A34),0))","v":""},{"$f":"IF(ISNA($A34),\"\",IFERROR(SUMIFS(D_D[BL],D_D[MT],6,D_D[CAT],SMS,D_D[LOC],$A34),0))","v":""},"",{"$f":"IF(ISNA($A34),\"\",IFERROR(SUMIFS(D_D[ADP],D_D[MT],6,D_D[CAT],SMS,D_D[LOC],$A34),0))","v":""},{"$f":"IF(ISNA($A34),\"\",IFERROR(SUMIFS(D_D[PROD_MTD],D_D[MT],6,D_D[CAT],SMS,D_D[LOC],$A34),0))","v":""},{"$f":"IF(ISNA($A34),\"\",IFERROR(SUMIFS(D_D[ADCM],D_D[MT],6,D_D[CAT],SMS,D_D[LOC],$A34),0))","v":""},{"$f":"IF(ISNA($A34),\"\",IFERROR(SUMIFS(D_D[PROD_FYTD],D_D[MT],6,D_D[CAT],SMS,D_D[LOC],$A34),0))","v":""},{"$f":"IF(ISNA($A34),\"\",IFERROR(SUMIFS(D_D[ADCF],D_D[MT],6,D_D[CAT],SMS,D_D[LOC],$A34),0))","v":""}]
[{"$error":"#N/A"},23,"",{"$f":"IF(ISNA($A35),\"\",IFERROR(SUMIFS(D_D[INV],D_D[MT],6,D_D[CAT],SMS,D_D[LOC],$A35),0))","v":""},{"$f":"IF(ISNA($A35),\"\",IFERROR(SUMIFS(D_D[BL],D_D[MT],6,D_D[CAT],SMS,D_D[LOC],$A35),0))","v":""},"",{"$f":"IF(ISNA($A35),\"\",IFERROR(SUMIFS(D_D[ADP],D_D[MT],6,D_D[CAT],SMS,D_D[LOC],$A35),0))","v":""},{"$f":"IF(ISNA($A35),\"\",IFERROR(SUMIFS(D_D[PROD_MTD],D_D[MT],6,D_D[CAT],SMS,D_D[LOC],$A35),0))","v":""},{"$f":"IF(ISNA($A35),\"\",IFERROR(SUMIFS(D_D[ADCM],D_D[MT],6,D_D[CAT],SMS,D_D[LOC],$A35),0))","v":""},{"$f":"IF(ISNA($A35),\"\",IFERROR(SUMIFS(D_D[PROD_FYTD],D_D[MT],6,D_D[CAT],SMS,D_D[LOC],$A35),0))","v":""},{"$f":"IF(ISNA($A35),\"\",IFERROR(SUMIFS(D_D[ADCF],D_D[MT],6,D_D[CAT],SMS,D_D[LOC],$A35),0))","v":""}]

{"sheet":"Rating Bundle - SOJ - NWQ","index":8,"n_rows":36,"n_cols":12,"rows_kept":36,"cut":false,"hidden":false,"merged":[[1,9,1,11],[2,9,2,11],[8,11,10,11],[8,7,10,7],[8,8,10,8],[1,3,1,8],[2,3,2,8],[5,3,5,8],[3,3,3,8],[4,3,4,8],[8,9,10,9],[8,10,10,10],[5,9,5,11],[8,3,10,3],[8,4,10,4],[8,5,10,5],[8,6,10,6],[7,3,7,6],[7,7,7,11],[6,3,6,8]]}
[]
[null,null,"DISTRICT SELECTOR","Compensation and Pension Rating Bundle Metrics",null,null,null,null,null,"Report through"]
[null,null,null,"NWQ-Station of Jurisdiction View",null,null,null,null,null,{"$f":"D_DT[]","v":"2022-05-28"}]
[null,null,null,"The Station of Jurisdiction (SOJ)  is the regional office assigned to work the claim",null,null,null,null,null,"ADP = Average Days Pending"]
[null,null,null,"Each Special Mission has distinct claim counts"]
[null,null,null,"When Special Mission is set to Pension, BDD, or Quickstart, the District Selector has",null,null,null,null,null,"Life Cycle Metrics defined on Legend tab"]
[null,null,null,"no impact"]
[null,null,null,"CLAIM METRICS",null,null,null,"LIFE CYCLE METRICS (as Percent of # Pending)"]
[null,null,"SPECIAL MISSION SELECTOR","#\nPending","#\nPending\n> 125 Days","%\nPending\n> 125 Days","ADP","Pending Development","Pending Evidence","Pending Decision","Pending Award","Pending Authorization"]
[]
[]
[100,null,{"$f":"Driver!$C$20& \" Total\"","v":"USA - All Missions Total"},{"$f":"IF(ISNA($A12),\"\",IFERROR(SUMIFS(D_D[INV],D_D[MT],5,D_D[CAT],SMS, D_D[EP],-1,D_D[LOC],$A12),0))","v":592345},{"$f":"IF(ISNA($A12),\"\",IFERROR(SUMIFS(D_D[BL],D_D[MT],5,D_D[CAT],SMS, D_D[EP],-1,D_D[LOC],$A12),0))","v":196852},{"$f":"IF(ISNA($A12),\"\",IFERROR(E12/D12,0))","v":0.33232660020764926},{"$f":"IF(ISNA($A12),\"\",IFERROR(SUMIFS(D_D[ADP],D_D[MT],5,D_D[CAT],SMS, D_D[EP],-1,D_D[LOC],$A12),0))","v":143.19},{"$f":"IF(ISNA($A12),\"\",IFERROR(SUMIFS(D_D[DEV],D_D[MT],5,D_D[CAT],SMS, D_D[EP],-1,D_D[LOC],$A12)/$D12,0))","v":3.4197975841781393E-2},{"$f":"IF(ISNA($A12),\"\",IFERROR(SUMIFS(D_D[EVD],D_D[MT],5,D_D[CAT],SMS, D_D[EP],-1,D_D[LOC],$A12)/$D12,0))","v":0.5769982020612987},{"$f":"IF(ISNA($A12),\"\",IFERROR(SUMIFS(D_D[DEC],D_D[MT],5,D_D[CAT],SMS, D_D[EP],-1,D_D[LOC],$A12)/$D12,0))","v":0.37792333859490668},{"$f":"IF(ISNA($A12),\"\",IFERROR(SUMIFS(D_D[AWD],D_D[MT],5,D_D[CAT],SMS, D_D[EP],-1,D_D[LOC],$A12)/$D12,0))","v":8.3363580345913284E-3},{"$f":"IF(ISNA($A12),\"\",IFERROR(SUMIFS(D_D[AUT],D_D[MT],5,D_D[CAT],SMS, D_D[EP],-1,D_D[LOC],$A12)/$D12,0))","v":2.5390608513619598E-3}]
[499,null,{"$f":"\"NWQ-\"&Driver!$C$20& \" Total\"","v":"NWQ-USA - All Missions Total"},{"$f":"IF(ISNA($A13),\"\",IFERROR(SUMIFS(D_D[INV],D_D[MT],5,D_D[CAT],SMS, D_D[EP],-1,D_D[LOC],$A13),0))","v":502855},{"$f":"IF(ISNA($A13),\"\",IFERROR(SUMIFS(D_D[BL],D_D[MT],5,D_D[CAT],SMS, D_D[EP],-1,D_D[LOC],$A13),0))","v":161540},{"$f":"IF(ISNA($A13),\"\",IFERROR(E13/D13,0))","v":0.32124568712650764},{"$f":"IF(ISNA($A13),\"\",IFERROR(SUMIFS(D_D[ADP],D_D[MT],5,D_D[CAT],SMS, D_D[EP],-1,D_D[LOC],$A13),0))","v":138.25},{"$f":"IF(ISNA($A13),\"\",IFERROR(SUMIFS(D_D[DEV],D_D[MT],5,D_D[CAT],SMS, D_D[EP],-1,D_D[LOC],$A13)/$D13,0))","v":1.8367123723538596E-2},{"$f":"IF(ISNA($A13),\"\",IFERROR(SUMIFS(D_D[EVD],D_D[MT],5,D_D[CAT],SMS, D_D[EP],-1,D_D[LOC],$A13)/$D13,0))","v":0.59416531604538092},{"$f":"IF(ISNA($A13),\"\",IFERROR(SUMIFS(D_D[DEC],D_D[MT],5,D_D[CAT],SMS, D_D[EP],-1,D_D[LOC],$A13)/$D13,0))","v":0.38676954589295126},{"$f":"IF(ISNA($A13),\"\",IFERROR(SUMIFS(D_D[AWD],D_D[MT],5,D_D[CAT],SMS, D_D[EP],-1,D_D[LOC],$A13)/$D13,0))","v":6.9005975877738112E-4},{"$f":"IF(ISNA($A13),\"\",IFERROR(SUMIFS(D_D[AUT],D_D[MT],5,D_D[CAT],SMS, D_D[EP],-1,D_D[LOC],$A13)/$D13,0))","v":7.9545793519006469E-6}]
[{"$f":"INDEX(RO,(MATCH($C14,RO_D,0)))","v":"395"},1,{"$f":"IFERROR(INDEX(INDIRECT(DS_RO),B14),\"\")","v":"Pacific District"},{"$f":"IF(ISNA($A14),\"\",IFERROR(SUMIFS(D_D[INV],D_D[MT],5,D_D[CAT],SMS, D_D[EP],-1,D_D[LOC],$A14),0))","v":17054},{"$f":"IF(ISNA($A14),\"\",IFERROR(SUMIFS(D_D[BL],D_D[MT],5,D_D[CAT],SMS, D_D[EP],-1,D_D[LOC],$A14),0))","v":6017},{"$f":"IF(ISNA($A14),\"\",IFERROR(E14/D14,0))","v":0.35282045267972323},{"$f":"IF(ISNA($A14),\"\",IFERROR(SUMIFS(D_D[ADP],D_D[MT],5,D_D[CAT],SMS, D_D[EP],-1,D_D[LOC],$A14),0))","v":144.81},{"$f":"IF(ISNA($A14),\"\",IFERROR(SUMIFS(D_D[DEV],D_D[MT],5,D_D[CAT],SMS, D_D[EP],-1,D_D[LOC],$A14)/$D14,0))","v":0.10613345842617568},{"$f":"IF(ISNA($A14),\"\",IFERROR(SUMIFS(D_D[EVD],D_D[MT],5,D_D[CAT],SMS, D_D[EP],-1,D_D[LOC],$A14)/$D14,0))","v":0.43338806145185882},{"$f":"IF(ISNA($A14),\"\",IFERROR(SUMIFS(D_D[DEC],D_D[MT],5,D_D[CAT],SMS, D_D[EP],-1,D_D[LOC],$A14)/$D14,0))","v":0.36507564207810483},{"$f":"IF(ISNA($A14),\"\",IFERROR(SUMIFS(D_D[AWD],D_D[MT],5,D_D[CAT],SMS, D_D[EP],-1,D_D[LOC],$A14)/$D14,0))","v":7.5524803565146001E-2},{"$f":"IF(ISNA($A14),\"\",IFERROR(SUMIFS(D_D[AUT],D_D[MT],5,D_D[CAT],SMS, D_D[EP],-1,D_D[LOC],$A14)/$D14,0))","v":1.9878034478714671E-2}]
["340",2,{"$f":"IFERROR(INDEX(INDIRECT(DS_RO),B15),\"\")","v":"Albuquerque"},{"$f":"IF(ISNA($A15),\"\",IFERROR(SUMIFS(D_D[INV],D_D[MT],5,D_D[CAT],SMS, D_D[EP],-1,D_D[LOC],$A15),0))","v":525},{"$f":"IF(ISNA($A15),\"\",IFERROR(SUMIFS(D_D[BL],D_D[MT],5,D_D[CAT],SMS, D_D[EP],-1,D_D[LOC],$A15),0))","v":170},{"$f":"IF(ISNA($A15),\"\",IFERROR(E15/D15,0))","v":0.32380952380952382},{"$f":"IF(ISNA($A15),\"\",IFERROR(SUMIFS(D_D[ADP],D_D[MT],5,D_D[CAT],SMS, D_D[EP],-1,D_D[LOC],$A15),0))","v":118.42},{"$f":"IF(ISNA($A15),\"\",IFERROR(SUMIFS(D_D[DEV],D_D[MT],5,D_D[CAT],SMS, D_D[EP],-1,D_D[LOC],$A15)/$D15,0))","v":0.16190476190476191},{"$f":"IF(ISNA($A15),\"\",IFERROR(SUMIFS(D_D[EVD],D_D[MT],5,D_D[CAT],SMS, D_D[EP],-1,D_D[LOC],$A15)/$D15,0))","v":0.39047619047619048},{"$f":"IF(ISNA($A15),\"\",IFERROR(SUMIFS(D_D[DEC],D_D[MT],5,D_D[CAT],SMS, D_D[EP],-1,D_D[LOC],$A15)/$D15,0))","v":0.36571428571428571},{"$f":"IF(ISNA($A15),\"\",IFERROR(SUMIFS(D_D[AWD],D_D[MT],5,D_D[CAT],SMS, D_D[EP],-1,D_D[LOC],$A15)/$D15,0))","v":6.8571428571428575E-2},{"$f":"IF(ISNA($A15),\"\",IFERROR(SUMIFS(D_D[AUT],D_D[MT],5,D_D[CAT],SMS, D_D[EP],-1,D_D[LOC],$A15)/$D15,0))","v":1.3333333333333334E-2}]
["463",3,"Anchorage",{"$f":"IF(ISNA($A16),\"\",IFERROR(SUMIFS(D_D[INV],D_D[MT],5,D_D[CAT],SMS, D_D[EP],-1,D_D[LOC],$A16),0))","v":231},{"$f":"IF(ISNA($A16),\"\",IFERROR(SUMIFS(D_D[BL],D_D[MT],5,D_D[CAT],SMS, D_D[EP],-1,D_D[LOC],$A16),0))","v":103},0.44588744588744589,{"$f":"IF(ISNA($A16),\"\",IFERROR(SUMIFS(D_D[ADP],D_D[MT],5,D_D[CAT],SMS, D_D[EP],-1,D_D[LOC],$A16),0))","v":153.07},{"$f":"IF(ISNA($A16),\"\",IFERROR(SUMIFS(D_D[DEV],D_D[MT],5,D_D[CAT],SMS, D_D[EP],-1,D_D[LOC],$A16)/$D16,0))","v":0.16450216450216451},{"$f":"IF(ISNA($A16),\"\",IFERROR(SUMIFS(D_D[EVD],D_D[MT],5,D_D[CAT],SMS, D_D[EP],-1,D_D[LOC],$A16)/$D16,0))","v":0.41991341991341991},{"$f":"IF(ISNA($A16),\"\",IFERROR(SUMIFS(D_D[DEC],D_D[MT],5,D_D[CAT],SMS, D_D[EP],-1,D_D[LOC],$A16)/$D16,0))","v":0.32034632034632032},{"$f":"IF(ISNA($A16),\"\",IFERROR(SUMIFS(D_D[AWD],D_D[MT],5,D_D[CAT],SMS, D_D[EP],-1,D_D[LOC],$A16)/$D16,0))","v":8.2251082251082255E-2},{"$f":"IF(ISNA($A16),\"\",IFERROR(SUMIFS(D_D[AUT],D_D[MT],5,D_D[CAT],SMS, D_D[EP],-1,D_D[LOC],$A16)/$D16,0))","v":1.2987012987012988E-2}]
["347",4,"Boise",{"$f":"IF(ISNA($A17),\"\",IFERROR(SUMIFS(D_D[INV],D_D[MT],5,D_D[CAT],SMS, D_D[EP],-1,D_D[LOC],$A17),0))","v":595},{"$f":"IF(ISNA($A17),\"\",IFERROR(SUMIFS(D_D[BL],D_D[MT],5,D_D[CAT],SMS, D_D[EP],-1,D_D[LOC],$A17),0))","v":107},0.17983193277310924,{"$f":"IF(ISNA($A17),\"\",IFERROR(SUMIFS(D_D[ADP],D_D[MT],5,D_D[CAT],SMS, D_D[EP],-1,D_D[LOC],$A17),0))","v":91.82},{"$f":"IF(ISNA($A17),\"\",IFERROR(SUMIFS(D_D[DEV],D_D[MT],5,D_D[CAT],SMS, D_D[EP],-1,D_D[LOC],$A17)/$D17,0))","v":0.12773109243697478},{"$f":"IF(ISNA($A17),\"\",IFERROR(SUMIFS(D_D[EVD],D_D[MT],5,D_D[CAT],SMS, D_D[EP],-1,D_D[LOC],$A17)/$D17,0))","v":0.24033613445378152},{"$f":"IF(ISNA($A17),\"\",IFERROR(SUMIFS(D_D[DEC],D_D[MT],5,D_D[CAT],SMS, D_D[EP],-1,D_D[LOC],$A17)/$D17,0))","v":0.41848739495798321},{"$f":"IF(ISNA($A17),\"\",IFERROR(SUMIFS(D_D[AWD],D_D[MT],5,D_D[CAT],SMS, D_D[EP],-1,D_D[LOC],$A17)/$D17,0))","v":0.16638655462184873},{"$f":"IF(ISNA($A17),\"\",IFERROR(SUMIFS(D_D[AUT],D_D[MT],5,D_D[CAT],SMS, D_D[EP],-1,D_D[LOC],$A17)/$D17,0))","v":4.7058823529411764E-2}]
["459",5,"Honolulu",{"$f":"IF(ISNA($A18),\"\",IFERROR(SUMIFS(D_D[INV],D_D[MT],5,D_D[CAT],SMS, D_D[EP],-1,D_D[LOC],$A18),0))","v":329},{"$f":"IF(ISNA($A18),\"\",IFERROR(SUMIFS(D_D[BL],D_D[MT],5,D_D[CAT],SMS, D_D[EP],-1,D_D[LOC],$A18),0))","v":100},0.303951367781155,{"$f":"IF(ISNA($A18),\"\",IFERROR(SUMIFS(D_D[ADP],D_D[MT],5,D_D[CAT],SMS, D_D[EP],-1,D_D[LOC],$A18),0))","v":113.45},{"$f":"IF(ISNA($A18),\"\",IFERROR(SUMIFS(D_D[DEV],D_D[MT],5,D_D[CAT],SMS, D_D[EP],-1,D_D[LOC],$A18)/$D18,0))","v":0.12462006079027356},{"$f":"IF(ISNA($A18),\"\",IFERROR(SUMIFS(D_D[EVD],D_D[MT],5,D_D[CAT],SMS, D_D[EP],-1,D_D[LOC],$A18)/$D18,0))","v":0.40729483282674772},{"$f":"IF(ISNA($A18),\"\",IFERROR(SUMIFS(D_D[DEC],D_D[MT],5,D_D[CAT],SMS, D_D[EP],-1,D_D[LOC],$A18)/$D18,0))","v":0.46200607902735563},{"$f":"IF(ISNA($A18),\"\",IFERROR(SUMIFS(D_D[AWD],D_D[MT],5,D_D[CAT],SMS, D_D[EP],-1,D_D[LOC],$A18)/$D18,0))","v":6.0790273556231003E-3},{"$f":"IF(ISNA($A18),\"\",IFERROR(SUMIFS(D_D[AUT],D_D[MT],5,D_D[CAT],SMS, D_D[EP],-1,D_D[LOC],$A18)/$D18,0))","v":0}]
["344",6,"Los Angeles",{"$f":"IF(ISNA($A19),\"\",IFERROR(SUMIFS(D_D[INV],D_D[MT],5,D_D[CAT],SMS, D_D[EP],-1,D_D[LOC],$A19),0))","v":1524},{"$f":"IF(ISNA($A19),\"\",IFERROR(SUMIFS(D_D[BL],D_D[MT],5,D_D[CAT],SMS, D_D[EP],-1,D_D[LOC],$A19),0))","v":505},0.33136482939632544,{"$f":"IF(ISNA($A19),\"\",IFERROR(SUMIFS(D_D[ADP],D_D[MT],5,D_D[CAT],SMS, D_D[EP],-1,D_D[LOC],$A19),0))","v":132.22999999999999},{"$f":"IF(ISNA($A19),\"\",IFERROR(SUMIFS(D_D[DEV],D_D[MT],5,D_D[CAT],SMS, D_D[EP],-1,D_D[LOC],$A19)/$D19,0))","v":0.14238845144356954},{"$f":"IF(ISNA($A19),\"\",IFERROR(SUMIFS(D_D[EVD],D_D[MT],5,D_D[CAT],SMS, D_D[EP],-1,D_D[LOC],$A19)/$D19,0))","v":0.46850393700787402},{"$f":"IF(ISNA($A19),\"\",IFERROR(SUMIFS(D_D[DEC],D_D[MT],5,D_D[CAT],SMS, D_D[EP],-1,D_D[LOC],$A19)/$D19,0))","v":0.36942257217847768},{"$f":"IF(ISNA($A19),\"\",IFERROR(SUMIFS(D_D[AWD],D_D[MT],5,D_D[CAT],SMS, D_D[EP],-1,D_D[LOC],$A19)/$D19,0))","v":9.1863517060367453E-3},{"$f":"IF(ISNA($A19),\"\",IFERROR(SUMIFS(D_D[AUT],D_D[MT],5,D_D[CAT],SMS, D_D[EP],-1,D_D[LOC],$A19)/$D19,0))","v":1.0498687664041995E-2}]
["358",7,"Manila",{"$f":"IF(ISNA($A20),\"\",IFERROR(SUMIFS(D_D[INV],D_D[MT],5,D_D[CAT],SMS, D_D[EP],-1,D_D[LOC],$A20),0))","v":253},{"$f":"IF(ISNA($A20),\"\",IFERROR(SUMIFS(D_D[BL],D_D[MT],5,D_D[CAT],SMS, D_D[EP],-1,D_D[LOC],$A20),0))","v":114},0.45059288537549408,{"$f":"IF(ISNA($A20),\"\",IFERROR(SUMIFS(D_D[ADP],D_D[MT],5,D_D[CAT],SMS, D_D[EP],-1,D_D[LOC],$A20),0))","v":166.9},{"$f":"IF(ISNA($A20),\"\",IFERROR(SUMIFS(D_D[DEV],D_D[MT],5,D_D[CAT],SMS, D_D[EP],-1,D_D[LOC],$A20)/$D20,0))","v":6.7193675889328064E-2},{"$f":"IF(ISNA($A20),\"\",IFERROR(SUMIFS(D_D[EVD],D_D[MT],5,D_D[CAT],SMS, D_D[EP],-1,D_D[LOC],$A20)/$D20,0))","v":0.59288537549407117},{"$f":"IF(ISNA($A20),\"\",IFERROR(SUMIFS(D_D[DEC],D_D[MT],5,D_D[CAT],SMS, D_D[EP],-1,D_D[LOC],$A20)/$D20,0))","v":0.26877470355731226},{"$f":"IF(ISNA($A20),\"\",IFERROR(SUMIFS(D_D[AWD],D_D[MT],5,D_D[CAT],SMS, D_D[EP],-1,D_D[LOC],$A20)/$D20,0))","v":6.3241106719367585E-2},{"$f":"IF(ISNA($A20),\"\",IFERROR(SUMIFS(D_D[AUT],D_D[MT],5,D_D[CAT],SMS, D_D[EP],-1,D_D[LOC],$A20)/$D20,0))","v":7.9051383399209481E-3}]
["343",8,"Oakland",{"$f":"IF(ISNA($A21),\"\",IFERROR(SUMIFS(D_D[INV],D_D[MT],5,D_D[CAT],SMS, D_D[EP],-1,D_D[LOC],$A21),0))","v":1060},{"$f":"IF(ISNA($A21),\"\",IFERROR(SUMIFS(D_D[BL],D_D[MT],5,D_D[CAT],SMS, D_D[EP],-1,D_D[LOC],$A21),0))","v":483},0.45566037735849058,{"$f":"IF(ISNA($A21),\"\",IFERROR(SUMIFS(D_D[ADP],D_D[MT],5,D_D[CAT],SMS, D_D[EP],-1,D_D[LOC],$A21),0))","v":191.69},{"$f":"IF(ISNA($A21),\"\",IFERROR(SUMIFS(D_D[DEV],D_D[MT],5,D_D[CAT],SMS, D_D[EP],-1,D_D[LOC],$A21)/$D21,0))","v":0.14433962264150943},{"$f":"IF(ISNA($A21),\"\",IFERROR(SUMIFS(D_D[EVD],D_D[MT],5,D_D[CAT],SMS, D_D[EP],-1,D_D[LOC],$A21)/$D21,0))","v":0.39245283018867927},{"$f":"IF(ISNA($A21),\"\",IFERROR(SUMIFS(D_D[DEC],D_D[MT],5,D_D[CAT],SMS, D_D[EP],-1,D_D[LOC],$A21)/$D21,0))","v":0.40566037735849059},{"$f":"IF(ISNA($A21),\"\",IFERROR(SUMIFS(D_D[AWD],D_D[MT],5,D_D[CAT],SMS, D_D[EP],-1,D_D[LOC],$A21)/$D21,0))","v":4.6226415094339619E-2},{"$f":"IF(ISNA($A21),\"\",IFERROR(SUMIFS(D_D[AUT],D_D[MT],5,D_D[CAT],SMS, D_D[EP],-1,D_D[LOC],$A21)/$D21,0))","v":1.1320754716981131E-2}]
["345",9,"Phoenix",{"$f":"IF(ISNA($A22),\"\",IFERROR(SUMIFS(D_D[INV],D_D[MT],5,D_D[CAT],SMS, D_D[EP],-1,D_D[LOC],$A22),0))","v":2276},{"$f":"IF(ISNA($A22),\"\",IFERROR(SUMIFS(D_D[BL],D_D[MT],5,D_D[CAT],SMS, D_D[EP],-1,D_D[LOC],$A22),0))","v":996},0.43760984182776802,{"$f":"IF(ISNA($A22),\"\",IFERROR(SUMIFS(D_D[ADP],D_D[MT],5,D_D[CAT],SMS, D_D[EP],-1,D_D[LOC],$A22),0))","v":188.52},{"$f":"IF(ISNA($A22),\"\",IFERROR(SUMIFS(D_D[DEV],D_D[MT],5,D_D[CAT],SMS, D_D[EP],-1,D_D[LOC],$A22)/$D22,0))","v":0.10588752196836555},{"$f":"IF(ISNA($A22),\"\",IFERROR(SUMIFS(D_D[EVD],D_D[MT],5,D_D[CAT],SMS, D_D[EP],-1,D_D[LOC],$A22)/$D22,0))","v":0.50263620386643237},{"$f":"IF(ISNA($A22),\"\",IFERROR(SUMIFS(D_D[DEC],D_D[MT],5,D_D[CAT],SMS, D_D[EP],-1,D_D[LOC],$A22)/$D22,0))","v":0.29964850615114236},{"$f":"IF(ISNA($A22),\"\",IFERROR(SUMIFS(D_D[AWD],D_D[MT],5,D_D[CAT],SMS, D_D[EP],-1,D_D[LOC],$A22)/$D22,0))","v":8.5676625659050973E-2},{"$f":"IF(ISNA($A22),\"\",IFERROR(SUMIFS(D_D[AUT],D_D[MT],5,D_D[CAT],SMS, D_D[EP],-1,D_D[LOC],$A22)/$D22,0))","v":6.1511423550087872E-3}]
["348",10,"Portland",{"$f":"IF(ISNA($A23),\"\",IFERROR(SUMIFS(D_D[INV],D_D[MT],5,D_D[CAT],SMS, D_D[EP],-1,D_D[LOC],$A23),0))","v":1565},{"$f":"IF(ISNA($A23),\"\",IFERROR(SUMIFS(D_D[BL],D_D[MT],5,D_D[CAT],SMS, D_D[EP],-1,D_D[LOC],$A23),0))","v":672},0.42939297124600639,{"$f":"IF(ISNA($A23),\"\",IFERROR(SUMIFS(D_D[ADP],D_D[MT],5,D_D[CAT],SMS, D_D[EP],-1,D_D[LOC],$A23),0))","v":158.01},{"$f":"IF(ISNA($A23),\"\",IFERROR(SUMIFS(D_D[DEV],D_D[MT],5,D_D[CAT],SMS, D_D[EP],-1,D_D[LOC],$A23)/$D23,0))","v":0.1073482428115016},{"$f":"IF(ISNA($A23),\"\",IFERROR(SUMIFS(D_D[EVD],D_D[MT],5,D_D[CAT],SMS, D_D[EP],-1,D_D[LOC],$A23)/$D23,0))","v":0.60766773162939303},{"$f":"IF(ISNA($A23),\"\",IFERROR(SUMIFS(D_D[DEC],D_D[MT],5,D_D[CAT],SMS, D_D[EP],-1,D_D[LOC],$A23)/$D23,0))","v":0.25495207667731629},{"$f":"IF(ISNA($A23),\"\",IFERROR(SUMIFS(D_D[AWD],D_D[MT],5,D_D[CAT],SMS, D_D[EP],-1,D_D[LOC],$A23)/$D23,0))","v":1.9169329073482427E-2},{"$f":"IF(ISNA($A23),\"\",IFERROR(SUMIFS(D_D[AUT],D_D[MT],5,D_D[CAT],SMS, D_D[EP],-1,D_D[LOC],$A23)/$D23,0))","v":1.0862619808306708E-2}]
["354",11,"Reno",{"$f":"IF(ISNA($A24),\"\",IFERROR(SUMIFS(D_D[INV],D_D[MT],5,D_D[CAT],SMS, D_D[EP],-1,D_D[LOC],$A24),0))","v":509},{"$f":"IF(ISNA($A24),\"\",IFERROR(SUMIFS(D_D[BL],D_D[MT],5,D_D[CAT],SMS, D_D[EP],-1,D_D[LOC],$A24),0))","v":165},0.32416502946954812,{"$f":"IF(ISNA($A24),\"\",IFERROR(SUMIFS(D_D[ADP],D_D[MT],5,D_D[CAT],SMS, D_D[EP],-1,D_D[LOC],$A24),0))","v":135.78},{"$f":"IF(ISNA($A24),\"\",IFERROR(SUMIFS(D_D[DEV],D_D[MT],5,D_D[CAT],SMS, D_D[EP],-1,D_D[LOC],$A24)/$D24,0))","v":0.29273084479371314},{"$f":"IF(ISNA($A24),\"\",IFERROR(SUMIFS(D_D[EVD],D_D[MT],5,D_D[CAT],SMS, D_D[EP],-1,D_D[LOC],$A24)/$D24,0))","v":0.35952848722986247},{"$f":"IF(ISNA($A24),\"\",IFERROR(SUMIFS(D_D[DEC],D_D[MT],5,D_D[CAT],SMS, D_D[EP],-1,D_D[LOC],$A24)/$D24,0))","v":0.31237721021611004},{"$f":"IF(ISNA($A24),\"\",IFERROR(SUMIFS(D_D[AWD],D_D[MT],5,D_D[CAT],SMS, D_D[EP],-1,D_D[LOC],$A24)/$D24,0))","v":2.75049115913556E-2},{"$f":"IF(ISNA($A24),\"\",IFERROR(SUMIFS(D_D[AUT],D_D[MT],5,D_D[CAT],SMS, D_D[EP],-1,D_D[LOC],$A24)/$D24,0))","v":7.8585461689587421E-3}]
["341",12,"Salt Lake City",{"$f":"IF(ISNA($A25),\"\",IFERROR(SUMIFS(D_D[INV],D_D[MT],5,D_D[CAT],SMS, D_D[EP],-1,D_D[LOC],$A25),0))","v":1967},{"$f":"IF(ISNA($A25),\"\",IFERROR(SUMIFS(D_D[BL],D_D[MT],5,D_D[CAT],SMS, D_D[EP],-1,D_D[LOC],$A25),0))","v":1002},0.50940518556176917,{"$f":"IF(ISNA($A25),\"\",IFERROR(SUMIFS(D_D[ADP],D_D[MT],5,D_D[CAT],SMS, D_D[EP],-1,D_D[LOC],$A25),0))","v":210.33},{"$f":"IF(ISNA($A25),\"\",IFERROR(SUMIFS(D_D[DEV],D_D[MT],5,D_D[CAT],SMS, D_D[EP],-1,D_D[LOC],$A25)/$D25,0))","v":7.9816980172852062E-2},{"$f":"IF(ISNA($A25),\"\",IFERROR(SUMIFS(D_D[EVD],D_D[MT],5,D_D[CAT],SMS, D_D[EP],-1,D_D[LOC],$A25)/$D25,0))","v":0.43670564311133708},{"$f":"IF(ISNA($A25),\"\",IFERROR(SUMIFS(D_D[DEC],D_D[MT],5,D_D[CAT],SMS, D_D[EP],-1,D_D[LOC],$A25)/$D25,0))","v":0.26944585663446874},{"$f":"IF(ISNA($A25),\"\",IFERROR(SUMIFS(D_D[AWD],D_D[MT],5,D_D[CAT],SMS, D_D[EP],-1,D_D[LOC],$A25)/$D25,0))","v":0.20742247076766648},{"$f":"IF(ISNA($A25),\"\",IFERROR(SUMIFS(D_D[AUT],D_D[MT],5,D_D[CAT],SMS, D_D[EP],-1,D_D[LOC],$A25)/$D25,0))","v":6.6090493136756485E-3}]
["377",13,"San Diego",{"$f":"IF(ISNA($A26),\"\",IFERROR(SUMIFS(D_D[INV],D_D[MT],5,D_D[CAT],SMS, D_D[EP],-1,D_D[LOC],$A26),0))","v":2940},{"$f":"IF(ISNA($A26),\"\",IFERROR(SUMIFS(D_D[BL],D_D[MT],5,D_D[CAT],SMS, D_D[EP],-1,D_D[LOC],$A26),0))","v":875},0.29761904761904762,{"$f":"IF(ISNA($A26),\"\",IFERROR(SUMIFS(D_D[ADP],D_D[MT],5,D_D[CAT],SMS, D_D[EP],-1,D_D[LOC],$A26),0))","v":123.81},{"$f":"IF(ISNA($A26),\"\",IFERROR(SUMIFS(D_D[DEV],D_D[MT],5,D_D[CAT],SMS, D_D[EP],-1,D_D[LOC],$A26)/$D26,0))","v":7.0748299319727898E-2},{"$f":"IF(ISNA($A26),\"\",IFERROR(SUMIFS(D_D[EVD],D_D[MT],5,D_D[CAT],SMS, D_D[EP],-1,D_D[LOC],$A26)/$D26,0))","v":0.47176870748299321},{"$f":"IF(ISNA($A26),\"\",IFERROR(SUMIFS(D_D[DEC],D_D[MT],5,D_D[CAT],SMS, D_D[EP],-1,D_D[LOC],$A26)/$D26,0))","v":0.4051020408163265},{"$f":"IF(ISNA($A26),\"\",IFERROR(SUMIFS(D_D[AWD],D_D[MT],5,D_D[CAT],SMS, D_D[EP],-1,D_D[LOC],$A26)/$D26,0))","v":4.3537414965986392E-2},{"$f":"IF(ISNA($A26),\"\",IFERROR(SUMIFS(D_D[AUT],D_D[MT],5,D_D[CAT],SMS, D_D[EP],-1,D_D[LOC],$A26)/$D26,0))","v":8.8435374149659872E-3}]
["346",14,"Seattle",{"$f":"IF(ISNA($A27),\"\",IFERROR(SUMIFS(D_D[INV],D_D[MT],5,D_D[CAT],SMS, D_D[EP],-1,D_D[LOC],$A27),0))","v":3280},{"$f":"IF(ISNA($A27),\"\",IFERROR(SUMIFS(D_D[BL],D_D[MT],5,D_D[CAT],SMS, D_D[EP],-1,D_D[LOC],$A27),0))","v":725},0.22103658536585366,{"$f":"IF(ISNA($A27),\"\",IFERROR(SUMIFS(D_D[ADP],D_D[MT],5,D_D[CAT],SMS, D_D[EP],-1,D_D[LOC],$A27),0))","v":94.49},{"$f":"IF(ISNA($A27),\"\",IFERROR(SUMIFS(D_D[DEV],D_D[MT],5,D_D[CAT],SMS, D_D[EP],-1,D_D[LOC],$A27)/$D27,0))","v":7.926829268292683E-2},{"$f":"IF(ISNA($A27),\"\",IFERROR(SUMIFS(D_D[EVD],D_D[MT],5,D_D[CAT],SMS, D_D[EP],-1,D_D[LOC],$A27)/$D27,0))","v":0.3073170731707317},{"$f":"IF(ISNA($A27),\"\",IFERROR(SUMIFS(D_D[DEC],D_D[MT],5,D_D[CAT],SMS, D_D[EP],-1,D_D[LOC],$A27)/$D27,0))","v":0.46859756097560978},{"$f":"IF(ISNA($A27),\"\",IFERROR(SUMIFS(D_D[AWD],D_D[MT],5,D_D[CAT],SMS, D_D[EP],-1,D_D[LOC],$A27)/$D27,0))","v":8.4756097560975616E-2},{"$f":"IF(ISNA($A27),\"\",IFERROR(SUMIFS(D_D[AUT],D_D[MT],5,D_D[CAT],SMS, D_D[EP],-1,D_D[LOC],$A27)/$D27,0))","v":6.0060975609756095E-2}]
[{"$error":"#N/A"},15,"",{"$f":"IF(ISNA($A28),\"\",IFERROR(SUMIFS(D_D[INV],D_D[MT],5,D_D[CAT],SMS, D_D[EP],-1,D_D[LOC],$A28),0))","v":""},{"$f":"IF(ISNA($A28),\"\",IFERROR(SUMIFS(D_D[BL],D_D[MT],5,D_D[CAT],SMS, D_D[EP],-1,D_D[LOC],$A28),0))","v":""},"",{"$f":"IF(ISNA($A28),\"\",IFERROR(SUMIFS(D_D[ADP],D_D[MT],5,D_D[CAT],SMS, D_D[EP],-1,D_D[LOC],$A28),0))","v":""},{"$f":"IF(ISNA($A28),\"\",IFERROR(SUMIFS(D_D[DEV],D_D[MT],5,D_D[CAT],SMS, D_D[EP],-1,D_D[LOC],$A28)/$D28,0))","v":""},{"$f":"IF(ISNA($A28),\"\",IFERROR(SUMIFS(D_D[EVD],D_D[MT],5,D_D[CAT],SMS, D_D[EP],-1,D_D[LOC],$A28)/$D28,0))","v":""},{"$f":"IF(ISNA($A28),\"\",IFERROR(SUMIFS(D_D[DEC],D_D[MT],5,D_D[CAT],SMS, D_D[EP],-1,D_D[LOC],$A28)/$D28,0))","v":""},{"$f":"IF(ISNA($A28),\"\",IFERROR(SUMIFS(D_D[AWD],D_D[MT],5,D_D[CAT],SMS, D_D[EP],-1,D_D[LOC],$A28)/$D28,0))","v":""},{"$f":"IF(ISNA($A28),\"\",IFERROR(SUMIFS(D_D[AUT],D_D[MT],5,D_D[CAT],SMS, D_D[EP],-1,D_D[LOC],$A28)/$D28,0))","v":""}]
[{"$error":"#N/A"},16,"",{"$f":"IF(ISNA($A29),\"\",IFERROR(SUMIFS(D_D[INV],D_D[MT],5,D_D[CAT],SMS, D_D[EP],-1,D_D[LOC],$A29),0))","v":""},{"$f":"IF(ISNA($A29),\"\",IFERROR(SUMIFS(D_D[BL],D_D[MT],5,D_D[CAT],SMS, D_D[EP],-1,D_D[LOC],$A29),0))","v":""},"",{"$f":"IF(ISNA($A29),\"\",IFERROR(SUMIFS(D_D[ADP],D_D[MT],5,D_D[CAT],SMS, D_D[EP],-1,D_D[LOC],$A29),0))","v":""},{"$f":"IF(ISNA($A29),\"\",IFERROR(SUMIFS(D_D[DEV],D_D[MT],5,D_D[CAT],SMS, D_D[EP],-1,D_D[LOC],$A29)/$D29,0))","v":""},{"$f":"IF(ISNA($A29),\"\",IFERROR(SUMIFS(D_D[EVD],D_D[MT],5,D_D[CAT],SMS, D_D[EP],-1,D_D[LOC],$A29)/$D29,0))","v":""},{"$f":"IF(ISNA($A29),\"\",IFERROR(SUMIFS(D_D[DEC],D_D[MT],5,D_D[CAT],SMS, D_D[EP],-1,D_D[LOC],$A29)/$D29,0))","v":""},{"$f":"IF(ISNA($A29),\"\",IFERROR(SUMIFS(D_D[AWD],D_D[MT],5,D_D[CAT],SMS, D_D[EP],-1,D_D[LOC],$A29)/$D29,0))","v":""},{"$f":"IF(ISNA($A29),\"\",IFERROR(SUMIFS(D_D[AUT],D_D[MT],5,D_D[CAT],SMS, D_D[EP],-1,D_D[LOC],$A29)/$D29,0))","v":""}]
[{"$error":"#N/A"},17,"",{"$f":"IF(ISNA($A30),\"\",IFERROR(SUMIFS(D_D[INV],D_D[MT],5,D_D[CAT],SMS, D_D[EP],-1,D_D[LOC],$A30),0))","v":""},{"$f":"IF(ISNA($A30),\"\",IFERROR(SUMIFS(D_D[BL],D_D[MT],5,D_D[CAT],SMS, D_D[EP],-1,D_D[LOC],$A30),0))","v":""},"",{"$f":"IF(ISNA($A30),\"\",IFERROR(SUMIFS(D_D[ADP],D_D[MT],5,D_D[CAT],SMS, D_D[EP],-1,D_D[LOC],$A30),0))","v":""},{"$f":"IF(ISNA($A30),\"\",IFERROR(SUMIFS(D_D[DEV],D_D[MT],5,D_D[CAT],SMS, D_D[EP],-1,D_D[LOC],$A30)/$D30,0))","v":""},{"$f":"IF(ISNA($A30),\"\",IFERROR(SUMIFS(D_D[EVD],D_D[MT],5,D_D[CAT],SMS, D_D[EP],-1,D_D[LOC],$A30)/$D30,0))","v":""},{"$f":"IF(ISNA($A30),\"\",IFERROR(SUMIFS(D_D[DEC],D_D[MT],5,D_D[CAT],SMS, D_D[EP],-1,D_D[LOC],$A30)/$D30,0))","v":""},{"$f":"IF(ISNA($A30),\"\",IFERROR(SUMIFS(D_D[AWD],D_D[MT],5,D_D[CAT],SMS, D_D[EP],-1,D_D[LOC],$A30)/$D30,0))","v":""},{"$f":"IF(ISNA($A30),\"\",IFERROR(SUMIFS(D_D[AUT],D_D[MT],5,D_D[CAT],SMS, D_D[EP],-1,D_D[LOC],$A30)/$D30,0))","v":""}]
[{"$error":"#N/A"},18,"",{"$f":"IF(ISNA($A31),\"\",IFERROR(SUMIFS(D_D[INV],D_D[MT],5,D_D[CAT],SMS, D_D[EP],-1,D_D[LOC],$A31),0))","v":""},{"$f":"IF(ISNA($A31),\"\",IFERROR(SUMIFS(D_D[BL],D_D[MT],5,D_D[CAT],SMS, D_D[EP],-1,D_D[LOC],$A31),0))","v":""},"",{"$f":"IF(ISNA($A31),\"\",IFERROR(SUMIFS(D_D[ADP],D_D[MT],5,D_D[CAT],SMS, D_D[EP],-1,D_D[LOC],$A31),0))","v":""},{"$f":"IF(ISNA($A31),\"\",IFERROR(SUMIFS(D_D[DEV],D_D[MT],5,D_D[CAT],SMS, D_D[EP],-1,D_D[LOC],$A31)/$D31,0))","v":""},{"$f":"IF(ISNA($A31),\"\",IFERROR(SUMIFS(D_D[EVD],D_D[MT],5,D_D[CAT],SMS, D_D[EP],-1,D_D[LOC],$A31)/$D31,0))","v":""},{"$f":"IF(ISNA($A31),\"\",IFERROR(SUMIFS(D_D[DEC],D_D[MT],5,D_D[CAT],SMS, D_D[EP],-1,D_D[LOC],$A31)/$D31,0))","v":""},{"$f":"IF(ISNA($A31),\"\",IFERROR(SUMIFS(D_D[AWD],D_D[MT],5,D_D[CAT],SMS, D_D[EP],-1,D_D[LOC],$A31)/$D31,0))","v":""},{"$f":"IF(ISNA($A31),\"\",IFERROR(SUMIFS(D_D[AUT],D_D[MT],5,D_D[CAT],SMS, D_D[EP],-1,D_D[LOC],$A31)/$D31,0))","v":""}]
[{"$error":"#N/A"},19,"",{"$f":"IF(ISNA($A32),\"\",IFERROR(SUMIFS(D_D[INV],D_D[MT],5,D_D[CAT],SMS, D_D[EP],-1,D_D[LOC],$A32),0))","v":""},{"$f":"IF(ISNA($A32),\"\",IFERROR(SUMIFS(D_D[BL],D_D[MT],5,D_D[CAT],SMS, D_D[EP],-1,D_D[LOC],$A32),0))","v":""},"",{"$f":"IF(ISNA($A32),\"\",IFERROR(SUMIFS(D_D[ADP],D_D[MT],5,D_D[CAT],SMS, D_D[EP],-1,D_D[LOC],$A32),0))","v":""},{"$f":"IF(ISNA($A32),\"\",IFERROR(SUMIFS(D_D[DEV],D_D[MT],5,D_D[CAT],SMS, D_D[EP],-1,D_D[LOC],$A32)/$D32,0))","v":""},{"$f":"IF(ISNA($A32),\"\",IFERROR(SUMIFS(D_D[EVD],D_D[MT],5,D_D[CAT],SMS, D_D[EP],-1,D_D[LOC],$A32)/$D32,0))","v":""},{"$f":"IF(ISNA($A32),\"\",IFERROR(SUMIFS(D_D[DEC],D_D[MT],5,D_D[CAT],SMS, D_D[EP],-1,D_D[LOC],$A32)/$D32,0))","v":""},{"$f":"IF(ISNA($A32),\"\",IFERROR(SUMIFS(D_D[AWD],D_D[MT],5,D_D[CAT],SMS, D_D[EP],-1,D_D[LOC],$A32)/$D32,0))","v":""},{"$f":"IF(ISNA($A32),\"\",IFERROR(SUMIFS(D_D[AUT],D_D[MT],5,D_D[CAT],SMS, D_D[EP],-1,D_D[LOC],$A32)/$D32,0))","v":""}]
[{"$error":"#N/A"},20,"",{"$f":"IF(ISNA($A33),\"\",IFERROR(SUMIFS(D_D[INV],D_D[MT],5,D_D[CAT],SMS, D_D[EP],-1,D_D[LOC],$A33),0))","v":""},{"$f":"IF(ISNA($A33),\"\",IFERROR(SUMIFS(D_D[BL],D_D[MT],5,D_D[CAT],SMS, D_D[EP],-1,D_D[LOC],$A33),0))","v":""},"",{"$f":"IF(ISNA($A33),\"\",IFERROR(SUMIFS(D_D[ADP],D_D[MT],5,D_D[CAT],SMS, D_D[EP],-1,D_D[LOC],$A33),0))","v":""},{"$f":"IF(ISNA($A33),\"\",IFERROR(SUMIFS(D_D[DEV],D_D[MT],5,D_D[CAT],SMS, D_D[EP],-1,D_D[LOC],$A33)/$D33,0))","v":""},{"$f":"IF(ISNA($A33),\"\",IFERROR(SUMIFS(D_D[EVD],D_D[MT],5,D_D[CAT],SMS, D_D[EP],-1,D_D[LOC],$A33)/$D33,0))","v":""},{"$f":"IF(ISNA($A33),\"\",IFERROR(SUMIFS(D_D[DEC],D_D[MT],5,D_D[CAT],SMS, D_D[EP],-1,D_D[LOC],$A33)/$D33,0))","v":""},{"$f":"IF(ISNA($A33),\"\",IFERROR(SUMIFS(D_D[AWD],D_D[MT],5,D_D[CAT],SMS, D_D[EP],-1,D_D[LOC],$A33)/$D33,0))","v":""},{"$f":"IF(ISNA($A33),\"\",IFERROR(SUMIFS(D_D[AUT],D_D[MT],5,D_D[CAT],SMS, D_D[EP],-1,D_D[LOC],$A33)/$D33,0))","v":""}]
[{"$error":"#N/A"},21,"",{"$f":"IF(ISNA($A34),\"\",IFERROR(SUMIFS(D_D[INV],D_D[MT],5,D_D[CAT],SMS, D_D[EP],-1,D_D[LOC],$A34),0))","v":""},{"$f":"IF(ISNA($A34),\"\",IFERROR(SUMIFS(D_D[BL],D_D[MT],5,D_D[CAT],SMS, D_D[EP],-1,D_D[LOC],$A34),0))","v":""},"",{"$f":"IF(ISNA($A34),\"\",IFERROR(SUMIFS(D_D[ADP],D_D[MT],5,D_D[CAT],SMS, D_D[EP],-1,D_D[LOC],$A34),0))","v":""},{"$f":"IF(ISNA($A34),\"\",IFERROR(SUMIFS(D_D[DEV],D_D[MT],5,D_D[CAT],SMS, D_D[EP],-1,D_D[LOC],$A34)/$D34,0))","v":""},{"$f":"IF(ISNA($A34),\"\",IFERROR(SUMIFS(D_D[EVD],D_D[MT],5,D_D[CAT],SMS, D_D[EP],-1,D_D[LOC],$A34)/$D34,0))","v":""},{"$f":"IF(ISNA($A34),\"\",IFERROR(SUMIFS(D_D[DEC],D_D[MT],5,D_D[CAT],SMS, D_D[EP],-1,D_D[LOC],$A34)/$D34,0))","v":""},{"$f":"IF(ISNA($A34),\"\",IFERROR(SUMIFS(D_D[AWD],D_D[MT],5,D_D[CAT],SMS, D_D[EP],-1,D_D[LOC],$A34)/$D34,0))","v":""},{"$f":"IF(ISNA($A34),\"\",IFERROR(SUMIFS(D_D[AUT],D_D[MT],5,D_D[CAT],SMS, D_D[EP],-1,D_D[LOC],$A34)/$D34,0))","v":""}]
[{"$error":"#N/A"},22,"",{"$f":"IF(ISNA($A35),\"\",IFERROR(SUMIFS(D_D[INV],D_D[MT],5,D_D[CAT],SMS, D_D[EP],-1,D_D[LOC],$A35),0))","v":""},{"$f":"IF(ISNA($A35),\"\",IFERROR(SUMIFS(D_D[BL],D_D[MT],5,D_D[CAT],SMS, D_D[EP],-1,D_D[LOC],$A35),0))","v":""},"",{"$f":"IF(ISNA($A35),\"\",IFERROR(SUMIFS(D_D[ADP],D_D[MT],5,D_D[CAT],SMS, D_D[EP],-1,D_D[LOC],$A35),0))","v":""},{"$f":"IF(ISNA($A35),\"\",IFERROR(SUMIFS(D_D[DEV],D_D[MT],5,D_D[CAT],SMS, D_D[EP],-1,D_D[LOC],$A35)/$D35,0))","v":""},{"$f":"IF(ISNA($A35),\"\",IFERROR(SUMIFS(D_D[EVD],D_D[MT],5,D_D[CAT],SMS, D_D[EP],-1,D_D[LOC],$A35)/$D35,0))","v":""},{"$f":"IF(ISNA($A35),\"\",IFERROR(SUMIFS(D_D[DEC],D_D[MT],5,D_D[CAT],SMS, D_D[EP],-1,D_D[LOC],$A35)/$D35,0))","v":""},{"$f":"IF(ISNA($A35),\"\",IFERROR(SUMIFS(D_D[AWD],D_D[MT],5,D_D[CAT],SMS, D_D[EP],-1,D_D[LOC],$A35)/$D35,0))","v":""},{"$f":"IF(ISNA($A35),\"\",IFERROR(SUMIFS(D_D[AUT],D_D[MT],5,D_D[CAT],SMS, D_D[EP],-1,D_D[LOC],$A35)/$D35,0))","v":""}]
[{"$error":"#N/A"},23,"",{"$f":"IF(ISNA($A36),\"\",IFERROR(SUMIFS(D_D[INV],D_D[MT],5,D_D[CAT],SMS, D_D[EP],-1,D_D[LOC],$A36),0))","v":""},{"$f":"IF(ISNA($A36),\"\",IFERROR(SUMIFS(D_D[BL],D_D[MT],5,D_D[CAT],SMS, D_D[EP],-1,D_D[LOC],$A36),0))","v":""},"",{"$f":"IF(ISNA($A36),\"\",IFERROR(SUMIFS(D_D[ADP],D_D[MT],5,D_D[CAT],SMS, D_D[EP],-1,D_D[LOC],$A36),0))","v":""},{"$f":"IF(ISNA($A36),\"\",IFERROR(SUMIFS(D_D[DEV],D_D[MT],5,D_D[CAT],SMS, D_D[EP],-1,D_D[LOC],$A36)/$D36,0))","v":""},{"$f":"IF(ISNA($A36),\"\",IFERROR(SUMIFS(D_D[EVD],D_D[MT],5,D_D[CAT],SMS, D_D[EP],-1,D_D[LOC],$A36)/$D36,0))","v":""},{"$f":"IF(ISNA($A36),\"\",IFERROR(SUMIFS(D_D[DEC],D_D[MT],5,D_D[CAT],SMS, D_D[EP],-1,D_D[LOC],$A36)/$D36,0))","v":""},{"$f":"IF(ISNA($A36),\"\",IFERROR(SUMIFS(D_D[AWD],D_D[MT],5,D_D[CAT],SMS, D_D[EP],-1,D_D[LOC],$A36)/$D36,0))","v":""},{"$f":"IF(ISNA($A36),\"\",IFERROR(SUMIFS(D_D[AUT],D_D[MT],5,D_D[CAT],SMS, D_D[EP],-1,D_D[LOC],$A36)/$D36,0))","v":""}]

{"sheet":"Rating Bundle - NWQ - State","index":9,"n_rows":89,"n_cols":12,"rows_kept":89,"cut":false,"hidden":false,"merged":[[7,4,7,6],[7,7,7,11],[1,9,1,11],[2,9,2,11],[1,4,1,8],[2,4,2,8],[5,9,5,11],[3,4,4,8],[8,9,10,9],[8,10,10,10],[8,11,10,11],[8,4,10,4],[8,5,10,5],[8,6,10,6],[8,7,10,7],[8,8,10,8]]}
[]
[null,null,"DISTRICT SELECTOR",null,"Compensation and Pension Rating Bundle Metrics",null,null,null,null,"Report through"]
[null,null,null,null,"NWQ State View",null,null,null,null,{"$f":"D_DT[]","v":"2022-05-28"}]
[null,null,null,null,"The State listed is based on the address associated with the claim, not payment address"]
[]
[null,null,null,null,"Each Special Mission has distinct claim counts",null,null,null,null,"Life Cycle Metrics defined on Legend tab"]
[]
[null,null,null,null,"CLAIM METRICS",null,null,"LIFE CYCLE METRICS (as Percent of # Pending)"]
[null,null,"SPECIAL MISSION SELECTOR",null,"#\nPending","#\nPending\n> 125 Days","%\nPending\n> 125 Days","Pending Development","Pending Evidence","Pending Decision","Pending Award","Pending Authorization"]
[]
[]
[100,null,{"$f":"Driver!$C$20","v":"USA - All Missions"},"Total",{"$f":"IF(ISNA($A12),\"\",IFERROR(SUMIFS(D_D[INV],D_D[MT],5,D_D[CAT],SMS, D_D[EP],-1,D_D[LOC],$A12),0))","v":592345},{"$f":"IF(ISNA($A12),\"\",IFERROR(SUMIFS(D_D[BL],D_D[MT],5,D_D[CAT],SMS, D_D[EP],-1,D_D[LOC],$A12),0))","v":196852},{"$f":"IF(ISNA($A12),\"\",IFERROR(F12/E12,0))","v":0.33232660020764926},{"$f":"IF(ISNA($A12),\"\",IFERROR(SUMIFS(D_D[DEV],D_D[MT],5,D_D[CAT],SMS, D_D[EP],-1,D_D[LOC],$A12)/$E12,0))","v":3.4197975841781393E-2},{"$f":"IF(ISNA($A12),\"\",IFERROR(SUMIFS(D_D[EVD],D_D[MT],5,D_D[CAT],SMS, D_D[EP],-1,D_D[LOC],$A12)/$E12,0))","v":0.5769982020612987},{"$f":"IF(ISNA($A12),\"\",IFERROR(SUMIFS(D_D[DEC],D_D[MT],5,D_D[CAT],SMS, D_D[EP],-1,D_D[LOC],$A12)/$E12,0))","v":0.37792333859490668},{"$f":"IF(ISNA($A12),\"\",IFERROR(SUMIFS(D_D[AWD],D_D[MT],5,D_D[CAT],SMS, D_D[EP],-1,D_D[LOC],$A12)/$E12,0))","v":8.3363580345913284E-3},{"$f":"IF(ISNA($A12),\"\",IFERROR(SUMIFS(D_D[AUT],D_D[MT],5,D_D[CAT],SMS, D_D[EP],-1,D_D[LOC],$A12)/$E12,0))","v":2.5390608513619598E-3}]
[499,null,{"$f":"\"NWQ-\"&Driver!$C$20","v":"NWQ-USA - All Missions"},"Total",{"$f":"IF(ISNA($A13),\"\",IFERROR(SUMIFS(D_D[INV],D_D[MT],5,D_D[CAT],SMS, D_D[EP],-1,D_D[LOC],$A13),0))","v":502855},{"$f":"IF(ISNA($A13),\"\",IFERROR(SUMIFS(D_D[BL],D_D[MT],5,D_D[CAT],SMS, D_D[EP],-1,D_D[LOC],$A13),0))","v":161540},{"$f":"IF(ISNA($A13),\"\",IFERROR(F13/E13,0))","v":0.32124568712650764},{"$f":"IF(ISNA($A13),\"\",IFERROR(SUMIFS(D_D[DEV],D_D[MT],5,D_D[CAT],SMS, D_D[EP],-1,D_D[LOC],$A13)/$E13,0))","v":1.8367123723538596E-2},{"$f":"IF(ISNA($A13),\"\",IFERROR(SUMIFS(D_D[EVD],D_D[MT],5,D_D[CAT],SMS, D_D[EP],-1,D_D[LOC],$A13)/$E13,0))","v":0.59416531604538092},{"$f":"IF(ISNA($A13),\"\",IFERROR(SUMIFS(D_D[DEC],D_D[MT],5,D_D[CAT],SMS, D_D[EP],-1,D_D[LOC],$A13)/$E13,0))","v":0.38676954589295126},{"$f":"IF(ISNA($A13),\"\",IFERROR(SUMIFS(D_D[AWD],D_D[MT],5,D_D[CAT],SMS, D_D[EP],-1,D_D[LOC],$A13)/$E13,0))","v":6.9005975877738112E-4},{"$f":"IF(ISNA($A13),\"\",IFERROR(SUMIFS(D_D[AUT],D_D[MT],5,D_D[CAT],SMS, D_D[EP],-1,D_D[LOC],$A13)/$E13,0))","v":7.9545793519006469E-6}]
[{"$f":"INDEX(STATE,(MATCH($C14,STATE_D,0)))","v":"395"},1,{"$f":"IFERROR(INDEX(INDIRECT(DS_NWQ),B14),\"\")","v":"Pacific District"},{"$f":"IFERROR(INDEX(INDIRECT(DS_NWQD),B14),\"\")","v":" "},{"$f":"IF(ISNA($A14),\"\",IFERROR(SUMIFS(D_D[INV],D_D[MT],5,D_D[CAT],SMS, D_D[EP],499,D_D[LOC],$A14),0))","v":106884},{"$f":"IF(ISNA($A14),\"\",IFERROR(SUMIFS(D_D[BL],D_D[MT],5,D_D[CAT],SMS, D_D[EP],499,D_D[LOC],$A14),0))","v":36699},{"$f":"IF(ISNA($A14),\"\",IFERROR(F14/E14,0))","v":0.34335354215785335},{"$f":"IF(ISNA($A14),\"\",IFERROR(SUMIFS(D_D[DEV],D_D[MT],5,D_D[CAT],SMS, D_D[EP],499,D_D[LOC],$A14)/$E14,0))","v":3.2801916095954495E-2},{"$f":"IF(ISNA($A14),\"\",IFERROR(SUMIFS(D_D[EVD],D_D[MT],5,D_D[CAT],SMS, D_D[EP],499,D_D[LOC],$A14)/$E14,0))","v":0.58837618352606569},{"$f":"IF(ISNA($A14),\"\",IFERROR(SUMIFS(D_D[DEC],D_D[MT],5,D_D[CAT],SMS, D_D[EP],499,D_D[LOC],$A14)/$E14,0))","v":0.36839938625051455},{"$f":"IF(ISNA($A14),\"\",IFERROR(SUMIFS(D_D[AWD],D_D[MT],5,D_D[CAT],SMS, D_D[EP],499,D_D[LOC],$A14)/$E14,0))","v":8.3642079263500611E-3},{"$f":"IF(ISNA($A14),\"\",IFERROR(SUMIFS(D_D[AUT],D_D[MT],5,D_D[CAT],SMS, D_D[EP],499,D_D[LOC],$A14)/$E14,0))","v":2.0583062011152275E-3}]
[{"$f":"IFERROR(INDEX(INDIRECT(DS_NWQI),B15),#N/A)","v":"AK100"},2,"Alaska",{"$f":"IFERROR(INDEX(INDIRECT(DS_NWQD),B15),\"\")","v":"Alaska-Total"},{"$f":"IF(ISNA($A15),\"\",IFERROR(SUMIFS(D_D[INV],D_D[MT],5,D_D[CAT],SMS, D_D[EP],499,D_D[LOC],$A15),0))","v":1997},{"$f":"IF(ISNA($A15),\"\",IFERROR(SUMIFS(D_D[BL],D_D[MT],5,D_D[CAT],SMS, D_D[EP],499,D_D[LOC],$A15),0))","v":736},0.36855282924386579,{"$f":"IF(ISNA($A15),\"\",IFERROR(SUMIFS(D_D[DEV],D_D[MT],5,D_D[CAT],SMS, D_D[EP],499,D_D[LOC],$A15)/$E15,0))","v":2.0530796194291438E-2},{"$f":"IF(ISNA($A15),\"\",IFERROR(SUMIFS(D_D[EVD],D_D[MT],5,D_D[CAT],SMS, D_D[EP],499,D_D[LOC],$A15)/$E15,0))","v":0.68552829243865798},{"$f":"IF(ISNA($A15),\"\",IFERROR(SUMIFS(D_D[DEC],D_D[MT],5,D_D[CAT],SMS, D_D[EP],499,D_D[LOC],$A15)/$E15,0))","v":0.28242363545317978},{"$f":"IF(ISNA($A15),\"\",IFERROR(SUMIFS(D_D[AWD],D_D[MT],5,D_D[CAT],SMS, D_D[EP],499,D_D[LOC],$A15)/$E15,0))","v":1.0015022533800702E-2},{"$f":"IF(ISNA($A15),\"\",IFERROR(SUMIFS(D_D[AUT],D_D[MT],5,D_D[CAT],SMS, D_D[EP],499,D_D[LOC],$A15)/$E15,0))","v":1.5022533800701052E-3}]
["AK463",3,0,"Anchorage RO",{"$f":"IF(ISNA($A16),\"\",IFERROR(SUMIFS(D_D[INV],D_D[MT],5,D_D[CAT],SMS, D_D[EP],499,D_D[LOC],$A16),0))","v":24},{"$f":"IF(ISNA($A16),\"\",IFERROR(SUMIFS(D_D[BL],D_D[MT],5,D_D[CAT],SMS, D_D[EP],499,D_D[LOC],$A16),0))","v":4},0.16666666666666666,{"$f":"IF(ISNA($A16),\"\",IFERROR(SUMIFS(D_D[DEV],D_D[MT],5,D_D[CAT],SMS, D_D[EP],499,D_D[LOC],$A16)/$E16,0))","v":0.54166666666666663},{"$f":"IF(ISNA($A16),\"\",IFERROR(SUMIFS(D_D[EVD],D_D[MT],5,D_D[CAT],SMS, D_D[EP],499,D_D[LOC],$A16)/$E16,0))","v":0.375},{"$f":"IF(ISNA($A16),\"\",IFERROR(SUMIFS(D_D[DEC],D_D[MT],5,D_D[CAT],SMS, D_D[EP],499,D_D[LOC],$A16)/$E16,0))","v":4.1666666666666664E-2},{"$f":"IF(ISNA($A16),\"\",IFERROR(SUMIFS(D_D[AWD],D_D[MT],5,D_D[CAT],SMS, D_D[EP],499,D_D[LOC],$A16)/$E16,0))","v":4.1666666666666664E-2},{"$f":"IF(ISNA($A16),\"\",IFERROR(SUMIFS(D_D[AUT],D_D[MT],5,D_D[CAT],SMS, D_D[EP],499,D_D[LOC],$A16)/$E16,0))","v":0}]
["AK-1",4," ","Alaska-Other RO",{"$f":"IF(ISNA($A17),\"\",IFERROR(SUMIFS(D_D[INV],D_D[MT],5,D_D[CAT],SMS, D_D[EP],499,D_D[LOC],$A17),0))","v":293},{"$f":"IF(ISNA($A17),\"\",IFERROR(SUMIFS(D_D[BL],D_D[MT],5,D_D[CAT],SMS, D_D[EP],499,D_D[LOC],$A17),0))","v":112},0.38225255972696248,{"$f":"IF(ISNA($A17),\"\",IFERROR(SUMIFS(D_D[DEV],D_D[MT],5,D_D[CAT],SMS, D_D[EP],499,D_D[LOC],$A17)/$E17,0))","v":5.8020477815699661E-2},{"$f":"IF(ISNA($A17),\"\",IFERROR(SUMIFS(D_D[EVD],D_D[MT],5,D_D[CAT],SMS, D_D[EP],499,D_D[LOC],$A17)/$E17,0))","v":0.48805460750853241},{"$f":"IF(ISNA($A17),\"\",IFERROR(SUMIFS(D_D[DEC],D_D[MT],5,D_D[CAT],SMS, D_D[EP],499,D_D[LOC],$A17)/$E17,0))","v":0.37883959044368598},{"$f":"IF(ISNA($A17),\"\",IFERROR(SUMIFS(D_D[AWD],D_D[MT],5,D_D[CAT],SMS, D_D[EP],499,D_D[LOC],$A17)/$E17,0))","v":6.4846416382252553E-2},{"$f":"IF(ISNA($A17),\"\",IFERROR(SUMIFS(D_D[AUT],D_D[MT],5,D_D[CAT],SMS, D_D[EP],499,D_D[LOC],$A17)/$E17,0))","v":1.0238907849829351E-2}]
["AK499",5," ","Alaska-NWQ",{"$f":"IF(ISNA($A18),\"\",IFERROR(SUMIFS(D_D[INV],D_D[MT],5,D_D[CAT],SMS, D_D[EP],499,D_D[LOC],$A18),0))","v":1680},{"$f":"IF(ISNA($A18),\"\",IFERROR(SUMIFS(D_D[BL],D_D[MT],5,D_D[CAT],SMS, D_D[EP],499,D_D[LOC],$A18),0))","v":620},0.36904761904761907,{"$f":"IF(ISNA($A18),\"\",IFERROR(SUMIFS(D_D[DEV],D_D[MT],5,D_D[CAT],SMS, D_D[EP],499,D_D[LOC],$A18)/$E18,0))","v":6.5476190476190478E-3},{"$f":"IF(ISNA($A18),\"\",IFERROR(SUMIFS(D_D[EVD],D_D[MT],5,D_D[CAT],SMS, D_D[EP],499,D_D[LOC],$A18)/$E18,0))","v":0.72440476190476188},{"$f":"IF(ISNA($A18),\"\",IFERROR(SUMIFS(D_D[DEC],D_D[MT],5,D_D[CAT],SMS, D_D[EP],499,D_D[LOC],$A18)/$E18,0))","v":0.26904761904761904},{"$f":"IF(ISNA($A18),\"\",IFERROR(SUMIFS(D_D[AWD],D_D[MT],5,D_D[CAT],SMS, D_D[EP],499,D_D[LOC],$A18)/$E18,0))","v":0},{"$f":"IF(ISNA($A18),\"\",IFERROR(SUMIFS(D_D[AUT],D_D[MT],5,D_D[CAT],SMS, D_D[EP],499,D_D[LOC],$A18)/$E18,0))","v":0}]
["AZ100",6,"Arizona","Arizona-Total",{"$f":"IF(ISNA($A19),\"\",IFERROR(SUMIFS(D_D[INV],D_D[MT],5,D_D[CAT],SMS, D_D[EP],499,D_D[LOC],$A19),0))","v":13353},{"$f":"IF(ISNA($A19),\"\",IFERROR(SUMIFS(D_D[BL],D_D[MT],5,D_D[CAT],SMS, D_D[EP],499,D_D[LOC],$A19),0))","v":4654},0.34853590953343816,{"$f":"IF(ISNA($A19),\"\",IFERROR(SUMIFS(D_D[DEV],D_D[MT],5,D_D[CAT],SMS, D_D[EP],499,D_D[LOC],$A19)/$E19,0))","v":3.759454804163858E-2},{"$f":"IF(ISNA($A19),\"\",IFERROR(SUMIFS(D_D[EVD],D_D[MT],5,D_D[CAT],SMS, D_D[EP],499,D_D[LOC],$A19)/$E19,0))","v":0.59072867520407402},{"$f":"IF(ISNA($A19),\"\",IFERROR(SUMIFS(D_D[DEC],D_D[MT],5,D_D[CAT],SMS, D_D[EP],499,D_D[LOC],$A19)/$E19,0))","v":0.36089268329214408},{"$f":"IF(ISNA($A19),\"\",IFERROR(SUMIFS(D_D[AWD],D_D[MT],5,D_D[CAT],SMS, D_D[EP],499,D_D[LOC],$A19)/$E19,0))","v":8.8369654759230132E-3},{"$f":"IF(ISNA($A19),\"\",IFERROR(SUMIFS(D_D[AUT],D_D[MT],5,D_D[CAT],SMS, D_D[EP],499,D_D[LOC],$A19)/$E19,0))","v":1.9471279862203251E-3}]
["AZ345",7,0,"Phoenix RO",{"$f":"IF(ISNA($A20),\"\",IFERROR(SUMIFS(D_D[INV],D_D[MT],5,D_D[CAT],SMS, D_D[EP],499,D_D[LOC],$A20),0))","v":331},{"$f":"IF(ISNA($A20),\"\",IFERROR(SUMIFS(D_D[BL],D_D[MT],5,D_D[CAT],SMS, D_D[EP],499,D_D[LOC],$A20),0))","v":66},0.19939577039274925,{"$f":"IF(ISNA($A20),\"\",IFERROR(SUMIFS(D_D[DEV],D_D[MT],5,D_D[CAT],SMS, D_D[EP],499,D_D[LOC],$A20)/$E20,0))","v":0.36253776435045315},{"$f":"IF(ISNA($A20),\"\",IFERROR(SUMIFS(D_D[EVD],D_D[MT],5,D_D[CAT],SMS, D_D[EP],499,D_D[LOC],$A20)/$E20,0))","v":0.37160120845921452},{"$f":"IF(ISNA($A20),\"\",IFERROR(SUMIFS(D_D[DEC],D_D[MT],5,D_D[CAT],SMS, D_D[EP],499,D_D[LOC],$A20)/$E20,0))","v":0.18126888217522658},{"$f":"IF(ISNA($A20),\"\",IFERROR(SUMIFS(D_D[AWD],D_D[MT],5,D_D[CAT],SMS, D_D[EP],499,D_D[LOC],$A20)/$E20,0))","v":6.9486404833836862E-2},{"$f":"IF(ISNA($A20),\"\",IFERROR(SUMIFS(D_D[AUT],D_D[MT],5,D_D[CAT],SMS, D_D[EP],499,D_D[LOC],$A20)/$E20,0))","v":1.5105740181268883E-2}]
["AZ-1",8," ","Arizona-Other RO",{"$f":"IF(ISNA($A21),\"\",IFERROR(SUMIFS(D_D[INV],D_D[MT],5,D_D[CAT],SMS, D_D[EP],499,D_D[LOC],$A21),0))","v":1726},{"$f":"IF(ISNA($A21),\"\",IFERROR(SUMIFS(D_D[BL],D_D[MT],5,D_D[CAT],SMS, D_D[EP],499,D_D[LOC],$A21),0))","v":754},0.43684820393974505,{"$f":"IF(ISNA($A21),\"\",IFERROR(SUMIFS(D_D[DEV],D_D[MT],5,D_D[CAT],SMS, D_D[EP],499,D_D[LOC],$A21)/$E21,0))","v":8.9803012746234062E-2},{"$f":"IF(ISNA($A21),\"\",IFERROR(SUMIFS(D_D[EVD],D_D[MT],5,D_D[CAT],SMS, D_D[EP],499,D_D[LOC],$A21)/$E21,0))","v":0.52723059096176128},{"$f":"IF(ISNA($A21),\"\",IFERROR(SUMIFS(D_D[DEC],D_D[MT],5,D_D[CAT],SMS, D_D[EP],499,D_D[LOC],$A21)/$E21,0))","v":0.32502896871378911},{"$f":"IF(ISNA($A21),\"\",IFERROR(SUMIFS(D_D[AWD],D_D[MT],5,D_D[CAT],SMS, D_D[EP],499,D_D[LOC],$A21)/$E21,0))","v":4.577056778679027E-2},{"$f":"IF(ISNA($A21),\"\",IFERROR(SUMIFS(D_D[AUT],D_D[MT],5,D_D[CAT],SMS, D_D[EP],499,D_D[LOC],$A21)/$E21,0))","v":1.2166859791425261E-2}]
["AZ499",9," ",{"$f":"IFERROR(INDEX(INDIRECT(DS_NWQD),B22),\"\")","v":"Arizona-NWQ"},{"$f":"IF(ISNA($A22),\"\",IFERROR(SUMIFS(D_D[INV],D_D[MT],5,D_D[CAT],SMS, D_D[EP],499,D_D[LOC],$A22),0))","v":11296},{"$f":"IF(ISNA($A22),\"\",IFERROR(SUMIFS(D_D[BL],D_D[MT],5,D_D[CAT],SMS, D_D[EP],499,D_D[LOC],$A22),0))","v":3834},{"$f":"IF(ISNA($A22),\"\",IFERROR(F22/E22,0))","v":0.33941218130311612},{"$f":"IF(ISNA($A22),\"\",IFERROR(SUMIFS(D_D[DEV],D_D[MT],5,D_D[CAT],SMS, D_D[EP],499,D_D[LOC],$A22)/$E22,0))","v":2.0095609065155808E-2},{"$f":"IF(ISNA($A22),\"\",IFERROR(SUMIFS(D_D[EVD],D_D[MT],5,D_D[CAT],SMS, D_D[EP],499,D_D[LOC],$A22)/$E22,0))","v":0.60685198300283283},{"$f":"IF(ISNA($A22),\"\",IFERROR(SUMIFS(D_D[DEC],D_D[MT],5,D_D[CAT],SMS, D_D[EP],499,D_D[LOC],$A22)/$E22,0))","v":0.37163597733711046},{"$f":"IF(ISNA($A22),\"\",IFERROR(SUMIFS(D_D[AWD],D_D[MT],5,D_D[CAT],SMS, D_D[EP],499,D_D[LOC],$A22)/$E22,0))","v":1.4164305949008499E-3},{"$f":"IF(ISNA($A22),\"\",IFERROR(SUMIFS(D_D[AUT],D_D[MT],5,D_D[CAT],SMS, D_D[EP],499,D_D[LOC],$A22)/$E22,0))","v":0}]
["CA100",10,"California","California-Total",{"$f":"IF(ISNA($A23),\"\",IFERROR(SUMIFS(D_D[INV],D_D[MT],5,D_D[CAT],SMS, D_D[EP],499,D_D[LOC],$A23),0))","v":48381},{"$f":"IF(ISNA($A23),\"\",IFERROR(SUMIFS(D_D[BL],D_D[MT],5,D_D[CAT],SMS, D_D[EP],499,D_D[LOC],$A23),0))","v":15782},0.32620243484012318,{"$f":"IF(ISNA($A23),\"\",IFERROR(SUMIFS(D_D[DEV],D_D[MT],5,D_D[CAT],SMS, D_D[EP],499,D_D[LOC],$A23)/$E23,0))","v":3.3132841404683658E-2},{"$f":"IF(ISNA($A23),\"\",IFERROR(SUMIFS(D_D[EVD],D_D[MT],5,D_D[CAT],SMS, D_D[EP],499,D_D[LOC],$A23)/$E23,0))","v":0.58533308530208139},{"$f":"IF(ISNA($A23),\"\",IFERROR(SUMIFS(D_D[DEC],D_D[MT],5,D_D[CAT],SMS, D_D[EP],499,D_D[LOC],$A23)/$E23,0))","v":0.37155081540274076},{"$f":"IF(ISNA($A23),\"\",IFERROR(SUMIFS(D_D[AWD],D_D[MT],5,D_D[CAT],SMS, D_D[EP],499,D_D[LOC],$A23)/$E23,0))","v":8.1850313139455576E-3},{"$f":"IF(ISNA($A23),\"\",IFERROR(SUMIFS(D_D[AUT],D_D[MT],5,D_D[CAT],SMS, D_D[EP],499,D_D[LOC],$A23)/$E23,0))","v":1.7982265765486452E-3}]
["CA344",11,0,"Los Angeles RO",{"$f":"IF(ISNA($A24),\"\",IFERROR(SUMIFS(D_D[INV],D_D[MT],5,D_D[CAT],SMS, D_D[EP],499,D_D[LOC],$A24),0))","v":539},{"$f":"IF(ISNA($A24),\"\",IFERROR(SUMIFS(D_D[BL],D_D[MT],5,D_D[CAT],SMS, D_D[EP],499,D_D[LOC],$A24),0))","v":122},0.22634508348794063,{"$f":"IF(ISNA($A24),\"\",IFERROR(SUMIFS(D_D[DEV],D_D[MT],5,D_D[CAT],SMS, D_D[EP],499,D_D[LOC],$A24)/$E24,0))","v":0.28200371057513912},{"$f":"IF(ISNA($A24),\"\",IFERROR(SUMIFS(D_D[EVD],D_D[MT],5,D_D[CAT],SMS, D_D[EP],499,D_D[LOC],$A24)/$E24,0))","v":0.3784786641929499},{"$f":"IF(ISNA($A24),\"\",IFERROR(SUMIFS(D_D[DEC],D_D[MT],5,D_D[CAT],SMS, D_D[EP],499,D_D[LOC],$A24)/$E24,0))","v":0.313543599257885},{"$f":"IF(ISNA($A24),\"\",IFERROR(SUMIFS(D_D[AWD],D_D[MT],5,D_D[CAT],SMS, D_D[EP],499,D_D[LOC],$A24)/$E24,0))","v":9.2764378478664197E-3},{"$f":"IF(ISNA($A24),\"\",IFERROR(SUMIFS(D_D[AUT],D_D[MT],5,D_D[CAT],SMS, D_D[EP],499,D_D[LOC],$A24)/$E24,0))","v":1.6697588126159554E-2}]
["CA343",12,0,"Oakland RO",{"$f":"IF(ISNA($A25),\"\",IFERROR(SUMIFS(D_D[INV],D_D[MT],5,D_D[CAT],SMS, D_D[EP],499,D_D[LOC],$A25),0))","v":319},{"$f":"IF(ISNA($A25),\"\",IFERROR(SUMIFS(D_D[BL],D_D[MT],5,D_D[CAT],SMS, D_D[EP],499,D_D[LOC],$A25),0))","v":70},0.21943573667711599,{"$f":"IF(ISNA($A25),\"\",IFERROR(SUMIFS(D_D[DEV],D_D[MT],5,D_D[CAT],SMS, D_D[EP],499,D_D[LOC],$A25)/$E25,0))","v":0.31974921630094044},{"$f":"IF(ISNA($A25),\"\",IFERROR(SUMIFS(D_D[EVD],D_D[MT],5,D_D[CAT],SMS, D_D[EP],499,D_D[LOC],$A25)/$E25,0))","v":0.42006269592476492},{"$f":"IF(ISNA($A25),\"\",IFERROR(SUMIFS(D_D[DEC],D_D[MT],5,D_D[CAT],SMS, D_D[EP],499,D_D[LOC],$A25)/$E25,0))","v":0.21943573667711599},{"$f":"IF(ISNA($A25),\"\",IFERROR(SUMIFS(D_D[AWD],D_D[MT],5,D_D[CAT],SMS, D_D[EP],499,D_D[LOC],$A25)/$E25,0))","v":2.8213166144200628E-2},{"$f":"IF(ISNA($A25),\"\",IFERROR(SUMIFS(D_D[AUT],D_D[MT],5,D_D[CAT],SMS, D_D[EP],499,D_D[LOC],$A25)/$E25,0))","v":1.2539184952978056E-2}]
["CA377",13," ","San Diego RO",{"$f":"IF(ISNA($A26),\"\",IFERROR(SUMIFS(D_D[INV],D_D[MT],5,D_D[CAT],SMS, D_D[EP],499,D_D[LOC],$A26),0))","v":614},{"$f":"IF(ISNA($A26),\"\",IFERROR(SUMIFS(D_D[BL],D_D[MT],5,D_D[CAT],SMS, D_D[EP],499,D_D[LOC],$A26),0))","v":138},0.22475570032573289,{"$f":"IF(ISNA($A26),\"\",IFERROR(SUMIFS(D_D[DEV],D_D[MT],5,D_D[CAT],SMS, D_D[EP],499,D_D[LOC],$A26)/$E26,0))","v":0.15635179153094461},{"$f":"IF(ISNA($A26),\"\",IFERROR(SUMIFS(D_D[EVD],D_D[MT],5,D_D[CAT],SMS, D_D[EP],499,D_D[LOC],$A26)/$E26,0))","v":0.42508143322475572},{"$f":"IF(ISNA($A26),\"\",IFERROR(SUMIFS(D_D[DEC],D_D[MT],5,D_D[CAT],SMS, D_D[EP],499,D_D[LOC],$A26)/$E26,0))","v":0.38273615635179153},{"$f":"IF(ISNA($A26),\"\",IFERROR(SUMIFS(D_D[AWD],D_D[MT],5,D_D[CAT],SMS, D_D[EP],499,D_D[LOC],$A26)/$E26,0))","v":2.7687296416938109E-2},{"$f":"IF(ISNA($A26),\"\",IFERROR(SUMIFS(D_D[AUT],D_D[MT],5,D_D[CAT],SMS, D_D[EP],499,D_D[LOC],$A26)/$E26,0))","v":8.1433224755700327E-3}]
["CA-1",14," ","California-Other RO",{"$f":"IF(ISNA($A27),\"\",IFERROR(SUMIFS(D_D[INV],D_D[MT],5,D_D[CAT],SMS, D_D[EP],499,D_D[LOC],$A27),0))","v":5879},{"$f":"IF(ISNA($A27),\"\",IFERROR(SUMIFS(D_D[BL],D_D[MT],5,D_D[CAT],SMS, D_D[EP],499,D_D[LOC],$A27),0))","v":2565},0.43629869025344448,{"$f":"IF(ISNA($A27),\"\",IFERROR(SUMIFS(D_D[DEV],D_D[MT],5,D_D[CAT],SMS, D_D[EP],499,D_D[LOC],$A27)/$E27,0))","v":8.9300901513862899E-2},{"$f":"IF(ISNA($A27),\"\",IFERROR(SUMIFS(D_D[EVD],D_D[MT],5,D_D[CAT],SMS, D_D[EP],499,D_D[LOC],$A27)/$E27,0))","v":0.5153937744514373},{"$f":"IF(ISNA($A27),\"\",IFERROR(SUMIFS(D_D[DEC],D_D[MT],5,D_D[CAT],SMS, D_D[EP],499,D_D[LOC],$A27)/$E27,0))","v":0.32590576628678347},{"$f":"IF(ISNA($A27),\"\",IFERROR(SUMIFS(D_D[AWD],D_D[MT],5,D_D[CAT],SMS, D_D[EP],499,D_D[LOC],$A27)/$E27,0))","v":5.766286783466576E-2},{"$f":"IF(ISNA($A27),\"\",IFERROR(SUMIFS(D_D[AUT],D_D[MT],5,D_D[CAT],SMS, D_D[EP],499,D_D[LOC],$A27)/$E27,0))","v":1.1736689913250553E-2}]
["CA499",15," ",{"$f":"IFERROR(INDEX(INDIRECT(DS_NWQD),B28),\"\")","v":"California-NWQ"},{"$f":"IF(ISNA($A28),\"\",IFERROR(SUMIFS(D_D[INV],D_D[MT],5,D_D[CAT],SMS, D_D[EP],499,D_D[LOC],$A28),0))","v":41030},{"$f":"IF(ISNA($A28),\"\",IFERROR(SUMIFS(D_D[BL],D_D[MT],5,D_D[CAT],SMS, D_D[EP],499,D_D[LOC],$A28),0))","v":12887},{"$f":"IF(ISNA($A28),\"\",IFERROR(F28/E28,0))","v":0.31408725322934439},{"$f":"IF(ISNA($A28),\"\",IFERROR(SUMIFS(D_D[DEV],D_D[MT],5,D_D[CAT],SMS, D_D[EP],499,D_D[LOC],$A28)/$E28,0))","v":1.7743114794053133E-2},{"$f":"IF(ISNA($A28),\"\",IFERROR(SUMIFS(D_D[EVD],D_D[MT],5,D_D[CAT],SMS, D_D[EP],499,D_D[LOC],$A28)/$E28,0))","v":0.6017548135510602},{"$f":"IF(ISNA($A28),\"\",IFERROR(SUMIFS(D_D[DEC],D_D[MT],5,D_D[CAT],SMS, D_D[EP],499,D_D[LOC],$A28)/$E28,0))","v":0.37986838898367048},{"$f":"IF(ISNA($A28),\"\",IFERROR(SUMIFS(D_D[AWD],D_D[MT],5,D_D[CAT],SMS, D_D[EP],499,D_D[LOC],$A28)/$E28,0))","v":6.3368267121618332E-4},{"$f":"IF(ISNA($A28),\"\",IFERROR(SUMIFS(D_D[AUT],D_D[MT],5,D_D[CAT],SMS, D_D[EP],499,D_D[LOC],$A28)/$E28,0))","v":0}]
["HI100",16,"Hawaii","Hawaii-Total",{"$f":"IF(ISNA($A29),\"\",IFERROR(SUMIFS(D_D[INV],D_D[MT],5,D_D[CAT],SMS, D_D[EP],499,D_D[LOC],$A29),0))","v":3551},{"$f":"IF(ISNA($A29),\"\",IFERROR(SUMIFS(D_D[BL],D_D[MT],5,D_D[CAT],SMS, D_D[EP],499,D_D[LOC],$A29),0))","v":1219},0.34328358208955223,{"$f":"IF(ISNA($A29),\"\",IFERROR(SUMIFS(D_D[DEV],D_D[MT],5,D_D[CAT],SMS, D_D[EP],499,D_D[LOC],$A29)/$E29,0))","v":2.2810475922275416E-2},{"$f":"IF(ISNA($A29),\"\",IFERROR(SUMIFS(D_D[EVD],D_D[MT],5,D_D[CAT],SMS, D_D[EP],499,D_D[LOC],$A29)/$E29,0))","v":0.63869332582371163},{"$f":"IF(ISNA($A29),\"\",IFERROR(SUMIFS(D_D[DEC],D_D[MT],5,D_D[CAT],SMS, D_D[EP],499,D_D[LOC],$A29)/$E29,0))","v":0.33145592790763168},{"$f":"IF(ISNA($A29),\"\",IFERROR(SUMIFS(D_D[AWD],D_D[MT],5,D_D[CAT],SMS, D_D[EP],499,D_D[LOC],$A29)/$E29,0))","v":4.7873838355392846E-3},{"$f":"IF(ISNA($A29),\"\",IFERROR(SUMIFS(D_D[AUT],D_D[MT],5,D_D[CAT],SMS, D_D[EP],499,D_D[LOC],$A29)/$E29,0))","v":2.2528865108420162E-3}]
["HI459",17,0,"Honolulu RO",{"$f":"IF(ISNA($A30),\"\",IFERROR(SUMIFS(D_D[INV],D_D[MT],5,D_D[CAT],SMS, D_D[EP],499,D_D[LOC],$A30),0))","v":47},{"$f":"IF(ISNA($A30),\"\",IFERROR(SUMIFS(D_D[BL],D_D[MT],5,D_D[CAT],SMS, D_D[EP],499,D_D[LOC],$A30),0))","v":7},0.14893617021276595,{"$f":"IF(ISNA($A30),\"\",IFERROR(SUMIFS(D_D[DEV],D_D[MT],5,D_D[CAT],SMS, D_D[EP],499,D_D[LOC],$A30)/$E30,0))","v":0.51063829787234039},{"$f":"IF(ISNA($A30),\"\",IFERROR(SUMIFS(D_D[EVD],D_D[MT],5,D_D[CAT],SMS, D_D[EP],499,D_D[LOC],$A30)/$E30,0))","v":0.21276595744680851},{"$f":"IF(ISNA($A30),\"\",IFERROR(SUMIFS(D_D[DEC],D_D[MT],5,D_D[CAT],SMS, D_D[EP],499,D_D[LOC],$A30)/$E30,0))","v":0.27659574468085107},{"$f":"IF(ISNA($A30),\"\",IFERROR(SUMIFS(D_D[AWD],D_D[MT],5,D_D[CAT],SMS, D_D[EP],499,D_D[LOC],$A30)/$E30,0))","v":0},{"$f":"IF(ISNA($A30),\"\",IFERROR(SUMIFS(D_D[AUT],D_D[MT],5,D_D[CAT],SMS, D_D[EP],499,D_D[LOC],$A30)/$E30,0))","v":0}]
["HI-1",18,0,"Hawaii-Other RO",{"$f":"IF(ISNA($A31),\"\",IFERROR(SUMIFS(D_D[INV],D_D[MT],5,D_D[CAT],SMS, D_D[EP],499,D_D[LOC],$A31),0))","v":456},{"$f":"IF(ISNA($A31),\"\",IFERROR(SUMIFS(D_D[BL],D_D[MT],5,D_D[CAT],SMS, D_D[EP],499,D_D[LOC],$A31),0))","v":201},0.44078947368421051,{"$f":"IF(ISNA($A31),\"\",IFERROR(SUMIFS(D_D[DEV],D_D[MT],5,D_D[CAT],SMS, D_D[EP],499,D_D[LOC],$A31)/$E31,0))","v":7.0175438596491224E-2},{"$f":"IF(ISNA($A31),\"\",IFERROR(SUMIFS(D_D[EVD],D_D[MT],5,D_D[CAT],SMS, D_D[EP],499,D_D[LOC],$A31)/$E31,0))","v":0.54605263157894735},{"$f":"IF(ISNA($A31),\"\",IFERROR(SUMIFS(D_D[DEC],D_D[MT],5,D_D[CAT],SMS, D_D[EP],499,D_D[LOC],$A31)/$E31,0))","v":0.33114035087719296},{"$f":"IF(ISNA($A31),\"\",IFERROR(SUMIFS(D_D[AWD],D_D[MT],5,D_D[CAT],SMS, D_D[EP],499,D_D[LOC],$A31)/$E31,0))","v":3.5087719298245612E-2},{"$f":"IF(ISNA($A31),\"\",IFERROR(SUMIFS(D_D[AUT],D_D[MT],5,D_D[CAT],SMS, D_D[EP],499,D_D[LOC],$A31)/$E31,0))","v":1.7543859649122806E-2}]
["HI499",19,0,"Hawaii-NWQ",{"$f":"IF(ISNA($A32),\"\",IFERROR(SUMIFS(D_D[INV],D_D[MT],5,D_D[CAT],SMS, D_D[EP],499,D_D[LOC],$A32),0))","v":3048},{"$f":"IF(ISNA($A32),\"\",IFERROR(SUMIFS(D_D[BL],D_D[MT],5,D_D[CAT],SMS, D_D[EP],499,D_D[LOC],$A32),0))","v":1011},0.33169291338582679,{"$f":"IF(ISNA($A32),\"\",IFERROR(SUMIFS(D_D[DEV],D_D[MT],5,D_D[CAT],SMS, D_D[EP],499,D_D[LOC],$A32)/$E32,0))","v":8.2020997375328083E-3},{"$f":"IF(ISNA($A32),\"\",IFERROR(SUMIFS(D_D[EVD],D_D[MT],5,D_D[CAT],SMS, D_D[EP],499,D_D[LOC],$A32)/$E32,0))","v":0.6591207349081365},{"$f":"IF(ISNA($A32),\"\",IFERROR(SUMIFS(D_D[DEC],D_D[MT],5,D_D[CAT],SMS, D_D[EP],499,D_D[LOC],$A32)/$E32,0))","v":0.33234908136482938},{"$f":"IF(ISNA($A32),\"\",IFERROR(SUMIFS(D_D[AWD],D_D[MT],5,D_D[CAT],SMS, D_D[EP],499,D_D[LOC],$A32)/$E32,0))","v":3.2808398950131233E-4},{"$f":"IF(ISNA($A32),\"\",IFERROR(SUMIFS(D_D[AUT],D_D[MT],5,D_D[CAT],SMS, D_D[EP],499,D_D[LOC],$A32)/$E32,0))","v":0}]
["ID100",20,"Idaho","Idaho-Total",{"$f":"IF(ISNA($A33),\"\",IFERROR(SUMIFS(D_D[INV],D_D[MT],5,D_D[CAT],SMS, D_D[EP],499,D_D[LOC],$A33),0))","v":3514},{"$f":"IF(ISNA($A33),\"\",IFERROR(SUMIFS(D_D[BL],D_D[MT],5,D_D[CAT],SMS, D_D[EP],499,D_D[LOC],$A33),0))","v":1331},0.37877063175867959,{"$f":"IF(ISNA($A33),\"\",IFERROR(SUMIFS(D_D[DEV],D_D[MT],5,D_D[CAT],SMS, D_D[EP],499,D_D[LOC],$A33)/$E33,0))","v":3.1303357996585089E-2},{"$f":"IF(ISNA($A33),\"\",IFERROR(SUMIFS(D_D[EVD],D_D[MT],5,D_D[CAT],SMS, D_D[EP],499,D_D[LOC],$A33)/$E33,0))","v":0.57996585088218555},{"$f":"IF(ISNA($A33),\"\",IFERROR(SUMIFS(D_D[DEC],D_D[MT],5,D_D[CAT],SMS, D_D[EP],499,D_D[LOC],$A33)/$E33,0))","v":0.37706317586795673},{"$f":"IF(ISNA($A33),\"\",IFERROR(SUMIFS(D_D[AWD],D_D[MT],5,D_D[CAT],SMS, D_D[EP],499,D_D[LOC],$A33)/$E33,0))","v":9.6755833807626642E-3},{"$f":"IF(ISNA($A33),\"\",IFERROR(SUMIFS(D_D[AUT],D_D[MT],5,D_D[CAT],SMS, D_D[EP],499,D_D[LOC],$A33)/$E33,0))","v":1.9920318725099601E-3}]
["ID347",21,0,"Boise RO",{"$f":"IF(ISNA($A34),\"\",IFERROR(SUMIFS(D_D[INV],D_D[MT],5,D_D[CAT],SMS, D_D[EP],499,D_D[LOC],$A34),0))","v":45},{"$f":"IF(ISNA($A34),\"\",IFERROR(SUMIFS(D_D[BL],D_D[MT],5,D_D[CAT],SMS, D_D[EP],499,D_D[LOC],$A34),0))","v":4},8.8888888888888892E-2,{"$f":"IF(ISNA($A34),\"\",IFERROR(SUMIFS(D_D[DEV],D_D[MT],5,D_D[CAT],SMS, D_D[EP],499,D_D[LOC],$A34)/$E34,0))","v":0.68888888888888888},{"$f":"IF(ISNA($A34),\"\",IFERROR(SUMIFS(D_D[EVD],D_D[MT],5,D_D[CAT],SMS, D_D[EP],499,D_D[LOC],$A34)/$E34,0))","v":0.1111111111111111},{"$f":"IF(ISNA($A34),\"\",IFERROR(SUMIFS(D_D[DEC],D_D[MT],5,D_D[CAT],SMS, D_D[EP],499,D_D[LOC],$A34)/$E34,0))","v":0.1111111111111111},{"$f":"IF(ISNA($A34),\"\",IFERROR(SUMIFS(D_D[AWD],D_D[MT],5,D_D[CAT],SMS, D_D[EP],499,D_D[LOC],$A34)/$E34,0))","v":8.8888888888888892E-2},{"$f":"IF(ISNA($A34),\"\",IFERROR(SUMIFS(D_D[AUT],D_D[MT],5,D_D[CAT],SMS, D_D[EP],499,D_D[LOC],$A34)/$E34,0))","v":0}]
["ID-1",22,0,"Idaho-Other RO",{"$f":"IF(ISNA($A35),\"\",IFERROR(SUMIFS(D_D[INV],D_D[MT],5,D_D[CAT],SMS, D_D[EP],499,D_D[LOC],$A35),0))","v":511},{"$f":"IF(ISNA($A35),\"\",IFERROR(SUMIFS(D_D[BL],D_D[MT],5,D_D[CAT],SMS, D_D[EP],499,D_D[LOC],$A35),0))","v":230},0.45009784735812131,{"$f":"IF(ISNA($A35),\"\",IFERROR(SUMIFS(D_D[DEV],D_D[MT],5,D_D[CAT],SMS, D_D[EP],499,D_D[LOC],$A35)/$E35,0))","v":8.0234833659491189E-2},{"$f":"IF(ISNA($A35),\"\",IFERROR(SUMIFS(D_D[EVD],D_D[MT],5,D_D[CAT],SMS, D_D[EP],499,D_D[LOC],$A35)/$E35,0))","v":0.50880626223091974},{"$f":"IF(ISNA($A35),\"\",IFERROR(SUMIFS(D_D[DEC],D_D[MT],5,D_D[CAT],SMS, D_D[EP],499,D_D[LOC],$A35)/$E35,0))","v":0.33855185909980429},{"$f":"IF(ISNA($A35),\"\",IFERROR(SUMIFS(D_D[AWD],D_D[MT],5,D_D[CAT],SMS, D_D[EP],499,D_D[LOC],$A35)/$E35,0))","v":5.8708414872798431E-2},{"$f":"IF(ISNA($A35),\"\",IFERROR(SUMIFS(D_D[AUT],D_D[MT],5,D_D[CAT],SMS, D_D[EP],499,D_D[LOC],$A35)/$E35,0))","v":1.3698630136986301E-2}]
["ID499",23,0,"Idaho-NWQ",{"$f":"IF(ISNA($A36),\"\",IFERROR(SUMIFS(D_D[INV],D_D[MT],5,D_D[CAT],SMS, D_D[EP],499,D_D[LOC],$A36),0))","v":2958},{"$f":"IF(ISNA($A36),\"\",IFERROR(SUMIFS(D_D[BL],D_D[MT],5,D_D[CAT],SMS, D_D[EP],499,D_D[LOC],$A36),0))","v":1097},0.37085868830290736,{"$f":"IF(ISNA($A36),\"\",IFERROR(SUMIFS(D_D[DEV],D_D[MT],5,D_D[CAT],SMS, D_D[EP],499,D_D[LOC],$A36)/$E36,0))","v":1.2846517917511832E-2},{"$f":"IF(ISNA($A36),\"\",IFERROR(SUMIFS(D_D[EVD],D_D[MT],5,D_D[CAT],SMS, D_D[EP],499,D_D[LOC],$A36)/$E36,0))","v":0.59939148073022308},{"$f":"IF(ISNA($A36),\"\",IFERROR(SUMIFS(D_D[DEC],D_D[MT],5,D_D[CAT],SMS, D_D[EP],499,D_D[LOC],$A36)/$E36,0))","v":0.38776200135226502},{"$f":"IF(ISNA($A36),\"\",IFERROR(SUMIFS(D_D[AWD],D_D[MT],5,D_D[CAT],SMS, D_D[EP],499,D_D[LOC],$A36)/$E36,0))","v":0},{"$f":"IF(ISNA($A36),\"\",IFERROR(SUMIFS(D_D[AUT],D_D[MT],5,D_D[CAT],SMS, D_D[EP],499,D_D[LOC],$A36)/$E36,0))","v":0}]
["NV100",24,"Nevada","Nevada-Total",{"$f":"IF(ISNA($A37),\"\",IFERROR(SUMIFS(D_D[INV],D_D[MT],5,D_D[CAT],SMS, D_D[EP],499,D_D[LOC],$A37),0))","v":8173},{"$f":"IF(ISNA($A37),\"\",IFERROR(SUMIFS(D_D[BL],D_D[MT],5,D_D[CAT],SMS, D_D[EP],499,D_D[LOC],$A37),0))","v":2715},0.33219136180105224,{"$f":"IF(ISNA($A37),\"\",IFERROR(SUMIFS(D_D[DEV],D_D[MT],5,D_D[CAT],SMS, D_D[EP],499,D_D[LOC],$A37)/$E37,0))","v":3.71956441942983E-2},{"$f":"IF(ISNA($A37),\"\",IFERROR(SUMIFS(D_D[EVD],D_D[MT],5,D_D[CAT],SMS, D_D[EP],499,D_D[LOC],$A37)/$E37,0))","v":0.56809005261225987},{"$f":"IF(ISNA($A37),\"\",IFERROR(SUMIFS(D_D[DEC],D_D[MT],5,D_D[CAT],SMS, D_D[EP],499,D_D[LOC],$A37)/$E37,0))","v":0.3830906643827236},{"$f":"IF(ISNA($A37),\"\",IFERROR(SUMIFS(D_D[AWD],D_D[MT],5,D_D[CAT],SMS, D_D[EP],499,D_D[LOC],$A37)/$E37,0))","v":9.1765569558301726E-3},{"$f":"IF(ISNA($A37),\"\",IFERROR(SUMIFS(D_D[AUT],D_D[MT],5,D_D[CAT],SMS, D_D[EP],499,D_D[LOC],$A37)/$E37,0))","v":2.447081854888046E-3}]
["NV354",25,0,"Reno RO",{"$f":"IF(ISNA($A38),\"\",IFERROR(SUMIFS(D_D[INV],D_D[MT],5,D_D[CAT],SMS, D_D[EP],499,D_D[LOC],$A38),0))","v":200},{"$f":"IF(ISNA($A38),\"\",IFERROR(SUMIFS(D_D[BL],D_D[MT],5,D_D[CAT],SMS, D_D[EP],499,D_D[LOC],$A38),0))","v":20},0.1,{"$f":"IF(ISNA($A38),\"\",IFERROR(SUMIFS(D_D[DEV],D_D[MT],5,D_D[CAT],SMS, D_D[EP],499,D_D[LOC],$A38)/$E38,0))","v":0.64},{"$f":"IF(ISNA($A38),\"\",IFERROR(SUMIFS(D_D[EVD],D_D[MT],5,D_D[CAT],SMS, D_D[EP],499,D_D[LOC],$A38)/$E38,0))","v":0.185},{"$f":"IF(ISNA($A38),\"\",IFERROR(SUMIFS(D_D[DEC],D_D[MT],5,D_D[CAT],SMS, D_D[EP],499,D_D[LOC],$A38)/$E38,0))","v":0.155},{"$f":"IF(ISNA($A38),\"\",IFERROR(SUMIFS(D_D[AWD],D_D[MT],5,D_D[CAT],SMS, D_D[EP],499,D_D[LOC],$A38)/$E38,0))","v":0.01},{"$f":"IF(ISNA($A38),\"\",IFERROR(SUMIFS(D_D[AUT],D_D[MT],5,D_D[CAT],SMS, D_D[EP],499,D_D[LOC],$A38)/$E38,0))","v":0.01}]
["NV-1",26,0,"Nevada-Other RO",{"$f":"IF(ISNA($A39),\"\",IFERROR(SUMIFS(D_D[INV],D_D[MT],5,D_D[CAT],SMS, D_D[EP],499,D_D[LOC],$A39),0))","v":1129},{"$f":"IF(ISNA($A39),\"\",IFERROR(SUMIFS(D_D[BL],D_D[MT],5,D_D[CAT],SMS, D_D[EP],499,D_D[LOC],$A39),0))","v":511},0.4526129317980514,{"$f":"IF(ISNA($A39),\"\",IFERROR(SUMIFS(D_D[DEV],D_D[MT],5,D_D[CAT],SMS, D_D[EP],499,D_D[LOC],$A39)/$E39,0))","v":7.0859167404782999E-2},{"$f":"IF(ISNA($A39),\"\",IFERROR(SUMIFS(D_D[EVD],D_D[MT],5,D_D[CAT],SMS, D_D[EP],499,D_D[LOC],$A39)/$E39,0))","v":0.50930026572187781},{"$f":"IF(ISNA($A39),\"\",IFERROR(SUMIFS(D_D[DEC],D_D[MT],5,D_D[CAT],SMS, D_D[EP],499,D_D[LOC],$A39)/$E39,0))","v":0.34366696191319751},{"$f":"IF(ISNA($A39),\"\",IFERROR(SUMIFS(D_D[AWD],D_D[MT],5,D_D[CAT],SMS, D_D[EP],499,D_D[LOC],$A39)/$E39,0))","v":6.0230292294065547E-2},{"$f":"IF(ISNA($A39),\"\",IFERROR(SUMIFS(D_D[AUT],D_D[MT],5,D_D[CAT],SMS, D_D[EP],499,D_D[LOC],$A39)/$E39,0))","v":1.5943312666076175E-2}]
["NV499",27,0,"Nevada-NWQ",{"$f":"IF(ISNA($A40),\"\",IFERROR(SUMIFS(D_D[INV],D_D[MT],5,D_D[CAT],SMS, D_D[EP],499,D_D[LOC],$A40),0))","v":6844},{"$f":"IF(ISNA($A40),\"\",IFERROR(SUMIFS(D_D[BL],D_D[MT],5,D_D[CAT],SMS, D_D[EP],499,D_D[LOC],$A40),0))","v":2184},0.31911163062536529,{"$f":"IF(ISNA($A40),\"\",IFERROR(SUMIFS(D_D[DEV],D_D[MT],5,D_D[CAT],SMS, D_D[EP],499,D_D[LOC],$A40)/$E40,0))","v":1.4026884862653419E-2},{"$f":"IF(ISNA($A40),\"\",IFERROR(SUMIFS(D_D[EVD],D_D[MT],5,D_D[CAT],SMS, D_D[EP],499,D_D[LOC],$A40)/$E40,0))","v":0.58898305084745761},{"$f":"IF(ISNA($A40),\"\",IFERROR(SUMIFS(D_D[DEC],D_D[MT],5,D_D[CAT],SMS, D_D[EP],499,D_D[LOC],$A40)/$E40,0))","v":0.39625949736995908},{"$f":"IF(ISNA($A40),\"\",IFERROR(SUMIFS(D_D[AWD],D_D[MT],5,D_D[CAT],SMS, D_D[EP],499,D_D[LOC],$A40)/$E40,0))","v":7.3056691992986556E-4},{"$f":"IF(ISNA($A40),\"\",IFERROR(SUMIFS(D_D[AUT],D_D[MT],5,D_D[CAT],SMS, D_D[EP],499,D_D[LOC],$A40)/$E40,0))","v":0}]
["NM100",28,"New Mexico","New Mexico-Total",{"$f":"IF(ISNA($A41),\"\",IFERROR(SUMIFS(D_D[INV],D_D[MT],5,D_D[CAT],SMS, D_D[EP],499,D_D[LOC],$A41),0))","v":4195},{"$f":"IF(ISNA($A41),\"\",IFERROR(SUMIFS(D_D[BL],D_D[MT],5,D_D[CAT],SMS, D_D[EP],499,D_D[LOC],$A41),0))","v":1515},0.36114421930870083,{"$f":"IF(ISNA($A41),\"\",IFERROR(SUMIFS(D_D[DEV],D_D[MT],5,D_D[CAT],SMS, D_D[EP],499,D_D[LOC],$A41)/$E41,0))","v":3.5041716328963052E-2},{"$f":"IF(ISNA($A41),\"\",IFERROR(SUMIFS(D_D[EVD],D_D[MT],5,D_D[CAT],SMS, D_D[EP],499,D_D[LOC],$A41)/$E41,0))","v":0.6314660309892729},{"$f":"IF(ISNA($A41),\"\",IFERROR(SUMIFS(D_D[DEC],D_D[MT],5,D_D[CAT],SMS, D_D[EP],499,D_D[LOC],$A41)/$E41,0))","v":0.32181168057210968},{"$f":"IF(ISNA($A41),\"\",IFERROR(SUMIFS(D_D[AWD],D_D[MT],5,D_D[CAT],SMS, D_D[EP],499,D_D[LOC],$A41)/$E41,0))","v":8.8200238379022647E-3},{"$f":"IF(ISNA($A41),\"\",IFERROR(SUMIFS(D_D[AUT],D_D[MT],5,D_D[CAT],SMS, D_D[EP],499,D_D[LOC],$A41)/$E41,0))","v":2.8605482717520858E-3}]
["NM340",29,0,"Albuquerque RO",{"$f":"IF(ISNA($A42),\"\",IFERROR(SUMIFS(D_D[INV],D_D[MT],5,D_D[CAT],SMS, D_D[EP],499,D_D[LOC],$A42),0))","v":71},{"$f":"IF(ISNA($A42),\"\",IFERROR(SUMIFS(D_D[BL],D_D[MT],5,D_D[CAT],SMS, D_D[EP],499,D_D[LOC],$A42),0))","v":14},0.19718309859154928,{"$f":"IF(ISNA($A42),\"\",IFERROR(SUMIFS(D_D[DEV],D_D[MT],5,D_D[CAT],SMS, D_D[EP],499,D_D[LOC],$A42)/$E42,0))","v":0.45070422535211269},{"$f":"IF(ISNA($A42),\"\",IFERROR(SUMIFS(D_D[EVD],D_D[MT],5,D_D[CAT],SMS, D_D[EP],499,D_D[LOC],$A42)/$E42,0))","v":0.18309859154929578},{"$f":"IF(ISNA($A42),\"\",IFERROR(SUMIFS(D_D[DEC],D_D[MT],5,D_D[CAT],SMS, D_D[EP],499,D_D[LOC],$A42)/$E42,0))","v":0.28169014084507044},{"$f":"IF(ISNA($A42),\"\",IFERROR(SUMIFS(D_D[AWD],D_D[MT],5,D_D[CAT],SMS, D_D[EP],499,D_D[LOC],$A42)/$E42,0))","v":7.0422535211267609E-2},{"$f":"IF(ISNA($A42),\"\",IFERROR(SUMIFS(D_D[AUT],D_D[MT],5,D_D[CAT],SMS, D_D[EP],499,D_D[LOC],$A42)/$E42,0))","v":1.4084507042253521E-2}]
["NM-1",30,0,"New Mexico-Other RO",{"$f":"IF(ISNA($A43),\"\",IFERROR(SUMIFS(D_D[INV],D_D[MT],5,D_D[CAT],SMS, D_D[EP],499,D_D[LOC],$A43),0))","v":580},{"$f":"IF(ISNA($A43),\"\",IFERROR(SUMIFS(D_D[BL],D_D[MT],5,D_D[CAT],SMS, D_D[EP],499,D_D[LOC],$A43),0))","v":245},0.42241379310344829,{"$f":"IF(ISNA($A43),\"\",IFERROR(SUMIFS(D_D[DEV],D_D[MT],5,D_D[CAT],SMS, D_D[EP],499,D_D[LOC],$A43)/$E43,0))","v":9.4827586206896547E-2},{"$f":"IF(ISNA($A43),\"\",IFERROR(SUMIFS(D_D[EVD],D_D[MT],5,D_D[CAT],SMS, D_D[EP],499,D_D[LOC],$A43)/$E43,0))","v":0.50689655172413794},{"$f":"IF(ISNA($A43),\"\",IFERROR(SUMIFS(D_D[DEC],D_D[MT],5,D_D[CAT],SMS, D_D[EP],499,D_D[LOC],$A43)/$E43,0))","v":0.32586206896551723},{"$f":"IF(ISNA($A43),\"\",IFERROR(SUMIFS(D_D[AWD],D_D[MT],5,D_D[CAT],SMS, D_D[EP],499,D_D[LOC],$A43)/$E43,0))","v":5.3448275862068968E-2},{"$f":"IF(ISNA($A43),\"\",IFERROR(SUMIFS(D_D[AUT],D_D[MT],5,D_D[CAT],SMS, D_D[EP],499,D_D[LOC],$A43)/$E43,0))","v":1.896551724137931E-2}]
["NM499",31,0,"New Mexico-NWQ",{"$f":"IF(ISNA($A44),\"\",IFERROR(SUMIFS(D_D[INV],D_D[MT],5,D_D[CAT],SMS, D_D[EP],499,D_D[LOC],$A44),0))","v":3544},{"$f":"IF(ISNA($A44),\"\",IFERROR(SUMIFS(D_D[BL],D_D[MT],5,D_D[CAT],SMS, D_D[EP],499,D_D[LOC],$A44),0))","v":1256},0.35440180586907449,{"$f":"IF(ISNA($A44),\"\",IFERROR(SUMIFS(D_D[DEV],D_D[MT],5,D_D[CAT],SMS, D_D[EP],499,D_D[LOC],$A44)/$E44,0))","v":1.6930022573363433E-2},{"$f":"IF(ISNA($A44),\"\",IFERROR(SUMIFS(D_D[EVD],D_D[MT],5,D_D[CAT],SMS, D_D[EP],499,D_D[LOC],$A44)/$E44,0))","v":0.66083521444695259},{"$f":"IF(ISNA($A44),\"\",IFERROR(SUMIFS(D_D[DEC],D_D[MT],5,D_D[CAT],SMS, D_D[EP],499,D_D[LOC],$A44)/$E44,0))","v":0.32195259593679459},{"$f":"IF(ISNA($A44),\"\",IFERROR(SUMIFS(D_D[AWD],D_D[MT],5,D_D[CAT],SMS, D_D[EP],499,D_D[LOC],$A44)/$E44,0))","v":2.821670428893905E-4},{"$f":"IF(ISNA($A44),\"\",IFERROR(SUMIFS(D_D[AUT],D_D[MT],5,D_D[CAT],SMS, D_D[EP],499,D_D[LOC],$A44)/$E44,0))","v":0}]
["OR100",32,"Oregon","Oregon-Total",{"$f":"IF(ISNA($A45),\"\",IFERROR(SUMIFS(D_D[INV],D_D[MT],5,D_D[CAT],SMS, D_D[EP],499,D_D[LOC],$A45),0))","v":7287},{"$f":"IF(ISNA($A45),\"\",IFERROR(SUMIFS(D_D[BL],D_D[MT],5,D_D[CAT],SMS, D_D[EP],499,D_D[LOC],$A45),0))","v":2911},0.39947852339783174,{"$f":"IF(ISNA($A45),\"\",IFERROR(SUMIFS(D_D[DEV],D_D[MT],5,D_D[CAT],SMS, D_D[EP],499,D_D[LOC],$A45)/$E45,0))","v":3.073967339097022E-2},{"$f":"IF(ISNA($A45),\"\",IFERROR(SUMIFS(D_D[EVD],D_D[MT],5,D_D[CAT],SMS, D_D[EP],499,D_D[LOC],$A45)/$E45,0))","v":0.59077809798270897},{"$f":"IF(ISNA($A45),\"\",IFERROR(SUMIFS(D_D[DEC],D_D[MT],5,D_D[CAT],SMS, D_D[EP],499,D_D[LOC],$A45)/$E45,0))","v":0.36805269658295597},{"$f":"IF(ISNA($A45),\"\",IFERROR(SUMIFS(D_D[AWD],D_D[MT],5,D_D[CAT],SMS, D_D[EP],499,D_D[LOC],$A45)/$E45,0))","v":7.4104569781803208E-3},{"$f":"IF(ISNA($A45),\"\",IFERROR(SUMIFS(D_D[AUT],D_D[MT],5,D_D[CAT],SMS, D_D[EP],499,D_D[LOC],$A45)/$E45,0))","v":3.0190750651845752E-3}]
["OR348",33,0,"Portland RO",{"$f":"IF(ISNA($A46),\"\",IFERROR(SUMIFS(D_D[INV],D_D[MT],5,D_D[CAT],SMS, D_D[EP],499,D_D[LOC],$A46),0))","v":140},{"$f":"IF(ISNA($A46),\"\",IFERROR(SUMIFS(D_D[BL],D_D[MT],5,D_D[CAT],SMS, D_D[EP],499,D_D[LOC],$A46),0))","v":26},0.18571428571428572,{"$f":"IF(ISNA($A46),\"\",IFERROR(SUMIFS(D_D[DEV],D_D[MT],5,D_D[CAT],SMS, D_D[EP],499,D_D[LOC],$A46)/$E46,0))","v":0.38571428571428573},{"$f":"IF(ISNA($A46),\"\",IFERROR(SUMIFS(D_D[EVD],D_D[MT],5,D_D[CAT],SMS, D_D[EP],499,D_D[LOC],$A46)/$E46,0))","v":0.33571428571428569},{"$f":"IF(ISNA($A46),\"\",IFERROR(SUMIFS(D_D[DEC],D_D[MT],5,D_D[CAT],SMS, D_D[EP],499,D_D[LOC],$A46)/$E46,0))","v":0.22857142857142856},{"$f":"IF(ISNA($A46),\"\",IFERROR(SUMIFS(D_D[AWD],D_D[MT],5,D_D[CAT],SMS, D_D[EP],499,D_D[LOC],$A46)/$E46,0))","v":7.1428571428571426E-3},{"$f":"IF(ISNA($A46),\"\",IFERROR(SUMIFS(D_D[AUT],D_D[MT],5,D_D[CAT],SMS, D_D[EP],499,D_D[LOC],$A46)/$E46,0))","v":4.2857142857142858E-2}]
[{"$f":"IFERROR(INDEX(INDIRECT(DS_NWQI),B47),#N/A)","v":"OR-1"},34,0,"Oregon-Other RO",{"$f":"IF(ISNA($A47),\"\",IFERROR(SUMIFS(D_D[INV],D_D[MT],5,D_D[CAT],SMS, D_D[EP],499,D_D[LOC],$A47),0))","v":998},{"$f":"IF(ISNA($A47),\"\",IFERROR(SUMIFS(D_D[BL],D_D[MT],5,D_D[CAT],SMS, D_D[EP],499,D_D[LOC],$A47),0))","v":498},0.49899799599198397,{"$f":"IF(ISNA($A47),\"\",IFERROR(SUMIFS(D_D[DEV],D_D[MT],5,D_D[CAT],SMS, D_D[EP],499,D_D[LOC],$A47)/$E47,0))","v":6.4128256513026047E-2},{"$f":"IF(ISNA($A47),\"\",IFERROR(SUMIFS(D_D[EVD],D_D[MT],5,D_D[CAT],SMS, D_D[EP],499,D_D[LOC],$A47)/$E47,0))","v":0.56112224448897796},{"$f":"IF(ISNA($A47),\"\",IFERROR(SUMIFS(D_D[DEC],D_D[MT],5,D_D[CAT],SMS, D_D[EP],499,D_D[LOC],$A47)/$E47,0))","v":0.31162324649298595},{"$f":"IF(ISNA($A47),\"\",IFERROR(SUMIFS(D_D[AWD],D_D[MT],5,D_D[CAT],SMS, D_D[EP],499,D_D[LOC],$A47)/$E47,0))","v":4.8096192384769539E-2},{"$f":"IF(ISNA($A47),\"\",IFERROR(SUMIFS(D_D[AUT],D_D[MT],5,D_D[CAT],SMS, D_D[EP],499,D_D[LOC],$A47)/$E47,0))","v":1.503006012024048E-2}]
["OR499",35,0,"Oregon-NWQ",{"$f":"IF(ISNA($A48),\"\",IFERROR(SUMIFS(D_D[INV],D_D[MT],5,D_D[CAT],SMS, D_D[EP],499,D_D[LOC],$A48),0))","v":6149},{"$f":"IF(ISNA($A48),\"\",IFERROR(SUMIFS(D_D[BL],D_D[MT],5,D_D[CAT],SMS, D_D[EP],499,D_D[LOC],$A48),0))","v":2387},0.38819320214669051,{"$f":"IF(ISNA($A48),\"\",IFERROR(SUMIFS(D_D[DEV],D_D[MT],5,D_D[CAT],SMS, D_D[EP],499,D_D[LOC],$A48)/$E48,0))","v":1.7238575378110261E-2},{"$f":"IF(ISNA($A48),\"\",IFERROR(SUMIFS(D_D[EVD],D_D[MT],5,D_D[CAT],SMS, D_D[EP],499,D_D[LOC],$A48)/$E48,0))","v":0.60139860139860135},{"$f":"IF(ISNA($A48),\"\",IFERROR(SUMIFS(D_D[DEC],D_D[MT],5,D_D[CAT],SMS, D_D[EP],499,D_D[LOC],$A48)/$E48,0))","v":0.38038705480565943},{"$f":"IF(ISNA($A48),\"\",IFERROR(SUMIFS(D_D[AWD],D_D[MT],5,D_D[CAT],SMS, D_D[EP],499,D_D[LOC],$A48)/$E48,0))","v":8.1314034802406894E-4},{"$f":"IF(ISNA($A48),\"\",IFERROR(SUMIFS(D_D[AUT],D_D[MT],5,D_D[CAT],SMS, D_D[EP],499,D_D[LOC],$A48)/$E48,0))","v":1.626280696048138E-4}]
["PI100",36,"Philippines",{"$f":"IFERROR(INDEX(INDIRECT(DS_NWQD),B49),\"\")","v":"Philippines-Total"},{"$f":"IF(ISNA($A49),\"\",IFERROR(SUMIFS(D_D[INV],D_D[MT],5,D_D[CAT],SMS, D_D[EP],499,D_D[LOC],$A49),0))","v":0},{"$f":"IF(ISNA($A49),\"\",IFERROR(SUMIFS(D_D[BL],D_D[MT],5,D_D[CAT],SMS, D_D[EP],499,D_D[LOC],$A49),0))","v":0},{"$f":"IF(ISNA($A49),\"\",IFERROR(F49/E49,0))","v":0},{"$f":"IF(ISNA($A49),\"\",IFERROR(SUMIFS(D_D[DEV],D_D[MT],5,D_D[CAT],SMS, D_D[EP],499,D_D[LOC],$A49)/$E49,0))","v":0},{"$f":"IF(ISNA($A49),\"\",IFERROR(SUMIFS(D_D[EVD],D_D[MT],5,D_D[CAT],SMS, D_D[EP],499,D_D[LOC],$A49)/$E49,0))","v":0},{"$f":"IF(ISNA($A49),\"\",IFERROR(SUMIFS(D_D[DEC],D_D[MT],5,D_D[CAT],SMS, D_D[EP],499,D_D[LOC],$A49)/$E49,0))","v":0},{"$f":"IF(ISNA($A49),\"\",IFERROR(SUMIFS(D_D[AWD],D_D[MT],5,D_D[CAT],SMS, D_D[EP],499,D_D[LOC],$A49)/$E49,0))","v":0},{"$f":"IF(ISNA($A49),\"\",IFERROR(SUMIFS(D_D[AUT],D_D[MT],5,D_D[CAT],SMS, D_D[EP],499,D_D[LOC],$A49)/$E49,0))","v":0}]
["PI358",37,0,"Manila RO",{"$f":"IF(ISNA($A50),\"\",IFERROR(SUMIFS(D_D[INV],D_D[MT],5,D_D[CAT],SMS, D_D[EP],499,D_D[LOC],$A50),0))","v":0},{"$f":"IF(ISNA($A50),\"\",IFERROR(SUMIFS(D_D[BL],D_D[MT],5,D_D[CAT],SMS, D_D[EP],499,D_D[LOC],$A50),0))","v":0},0,{"$f":"IF(ISNA($A50),\"\",IFERROR(SUMIFS(D_D[DEV],D_D[MT],5,D_D[CAT],SMS, D_D[EP],499,D_D[LOC],$A50)/$E50,0))","v":0},{"$f":"IF(ISNA($A50),\"\",IFERROR(SUMIFS(D_D[EVD],D_D[MT],5,D_D[CAT],SMS, D_D[EP],499,D_D[LOC],$A50)/$E50,0))","v":0},{"$f":"IF(ISNA($A50),\"\",IFERROR(SUMIFS(D_D[DEC],D_D[MT],5,D_D[CAT],SMS, D_D[EP],499,D_D[LOC],$A50)/$E50,0))","v":0},{"$f":"IF(ISNA($A50),\"\",IFERROR(SUMIFS(D_D[AWD],D_D[MT],5,D_D[CAT],SMS, D_D[EP],499,D_D[LOC],$A50)/$E50,0))","v":0},{"$f":"IF(ISNA($A50),\"\",IFERROR(SUMIFS(D_D[AUT],D_D[MT],5,D_D[CAT],SMS, D_D[EP],499,D_D[LOC],$A50)/$E50,0))","v":0}]
["PI-1",38,0,"Philippines-Other RO",{"$f":"IF(ISNA($A51),\"\",IFERROR(SUMIFS(D_D[INV],D_D[MT],5,D_D[CAT],SMS, D_D[EP],499,D_D[LOC],$A51),0))","v":0},{"$f":"IF(ISNA($A51),\"\",IFERROR(SUMIFS(D_D[BL],D_D[MT],5,D_D[CAT],SMS, D_D[EP],499,D_D[LOC],$A51),0))","v":0},0,{"$f":"IF(ISNA($A51),\"\",IFERROR(SUMIFS(D_D[DEV],D_D[MT],5,D_D[CAT],SMS, D_D[EP],499,D_D[LOC],$A51)/$E51,0))","v":0},{"$f":"IF(ISNA($A51),\"\",IFERROR(SUMIFS(D_D[EVD],D_D[MT],5,D_D[CAT],SMS, D_D[EP],499,D_D[LOC],$A51)/$E51,0))","v":0},{"$f":"IF(ISNA($A51),\"\",IFERROR(SUMIFS(D_D[DEC],D_D[MT],5,D_D[CAT],SMS, D_D[EP],499,D_D[LOC],$A51)/$E51,0))","v":0},{"$f":"IF(ISNA($A51),\"\",IFERROR(SUMIFS(D_D[AWD],D_D[MT],5,D_D[CAT],SMS, D_D[EP],499,D_D[LOC],$A51)/$E51,0))","v":0},{"$f":"IF(ISNA($A51),\"\",IFERROR(SUMIFS(D_D[AUT],D_D[MT],5,D_D[CAT],SMS, D_D[EP],499,D_D[LOC],$A51)/$E51,0))","v":0}]
["PI499",39,0,"Philippines-NWQ",{"$f":"IF(ISNA($A52),\"\",IFERROR(SUMIFS(D_D[INV],D_D[MT],5,D_D[CAT],SMS, D_D[EP],499,D_D[LOC],$A52),0))","v":0},{"$f":"IF(ISNA($A52),\"\",IFERROR(SUMIFS(D_D[BL],D_D[MT],5,D_D[CAT],SMS, D_D[EP],499,D_D[LOC],$A52),0))","v":0},0,{"$f":"IF(ISNA($A52),\"\",IFERROR(SUMIFS(D_D[DEV],D_D[MT],5,D_D[CAT],SMS, D_D[EP],499,D_D[LOC],$A52)/$E52,0))","v":0},{"$f":"IF(ISNA($A52),\"\",IFERROR(SUMIFS(D_D[EVD],D_D[MT],5,D_D[CAT],SMS, D_D[EP],499,D_D[LOC],$A52)/$E52,0))","v":0},{"$f":"IF(ISNA($A52),\"\",IFERROR(SUMIFS(D_D[DEC],D_D[MT],5,D_D[CAT],SMS, D_D[EP],499,D_D[LOC],$A52)/$E52,0))","v":0},{"$f":"IF(ISNA($A52),\"\",IFERROR(SUMIFS(D_D[AWD],D_D[MT],5,D_D[CAT],SMS, D_D[EP],499,D_D[LOC],$A52)/$E52,0))","v":0},{"$f":"IF(ISNA($A52),\"\",IFERROR(SUMIFS(D_D[AUT],D_D[MT],5,D_D[CAT],SMS, D_D[EP],499,D_D[LOC],$A52)/$E52,0))","v":0}]
["UT100",40,"Utah","Utah-Total",{"$f":"IF(ISNA($A53),\"\",IFERROR(SUMIFS(D_D[INV],D_D[MT],5,D_D[CAT],SMS, D_D[EP],499,D_D[LOC],$A53),0))","v":3295},{"$f":"IF(ISNA($A53),\"\",IFERROR(SUMIFS(D_D[BL],D_D[MT],5,D_D[CAT],SMS, D_D[EP],499,D_D[LOC],$A53),0))","v":1095},0.33232169954476481,{"$f":"IF(ISNA($A53),\"\",IFERROR(SUMIFS(D_D[DEV],D_D[MT],5,D_D[CAT],SMS, D_D[EP],499,D_D[LOC],$A53)/$E53,0))","v":3.490136570561457E-2},{"$f":"IF(ISNA($A53),\"\",IFERROR(SUMIFS(D_D[EVD],D_D[MT],5,D_D[CAT],SMS, D_D[EP],499,D_D[LOC],$A53)/$E53,0))","v":0.55933232169954472},{"$f":"IF(ISNA($A53),\"\",IFERROR(SUMIFS(D_D[DEC],D_D[MT],5,D_D[CAT],SMS, D_D[EP],499,D_D[LOC],$A53)/$E53,0))","v":0.39241274658573594},{"$f":"IF(ISNA($A53),\"\",IFERROR(SUMIFS(D_D[AWD],D_D[MT],5,D_D[CAT],SMS, D_D[EP],499,D_D[LOC],$A53)/$E53,0))","v":1.0925644916540212E-2},{"$f":"IF(ISNA($A53),\"\",IFERROR(SUMIFS(D_D[AUT],D_D[MT],5,D_D[CAT],SMS, D_D[EP],499,D_D[LOC],$A53)/$E53,0))","v":2.4279210925644916E-3}]
["UT341",41,0,"Salt Lake City RO",{"$f":"IF(ISNA($A54),\"\",IFERROR(SUMIFS(D_D[INV],D_D[MT],5,D_D[CAT],SMS, D_D[EP],499,D_D[LOC],$A54),0))","v":74},{"$f":"IF(ISNA($A54),\"\",IFERROR(SUMIFS(D_D[BL],D_D[MT],5,D_D[CAT],SMS, D_D[EP],499,D_D[LOC],$A54),0))","v":17},0.22972972972972974,{"$f":"IF(ISNA($A54),\"\",IFERROR(SUMIFS(D_D[DEV],D_D[MT],5,D_D[CAT],SMS, D_D[EP],499,D_D[LOC],$A54)/$E54,0))","v":0.39189189189189189},{"$f":"IF(ISNA($A54),\"\",IFERROR(SUMIFS(D_D[EVD],D_D[MT],5,D_D[CAT],SMS, D_D[EP],499,D_D[LOC],$A54)/$E54,0))","v":0.24324324324324326},{"$f":"IF(ISNA($A54),\"\",IFERROR(SUMIFS(D_D[DEC],D_D[MT],5,D_D[CAT],SMS, D_D[EP],499,D_D[LOC],$A54)/$E54,0))","v":0.21621621621621623},{"$f":"IF(ISNA($A54),\"\",IFERROR(SUMIFS(D_D[AWD],D_D[MT],5,D_D[CAT],SMS, D_D[EP],499,D_D[LOC],$A54)/$E54,0))","v":0.13513513513513514},{"$f":"IF(ISNA($A54),\"\",IFERROR(SUMIFS(D_D[AUT],D_D[MT],5,D_D[CAT],SMS, D_D[EP],499,D_D[LOC],$A54)/$E54,0))","v":1.3513513513513514E-2}]
["UT-1",42,0,"Utah-Other RO",{"$f":"IF(ISNA($A55),\"\",IFERROR(SUMIFS(D_D[INV],D_D[MT],5,D_D[CAT],SMS, D_D[EP],499,D_D[LOC],$A55),0))","v":441},{"$f":"IF(ISNA($A55),\"\",IFERROR(SUMIFS(D_D[BL],D_D[MT],5,D_D[CAT],SMS, D_D[EP],499,D_D[LOC],$A55),0))","v":183},0.41496598639455784,{"$f":"IF(ISNA($A55),\"\",IFERROR(SUMIFS(D_D[DEV],D_D[MT],5,D_D[CAT],SMS, D_D[EP],499,D_D[LOC],$A55)/$E55,0))","v":6.8027210884353748E-2},{"$f":"IF(ISNA($A55),\"\",IFERROR(SUMIFS(D_D[EVD],D_D[MT],5,D_D[CAT],SMS, D_D[EP],499,D_D[LOC],$A55)/$E55,0))","v":0.51927437641723351},{"$f":"IF(ISNA($A55),\"\",IFERROR(SUMIFS(D_D[DEC],D_D[MT],5,D_D[CAT],SMS, D_D[EP],499,D_D[LOC],$A55)/$E55,0))","v":0.3401360544217687},{"$f":"IF(ISNA($A55),\"\",IFERROR(SUMIFS(D_D[AWD],D_D[MT],5,D_D[CAT],SMS, D_D[EP],499,D_D[LOC],$A55)/$E55,0))","v":5.6689342403628121E-2},{"$f":"IF(ISNA($A55),\"\",IFERROR(SUMIFS(D_D[AUT],D_D[MT],5,D_D[CAT],SMS, D_D[EP],499,D_D[LOC],$A55)/$E55,0))","v":1.5873015873015872E-2}]
["UT499",43,0,"Utah-NWQ",{"$f":"IF(ISNA($A56),\"\",IFERROR(SUMIFS(D_D[INV],D_D[MT],5,D_D[CAT],SMS, D_D[EP],499,D_D[LOC],$A56),0))","v":2780},{"$f":"IF(ISNA($A56),\"\",IFERROR(SUMIFS(D_D[BL],D_D[MT],5,D_D[CAT],SMS, D_D[EP],499,D_D[LOC],$A56),0))","v":895},0.32194244604316546,{"$f":"IF(ISNA($A56),\"\",IFERROR(SUMIFS(D_D[DEV],D_D[MT],5,D_D[CAT],SMS, D_D[EP],499,D_D[LOC],$A56)/$E56,0))","v":2.0143884892086329E-2},{"$f":"IF(ISNA($A56),\"\",IFERROR(SUMIFS(D_D[EVD],D_D[MT],5,D_D[CAT],SMS, D_D[EP],499,D_D[LOC],$A56)/$E56,0))","v":0.57410071942446039},{"$f":"IF(ISNA($A56),\"\",IFERROR(SUMIFS(D_D[DEC],D_D[MT],5,D_D[CAT],SMS, D_D[EP],499,D_D[LOC],$A56)/$E56,0))","v":0.4053956834532374},{"$f":"IF(ISNA($A56),\"\",IFERROR(SUMIFS(D_D[AWD],D_D[MT],5,D_D[CAT],SMS, D_D[EP],499,D_D[LOC],$A56)/$E56,0))","v":3.5971223021582735E-4},{"$f":"IF(ISNA($A56),\"\",IFERROR(SUMIFS(D_D[AUT],D_D[MT],5,D_D[CAT],SMS, D_D[EP],499,D_D[LOC],$A56)/$E56,0))","v":0}]
["WA100",44,"Washington","Washington-Total",{"$f":"IF(ISNA($A57),\"\",IFERROR(SUMIFS(D_D[INV],D_D[MT],5,D_D[CAT],SMS, D_D[EP],499,D_D[LOC],$A57),0))","v":13138},{"$f":"IF(ISNA($A57),\"\",IFERROR(SUMIFS(D_D[BL],D_D[MT],5,D_D[CAT],SMS, D_D[EP],499,D_D[LOC],$A57),0))","v":4741},0.36086162277363376,{"$f":"IF(ISNA($A57),\"\",IFERROR(SUMIFS(D_D[DEV],D_D[MT],5,D_D[CAT],SMS, D_D[EP],499,D_D[LOC],$A57)/$E57,0))","v":2.8847617597807886E-2},{"$f":"IF(ISNA($A57),\"\",IFERROR(SUMIFS(D_D[EVD],D_D[MT],5,D_D[CAT],SMS, D_D[EP],499,D_D[LOC],$A57)/$E57,0))","v":0.57588674075201707},{"$f":"IF(ISNA($A57),\"\",IFERROR(SUMIFS(D_D[DEC],D_D[MT],5,D_D[CAT],SMS, D_D[EP],499,D_D[LOC],$A57)/$E57,0))","v":0.38506622012482872},{"$f":"IF(ISNA($A57),\"\",IFERROR(SUMIFS(D_D[AWD],D_D[MT],5,D_D[CAT],SMS, D_D[EP],499,D_D[LOC],$A57)/$E57,0))","v":8.1443142030750496E-3},{"$f":"IF(ISNA($A57),\"\",IFERROR(SUMIFS(D_D[AUT],D_D[MT],5,D_D[CAT],SMS, D_D[EP],499,D_D[LOC],$A57)/$E57,0))","v":2.0551073222712744E-3}]
["WA346",45,0,"Seattle RO",{"$f":"IF(ISNA($A58),\"\",IFERROR(SUMIFS(D_D[INV],D_D[MT],5,D_D[CAT],SMS, D_D[EP],499,D_D[LOC],$A58),0))","v":264},{"$f":"IF(ISNA($A58),\"\",IFERROR(SUMIFS(D_D[BL],D_D[MT],5,D_D[CAT],SMS, D_D[EP],499,D_D[LOC],$A58),0))","v":54},0.20454545454545456,{"$f":"IF(ISNA($A58),\"\",IFERROR(SUMIFS(D_D[DEV],D_D[MT],5,D_D[CAT],SMS, D_D[EP],499,D_D[LOC],$A58)/$E58,0))","v":0.29166666666666669},{"$f":"IF(ISNA($A58),\"\",IFERROR(SUMIFS(D_D[EVD],D_D[MT],5,D_D[CAT],SMS, D_D[EP],499,D_D[LOC],$A58)/$E58,0))","v":0.31818181818181818},{"$f":"IF(ISNA($A58),\"\",IFERROR(SUMIFS(D_D[DEC],D_D[MT],5,D_D[CAT],SMS, D_D[EP],499,D_D[LOC],$A58)/$E58,0))","v":0.31060606060606061},{"$f":"IF(ISNA($A58),\"\",IFERROR(SUMIFS(D_D[AWD],D_D[MT],5,D_D[CAT],SMS, D_D[EP],499,D_D[LOC],$A58)/$E58,0))","v":5.3030303030303032E-2},{"$f":"IF(ISNA($A58),\"\",IFERROR(SUMIFS(D_D[AUT],D_D[MT],5,D_D[CAT],SMS, D_D[EP],499,D_D[LOC],$A58)/$E58,0))","v":2.6515151515151516E-2}]
["WA-1",46,0,"Washington-Other RO",{"$f":"IF(ISNA($A59),\"\",IFERROR(SUMIFS(D_D[INV],D_D[MT],5,D_D[CAT],SMS, D_D[EP],499,D_D[LOC],$A59),0))","v":1748},{"$f":"IF(ISNA($A59),\"\",IFERROR(SUMIFS(D_D[BL],D_D[MT],5,D_D[CAT],SMS, D_D[EP],499,D_D[LOC],$A59),0))","v":802},0.45881006864988561,{"$f":"IF(ISNA($A59),\"\",IFERROR(SUMIFS(D_D[DEV],D_D[MT],5,D_D[CAT],SMS, D_D[EP],499,D_D[LOC],$A59)/$E59,0))","v":7.6659038901601834E-2},{"$f":"IF(ISNA($A59),\"\",IFERROR(SUMIFS(D_D[EVD],D_D[MT],5,D_D[CAT],SMS, D_D[EP],499,D_D[LOC],$A59)/$E59,0))","v":0.52459954233409611},{"$f":"IF(ISNA($A59),\"\",IFERROR(SUMIFS(D_D[DEC],D_D[MT],5,D_D[CAT],SMS, D_D[EP],499,D_D[LOC],$A59)/$E59,0))","v":0.33524027459954231},{"$f":"IF(ISNA($A59),\"\",IFERROR(SUMIFS(D_D[AWD],D_D[MT],5,D_D[CAT],SMS, D_D[EP],499,D_D[LOC],$A59)/$E59,0))","v":5.205949656750572E-2},{"$f":"IF(ISNA($A59),\"\",IFERROR(SUMIFS(D_D[AUT],D_D[MT],5,D_D[CAT],SMS, D_D[EP],499,D_D[LOC],$A59)/$E59,0))","v":1.1441647597254004E-2}]
["WA499",47,0,{"$f":"IFERROR(INDEX(INDIRECT(DS_NWQD),B60),\"\")","v":"Washington-NWQ"},{"$f":"IF(ISNA($A60),\"\",IFERROR(SUMIFS(D_D[INV],D_D[MT],5,D_D[CAT],SMS, D_D[EP],499,D_D[LOC],$A60),0))","v":11126},{"$f":"IF(ISNA($A60),\"\",IFERROR(SUMIFS(D_D[BL],D_D[MT],5,D_D[CAT],SMS, D_D[EP],499,D_D[LOC],$A60),0))","v":3885},{"$f":"IF(ISNA($A60),\"\",IFERROR(F60/E60,0))","v":0.34918209599137157},{"$f":"IF(ISNA($A60),\"\",IFERROR(SUMIFS(D_D[DEV],D_D[MT],5,D_D[CAT],SMS, D_D[EP],499,D_D[LOC],$A60)/$E60,0))","v":1.5099766313140393E-2},{"$f":"IF(ISNA($A60),\"\",IFERROR(SUMIFS(D_D[EVD],D_D[MT],5,D_D[CAT],SMS, D_D[EP],499,D_D[LOC],$A60)/$E60,0))","v":0.59005932051051591},{"$f":"IF(ISNA($A60),\"\",IFERROR(SUMIFS(D_D[DEC],D_D[MT],5,D_D[CAT],SMS, D_D[EP],499,D_D[LOC],$A60)/$E60,0))","v":0.39466115405356822},{"$f":"IF(ISNA($A60),\"\",IFERROR(SUMIFS(D_D[AWD],D_D[MT],5,D_D[CAT],SMS, D_D[EP],499,D_D[LOC],$A60)/$E60,0))","v":1.7975912277548085E-4},{"$f":"IF(ISNA($A60),\"\",IFERROR(SUMIFS(D_D[AUT],D_D[MT],5,D_D[CAT],SMS, D_D[EP],499,D_D[LOC],$A60)/$E60,0))","v":0}]
[{"$error":"#N/A"},48,"","",{"$f":"IF(ISNA($A61),\"\",IFERROR(SUMIFS(D_D[INV],D_D[MT],5,D_D[CAT],SMS, D_D[EP],499,D_D[LOC],$A61),0))","v":""},{"$f":"IF(ISNA($A61),\"\",IFERROR(SUMIFS(D_D[BL],D_D[MT],5,D_D[CAT],SMS, D_D[EP],499,D_D[LOC],$A61),0))","v":""},"",{"$f":"IF(ISNA($A61),\"\",IFERROR(SUMIFS(D_D[DEV],D_D[MT],5,D_D[CAT],SMS, D_D[EP],499,D_D[LOC],$A61)/$E61,0))","v":""},{"$f":"IF(ISNA($A61),\"\",IFERROR(SUMIFS(D_D[EVD],D_D[MT],5,D_D[CAT],SMS, D_D[EP],499,D_D[LOC],$A61)/$E61,0))","v":""},{"$f":"IF(ISNA($A61),\"\",IFERROR(SUMIFS(D_D[DEC],D_D[MT],5,D_D[CAT],SMS, D_D[EP],499,D_D[LOC],$A61)/$E61,0))","v":""},{"$f":"IF(ISNA($A61),\"\",IFERROR(SUMIFS(D_D[AWD],D_D[MT],5,D_D[CAT],SMS, D_D[EP],499,D_D[LOC],$A61)/$E61,0))","v":""},{"$f":"IF(ISNA($A61),\"\",IFERROR(SUMIFS(D_D[AUT],D_D[MT],5,D_D[CAT],SMS, D_D[EP],499,D_D[LOC],$A61)/$E61,0))","v":""}]
[{"$error":"#N/A"},49,"","",{"$f":"IF(ISNA($A62),\"\",IFERROR(SUMIFS(D_D[INV],D_D[MT],5,D_D[CAT],SMS, D_D[EP],499,D_D[LOC],$A62),0))","v":""},{"$f":"IF(ISNA($A62),\"\",IFERROR(SUMIFS(D_D[BL],D_D[MT],5,D_D[CAT],SMS, D_D[EP],499,D_D[LOC],$A62),0))","v":""},"",{"$f":"IF(ISNA($A62),\"\",IFERROR(SUMIFS(D_D[DEV],D_D[MT],5,D_D[CAT],SMS, D_D[EP],499,D_D[LOC],$A62)/$E62,0))","v":""},{"$f":"IF(ISNA($A62),\"\",IFERROR(SUMIFS(D_D[EVD],D_D[MT],5,D_D[CAT],SMS, D_D[EP],499,D_D[LOC],$A62)/$E62,0))","v":""},{"$f":"IF(ISNA($A62),\"\",IFERROR(SUMIFS(D_D[DEC],D_D[MT],5,D_D[CAT],SMS, D_D[EP],499,D_D[LOC],$A62)/$E62,0))","v":""},{"$f":"IF(ISNA($A62),\"\",IFERROR(SUMIFS(D_D[AWD],D_D[MT],5,D_D[CAT],SMS, D_D[EP],499,D_D[LOC],$A62)/$E62,0))","v":""},{"$f":"IF(ISNA($A62),\"\",IFERROR(SUMIFS(D_D[AUT],D_D[MT],5,D_D[CAT],SMS, D_D[EP],499,D_D[LOC],$A62)/$E62,0))","v":""}]
[{"$error":"#N/A"},50,{"$f":"IFERROR(INDEX(INDIRECT(DS_NWQ),B63),\"\")","v":""},"",{"$f":"IF(ISNA($A63),\"\",IFERROR(SUMIFS(D_D[INV],D_D[MT],5,D_D[CAT],SMS, D_D[EP],499,D_D[LOC],$A63),0))","v":""},{"$f":"IF(ISNA($A63),\"\",IFERROR(SUMIFS(D_D[BL],D_D[MT],5,D_D[CAT],SMS, D_D[EP],499,D_D[LOC],$A63),0))","v":""},"",{"$f":"IF(ISNA($A63),\"\",IFERROR(SUMIFS(D_D[DEV],D_D[MT],5,D_D[CAT],SMS, D_D[EP],499,D_D[LOC],$A63)/$E63,0))","v":""},{"$f":"IF(ISNA($A63),\"\",IFERROR(SUMIFS(D_D[EVD],D_D[MT],5,D_D[CAT],SMS, D_D[EP],499,D_D[LOC],$A63)/$E63,0))","v":""},{"$f":"IF(ISNA($A63),\"\",IFERROR(SUMIFS(D_D[DEC],D_D[MT],5,D_D[CAT],SMS, D_D[EP],499,D_D[LOC],$A63)/$E63,0))","v":""},{"$f":"IF(ISNA($A63),\"\",IFERROR(SUMIFS(D_D[AWD],D_D[MT],5,D_D[CAT],SMS, D_D[EP],499,D_D[LOC],$A63)/$E63,0))","v":""},{"$f":"IF(ISNA($A63),\"\",IFERROR(SUMIFS(D_D[AUT],D_D[MT],5,D_D[CAT],SMS, D_D[EP],499,D_D[LOC],$A63)/$E63,0))","v":""}]
[{"$error":"#N/A"},51,"",{"$f":"IFERROR(INDEX(INDIRECT(DS_NWQD),B64),\"\")","v":""},{"$f":"IF(ISNA($A64),\"\",IFERROR(SUMIFS(D_D[INV],D_D[MT],5,D_D[CAT],SMS, D_D[EP],499,D_D[LOC],$A64),0))","v":""},{"$f":"IF(ISNA($A64),\"\",IFERROR(SUMIFS(D_D[BL],D_D[MT],5,D_D[CAT],SMS, D_D[EP],499,D_D[LOC],$A64),0))","v":""},{"$f":"IF(ISNA($A64),\"\",IFERROR(F64/E64,0))","v":""},{"$f":"IF(ISNA($A64),\"\",IFERROR(SUMIFS(D_D[DEV],D_D[MT],5,D_D[CAT],SMS, D_D[EP],499,D_D[LOC],$A64)/$E64,0))","v":""},{"$f":"IF(ISNA($A64),\"\",IFERROR(SUMIFS(D_D[EVD],D_D[MT],5,D_D[CAT],SMS, D_D[EP],499,D_D[LOC],$A64)/$E64,0))","v":""},{"$f":"IF(ISNA($A64),\"\",IFERROR(SUMIFS(D_D[DEC],D_D[MT],5,D_D[CAT],SMS, D_D[EP],499,D_D[LOC],$A64)/$E64,0))","v":""},{"$f":"IF(ISNA($A64),\"\",IFERROR(SUMIFS(D_D[AWD],D_D[MT],5,D_D[CAT],SMS, D_D[EP],499,D_D[LOC],$A64)/$E64,0))","v":""},{"$f":"IF(ISNA($A64),\"\",IFERROR(SUMIFS(D_D[AUT],D_D[MT],5,D_D[CAT],SMS, D_D[EP],499,D_D[LOC],$A64)/$E64,0))","v":""}]
[{"$error":"#N/A"},52,"","",{"$f":"IF(ISNA($A65),\"\",IFERROR(SUMIFS(D_D[INV],D_D[MT],5,D_D[CAT],SMS, D_D[EP],499,D_D[LOC],$A65),0))","v":""},{"$f":"IF(ISNA($A65),\"\",IFERROR(SUMIFS(D_D[BL],D_D[MT],5,D_D[CAT],SMS, D_D[EP],499,D_D[LOC],$A65),0))","v":""},"",{"$f":"IF(ISNA($A65),\"\",IFERROR(SUMIFS(D_D[DEV],D_D[MT],5,D_D[CAT],SMS, D_D[EP],499,D_D[LOC],$A65)/$E65,0))","v":""},{"$f":"IF(ISNA($A65),\"\",IFERROR(SUMIFS(D_D[EVD],D_D[MT],5,D_D[CAT],SMS, D_D[EP],499,D_D[LOC],$A65)/$E65,0))","v":""},{"$f":"IF(ISNA($A65),\"\",IFERROR(SUMIFS(D_D[DEC],D_D[MT],5,D_D[CAT],SMS, D_D[EP],499,D_D[LOC],$A65)/$E65,0))","v":""},{"$f":"IF(ISNA($A65),\"\",IFERROR(SUMIFS(D_D[AWD],D_D[MT],5,D_D[CAT],SMS, D_D[EP],499,D_D[LOC],$A65)/$E65,0))","v":""},{"$f":"IF(ISNA($A65),\"\",IFERROR(SUMIFS(D_D[AUT],D_D[MT],5,D_D[CAT],SMS, D_D[EP],499,D_D[LOC],$A65)/$E65,0))","v":""}]
[{"$error":"#N/A"},53,"","",{"$f":"IF(ISNA($A66),\"\",IFERROR(SUMIFS(D_D[INV],D_D[MT],5,D_D[CAT],SMS, D_D[EP],499,D_D[LOC],$A66),0))","v":""},{"$f":"IF(ISNA($A66),\"\",IFERROR(SUMIFS(D_D[BL],D_D[MT],5,D_D[CAT],SMS, D_D[EP],499,D_D[LOC],$A66),0))","v":""},"",{"$f":"IF(ISNA($A66),\"\",IFERROR(SUMIFS(D_D[DEV],D_D[MT],5,D_D[CAT],SMS, D_D[EP],499,D_D[LOC],$A66)/$E66,0))","v":""},{"$f":"IF(ISNA($A66),\"\",IFERROR(SUMIFS(D_D[EVD],D_D[MT],5,D_D[CAT],SMS, D_D[EP],499,D_D[LOC],$A66)/$E66,0))","v":""},{"$f":"IF(ISNA($A66),\"\",IFERROR(SUMIFS(D_D[DEC],D_D[MT],5,D_D[CAT],SMS, D_D[EP],499,D_D[LOC],$A66)/$E66,0))","v":""},{"$f":"IF(ISNA($A66),\"\",IFERROR(SUMIFS(D_D[AWD],D_D[MT],5,D_D[CAT],SMS, D_D[EP],499,D_D[LOC],$A66)/$E66,0))","v":""},{"$f":"IF(ISNA($A66),\"\",IFERROR(SUMIFS(D_D[AUT],D_D[MT],5,D_D[CAT],SMS, D_D[EP],499,D_D[LOC],$A66)/$E66,0))","v":""}]
[{"$error":"#N/A"},54,"","",{"$f":"IF(ISNA($A67),\"\",IFERROR(SUMIFS(D_D[INV],D_D[MT],5,D_D[CAT],SMS, D_D[EP],499,D_D[LOC],$A67),0))","v":""},{"$f":"IF(ISNA($A67),\"\",IFERROR(SUMIFS(D_D[BL],D_D[MT],5,D_D[CAT],SMS, D_D[EP],499,D_D[LOC],$A67),0))","v":""},"",{"$f":"IF(ISNA($A67),\"\",IFERROR(SUMIFS(D_D[DEV],D_D[MT],5,D_D[CAT],SMS, D_D[EP],499,D_D[LOC],$A67)/$E67,0))","v":""},{"$f":"IF(ISNA($A67),\"\",IFERROR(SUMIFS(D_D[EVD],D_D[MT],5,D_D[CAT],SMS, D_D[EP],499,D_D[LOC],$A67)/$E67,0))","v":""},{"$f":"IF(ISNA($A67),\"\",IFERROR(SUMIFS(D_D[DEC],D_D[MT],5,D_D[CAT],SMS, D_D[EP],499,D_D[LOC],$A67)/$E67,0))","v":""},{"$f":"IF(ISNA($A67),\"\",IFERROR(SUMIFS(D_D[AWD],D_D[MT],5,D_D[CAT],SMS, D_D[EP],499,D_D[LOC],$A67)/$E67,0))","v":""},{"$f":"IF(ISNA($A67),\"\",IFERROR(SUMIFS(D_D[AUT],D_D[MT],5,D_D[CAT],SMS, D_D[EP],499,D_D[LOC],$A67)/$E67,0))","v":""}]
[{"$error":"#N/A"},55,"","",{"$f":"IF(ISNA($A68),\"\",IFERROR(SUMIFS(D_D[INV],D_D[MT],5,D_D[CAT],SMS, D_D[EP],499,D_D[LOC],$A68),0))","v":""},{"$f":"IF(ISNA($A68),\"\",IFERROR(SUMIFS(D_D[BL],D_D[MT],5,D_D[CAT],SMS, D_D[EP],499,D_D[LOC],$A68),0))","v":""},"",{"$f":"IF(ISNA($A68),\"\",IFERROR(SUMIFS(D_D[DEV],D_D[MT],5,D_D[CAT],SMS, D_D[EP],499,D_D[LOC],$A68)/$E68,0))","v":""},{"$f":"IF(ISNA($A68),\"\",IFERROR(SUMIFS(D_D[EVD],D_D[MT],5,D_D[CAT],SMS, D_D[EP],499,D_D[LOC],$A68)/$E68,0))","v":""},{"$f":"IF(ISNA($A68),\"\",IFERROR(SUMIFS(D_D[DEC],D_D[MT],5,D_D[CAT],SMS, D_D[EP],499,D_D[LOC],$A68)/$E68,0))","v":""},{"$f":"IF(ISNA($A68),\"\",IFERROR(SUMIFS(D_D[AWD],D_D[MT],5,D_D[CAT],SMS, D_D[EP],499,D_D[LOC],$A68)/$E68,0))","v":""},{"$f":"IF(ISNA($A68),\"\",IFERROR(SUMIFS(D_D[AUT],D_D[MT],5,D_D[CAT],SMS, D_D[EP],499,D_D[LOC],$A68)/$E68,0))","v":""}]
[{"$error":"#N/A"},56,"","",{"$f":"IF(ISNA($A69),\"\",IFERROR(SUMIFS(D_D[INV],D_D[MT],5,D_D[CAT],SMS, D_D[EP],499,D_D[LOC],$A69),0))","v":""},{"$f":"IF(ISNA($A69),\"\",IFERROR(SUMIFS(D_D[BL],D_D[MT],5,D_D[CAT],SMS, D_D[EP],499,D_D[LOC],$A69),0))","v":""},"",{"$f":"IF(ISNA($A69),\"\",IFERROR(SUMIFS(D_D[DEV],D_D[MT],5,D_D[CAT],SMS, D_D[EP],499,D_D[LOC],$A69)/$E69,0))","v":""},{"$f":"IF(ISNA($A69),\"\",IFERROR(SUMIFS(D_D[EVD],D_D[MT],5,D_D[CAT],SMS, D_D[EP],499,D_D[LOC],$A69)/$E69,0))","v":""},{"$f":"IF(ISNA($A69),\"\",IFERROR(SUMIFS(D_D[DEC],D_D[MT],5,D_D[CAT],SMS, D_D[EP],499,D_D[LOC],$A69)/$E69,0))","v":""},{"$f":"IF(ISNA($A69),\"\",IFERROR(SUMIFS(D_D[AWD],D_D[MT],5,D_D[CAT],SMS, D_D[EP],499,D_D[LOC],$A69)/$E69,0))","v":""},{"$f":"IF(ISNA($A69),\"\",IFERROR(SUMIFS(D_D[AUT],D_D[MT],5,D_D[CAT],SMS, D_D[EP],499,D_D[LOC],$A69)/$E69,0))","v":""}]
[{"$error":"#N/A"},57,"","",{"$f":"IF(ISNA($A70),\"\",IFERROR(SUMIFS(D_D[INV],D_D[MT],5,D_D[CAT],SMS, D_D[EP],499,D_D[LOC],$A70),0))","v":""},{"$f":"IF(ISNA($A70),\"\",IFERROR(SUMIFS(D_D[BL],D_D[MT],5,D_D[CAT],SMS, D_D[EP],499,D_D[LOC],$A70),0))","v":""},"",{"$f":"IF(ISNA($A70),\"\",IFERROR(SUMIFS(D_D[DEV],D_D[MT],5,D_D[CAT],SMS, D_D[EP],499,D_D[LOC],$A70)/$E70,0))","v":""},{"$f":"IF(ISNA($A70),\"\",IFERROR(SUMIFS(D_D[EVD],D_D[MT],5,D_D[CAT],SMS, D_D[EP],499,D_D[LOC],$A70)/$E70,0))","v":""},{"$f":"IF(ISNA($A70),\"\",IFERROR(SUMIFS(D_D[DEC],D_D[MT],5,D_D[CAT],SMS, D_D[EP],499,D_D[LOC],$A70)/$E70,0))","v":""},{"$f":"IF(ISNA($A70),\"\",IFERROR(SUMIFS(D_D[AWD],D_D[MT],5,D_D[CAT],SMS, D_D[EP],499,D_D[LOC],$A70)/$E70,0))","v":""},{"$f":"IF(ISNA($A70),\"\",IFERROR(SUMIFS(D_D[AUT],D_D[MT],5,D_D[CAT],SMS, D_D[EP],499,D_D[LOC],$A70)/$E70,0))","v":""}]
[{"$error":"#N/A"},58,"","",{"$f":"IF(ISNA($A71),\"\",IFERROR(SUMIFS(D_D[INV],D_D[MT],5,D_D[CAT],SMS, D_D[EP],499,D_D[LOC],$A71),0))","v":""},{"$f":"IF(ISNA($A71),\"\",IFERROR(SUMIFS(D_D[BL],D_D[MT],5,D_D[CAT],SMS, D_D[EP],499,D_D[LOC],$A71),0))","v":""},"",{"$f":"IF(ISNA($A71),\"\",IFERROR(SUMIFS(D_D[DEV],D_D[MT],5,D_D[CAT],SMS, D_D[EP],499,D_D[LOC],$A71)/$E71,0))","v":""},{"$f":"IF(ISNA($A71),\"\",IFERROR(SUMIFS(D_D[EVD],D_D[MT],5,D_D[CAT],SMS, D_D[EP],499,D_D[LOC],$A71)/$E71,0))","v":""},{"$f":"IF(ISNA($A71),\"\",IFERROR(SUMIFS(D_D[DEC],D_D[MT],5,D_D[CAT],SMS, D_D[EP],499,D_D[LOC],$A71)/$E71,0))","v":""},{"$f":"IF(ISNA($A71),\"\",IFERROR(SUMIFS(D_D[AWD],D_D[MT],5,D_D[CAT],SMS, D_D[EP],499,D_D[LOC],$A71)/$E71,0))","v":""},{"$f":"IF(ISNA($A71),\"\",IFERROR(SUMIFS(D_D[AUT],D_D[MT],5,D_D[CAT],SMS, D_D[EP],499,D_D[LOC],$A71)/$E71,0))","v":""}]
[{"$error":"#N/A"},59,"","",{"$f":"IF(ISNA($A72),\"\",IFERROR(SUMIFS(D_D[INV],D_D[MT],5,D_D[CAT],SMS, D_D[EP],499,D_D[LOC],$A72),0))","v":""},{"$f":"IF(ISNA($A72),\"\",IFERROR(SUMIFS(D_D[BL],D_D[MT],5,D_D[CAT],SMS, D_D[EP],499,D_D[LOC],$A72),0))","v":""},"",{"$f":"IF(ISNA($A72),\"\",IFERROR(SUMIFS(D_D[DEV],D_D[MT],5,D_D[CAT],SMS, D_D[EP],499,D_D[LOC],$A72)/$E72,0))","v":""},{"$f":"IF(ISNA($A72),\"\",IFERROR(SUMIFS(D_D[EVD],D_D[MT],5,D_D[CAT],SMS, D_D[EP],499,D_D[LOC],$A72)/$E72,0))","v":""},{"$f":"IF(ISNA($A72),\"\",IFERROR(SUMIFS(D_D[DEC],D_D[MT],5,D_D[CAT],SMS, D_D[EP],499,D_D[LOC],$A72)/$E72,0))","v":""},{"$f":"IF(ISNA($A72),\"\",IFERROR(SUMIFS(D_D[AWD],D_D[MT],5,D_D[CAT],SMS, D_D[EP],499,D_D[LOC],$A72)/$E72,0))","v":""},{"$f":"IF(ISNA($A72),\"\",IFERROR(SUMIFS(D_D[AUT],D_D[MT],5,D_D[CAT],SMS, D_D[EP],499,D_D[LOC],$A72)/$E72,0))","v":""}]
[{"$error":"#N/A"},60,"","",{"$f":"IF(ISNA($A73),\"\",IFERROR(SUMIFS(D_D[INV],D_D[MT],5,D_D[CAT],SMS, D_D[EP],499,D_D[LOC],$A73),0))","v":""},{"$f":"IF(ISNA($A73),\"\",IFERROR(SUMIFS(D_D[BL],D_D[MT],5,D_D[CAT],SMS, D_D[EP],499,D_D[LOC],$A73),0))","v":""},"",{"$f":"IF(ISNA($A73),\"\",IFERROR(SUMIFS(D_D[DEV],D_D[MT],5,D_D[CAT],SMS, D_D[EP],499,D_D[LOC],$A73)/$E73,0))","v":""},{"$f":"IF(ISNA($A73),\"\",IFERROR(SUMIFS(D_D[EVD],D_D[MT],5,D_D[CAT],SMS, D_D[EP],499,D_D[LOC],$A73)/$E73,0))","v":""},{"$f":"IF(ISNA($A73),\"\",IFERROR(SUMIFS(D_D[DEC],D_D[MT],5,D_D[CAT],SMS, D_D[EP],499,D_D[LOC],$A73)/$E73,0))","v":""},{"$f":"IF(ISNA($A73),\"\",IFERROR(SUMIFS(D_D[AWD],D_D[MT],5,D_D[CAT],SMS, D_D[EP],499,D_D[LOC],$A73)/$E73,0))","v":""},{"$f":"IF(ISNA($A73),\"\",IFERROR(SUMIFS(D_D[AUT],D_D[MT],5,D_D[CAT],SMS, D_D[EP],499,D_D[LOC],$A73)/$E73,0))","v":""}]
[{"$error":"#N/A"},61,"","",{"$f":"IF(ISNA($A74),\"\",IFERROR(SUMIFS(D_D[INV],D_D[MT],5,D_D[CAT],SMS, D_D[EP],499,D_D[LOC],$A74),0))","v":""},{"$f":"IF(ISNA($A74),\"\",IFERROR(SUMIFS(D_D[BL],D_D[MT],5,D_D[CAT],SMS, D_D[EP],499,D_D[LOC],$A74),0))","v":""},"",{"$f":"IF(ISNA($A74),\"\",IFERROR(SUMIFS(D_D[DEV],D_D[MT],5,D_D[CAT],SMS, D_D[EP],499,D_D[LOC],$A74)/$E74,0))","v":""},{"$f":"IF(ISNA($A74),\"\",IFERROR(SUMIFS(D_D[EVD],D_D[MT],5,D_D[CAT],SMS, D_D[EP],499,D_D[LOC],$A74)/$E74,0))","v":""},{"$f":"IF(ISNA($A74),\"\",IFERROR(SUMIFS(D_D[DEC],D_D[MT],5,D_D[CAT],SMS, D_D[EP],499,D_D[LOC],$A74)/$E74,0))","v":""},{"$f":"IF(ISNA($A74),\"\",IFERROR(SUMIFS(D_D[AWD],D_D[MT],5,D_D[CAT],SMS, D_D[EP],499,D_D[LOC],$A74)/$E74,0))","v":""},{"$f":"IF(ISNA($A74),\"\",IFERROR(SUMIFS(D_D[AUT],D_D[MT],5,D_D[CAT],SMS, D_D[EP],499,D_D[LOC],$A74)/$E74,0))","v":""}]
[{"$error":"#N/A"},62,"","",{"$f":"IF(ISNA($A75),\"\",IFERROR(SUMIFS(D_D[INV],D_D[MT],5,D_D[CAT],SMS, D_D[EP],499,D_D[LOC],$A75),0))","v":""},{"$f":"IF(ISNA($A75),\"\",IFERROR(SUMIFS(D_D[BL],D_D[MT],5,D_D[CAT],SMS, D_D[EP],499,D_D[LOC],$A75),0))","v":""},"",{"$f":"IF(ISNA($A75),\"\",IFERROR(SUMIFS(D_D[DEV],D_D[MT],5,D_D[CAT],SMS, D_D[EP],499,D_D[LOC],$A75)/$E75,0))","v":""},{"$f":"IF(ISNA($A75),\"\",IFERROR(SUMIFS(D_D[EVD],D_D[MT],5,D_D[CAT],SMS, D_D[EP],499,D_D[LOC],$A75)/$E75,0))","v":""},{"$f":"IF(ISNA($A75),\"\",IFERROR(SUMIFS(D_D[DEC],D_D[MT],5,D_D[CAT],SMS, D_D[EP],499,D_D[LOC],$A75)/$E75,0))","v":""},{"$f":"IF(ISNA($A75),\"\",IFERROR(SUMIFS(D_D[AWD],D_D[MT],5,D_D[CAT],SMS, D_D[EP],499,D_D[LOC],$A75)/$E75,0))","v":""},{"$f":"IF(ISNA($A75),\"\",IFERROR(SUMIFS(D_D[AUT],D_D[MT],5,D_D[CAT],SMS, D_D[EP],499,D_D[LOC],$A75)/$E75,0))","v":""}]
[{"$error":"#N/A"},63,"","",{"$f":"IF(ISNA($A76),\"\",IFERROR(SUMIFS(D_D[INV],D_D[MT],5,D_D[CAT],SMS, D_D[EP],499,D_D[LOC],$A76),0))","v":""},{"$f":"IF(ISNA($A76),\"\",IFERROR(SUMIFS(D_D[BL],D_D[MT],5,D_D[CAT],SMS, D_D[EP],499,D_D[LOC],$A76),0))","v":""},"",{"$f":"IF(ISNA($A76),\"\",IFERROR(SUMIFS(D_D[DEV],D_D[MT],5,D_D[CAT],SMS, D_D[EP],499,D_D[LOC],$A76)/$E76,0))","v":""},{"$f":"IF(ISNA($A76),\"\",IFERROR(SUMIFS(D_D[EVD],D_D[MT],5,D_D[CAT],SMS, D_D[EP],499,D_D[LOC],$A76)/$E76,0))","v":""},{"$f":"IF(ISNA($A76),\"\",IFERROR(SUMIFS(D_D[DEC],D_D[MT],5,D_D[CAT],SMS, D_D[EP],499,D_D[LOC],$A76)/$E76,0))","v":""},{"$f":"IF(ISNA($A76),\"\",IFERROR(SUMIFS(D_D[AWD],D_D[MT],5,D_D[CAT],SMS, D_D[EP],499,D_D[LOC],$A76)/$E76,0))","v":""},{"$f":"IF(ISNA($A76),\"\",IFERROR(SUMIFS(D_D[AUT],D_D[MT],5,D_D[CAT],SMS, D_D[EP],499,D_D[LOC],$A76)/$E76,0))","v":""}]
[{"$error":"#N/A"},64,"","",{"$f":"IF(ISNA($A77),\"\",IFERROR(SUMIFS(D_D[INV],D_D[MT],5,D_D[CAT],SMS, D_D[EP],499,D_D[LOC],$A77),0))","v":""},{"$f":"IF(ISNA($A77),\"\",IFERROR(SUMIFS(D_D[BL],D_D[MT],5,D_D[CAT],SMS, D_D[EP],499,D_D[LOC],$A77),0))","v":""},"",{"$f":"IF(ISNA($A77),\"\",IFERROR(SUMIFS(D_D[DEV],D_D[MT],5,D_D[CAT],SMS, D_D[EP],499,D_D[LOC],$A77)/$E77,0))","v":""},{"$f":"IF(ISNA($A77),\"\",IFERROR(SUMIFS(D_D[EVD],D_D[MT],5,D_D[CAT],SMS, D_D[EP],499,D_D[LOC],$A77)/$E77,0))","v":""},{"$f":"IF(ISNA($A77),\"\",IFERROR(SUMIFS(D_D[DEC],D_D[MT],5,D_D[CAT],SMS, D_D[EP],499,D_D[LOC],$A77)/$E77,0))","v":""},{"$f":"IF(ISNA($A77),\"\",IFERROR(SUMIFS(D_D[AWD],D_D[MT],5,D_D[CAT],SMS, D_D[EP],499,D_D[LOC],$A77)/$E77,0))","v":""},{"$f":"IF(ISNA($A77),\"\",IFERROR(SUMIFS(D_D[AUT],D_D[MT],5,D_D[CAT],SMS, D_D[EP],499,D_D[LOC],$A77)/$E77,0))","v":""}]
[{"$error":"#N/A"},65,"","",{"$f":"IF(ISNA($A78),\"\",IFERROR(SUMIFS(D_D[INV],D_D[MT],5,D_D[CAT],SMS, D_D[EP],499,D_D[LOC],$A78),0))","v":""},{"$f":"IF(ISNA($A78),\"\",IFERROR(SUMIFS(D_D[BL],D_D[MT],5,D_D[CAT],SMS, D_D[EP],499,D_D[LOC],$A78),0))","v":""},"",{"$f":"IF(ISNA($A78),\"\",IFERROR(SUMIFS(D_D[DEV],D_D[MT],5,D_D[CAT],SMS, D_D[EP],499,D_D[LOC],$A78)/$E78,0))","v":""},{"$f":"IF(ISNA($A78),\"\",IFERROR(SUMIFS(D_D[EVD],D_D[MT],5,D_D[CAT],SMS, D_D[EP],499,D_D[LOC],$A78)/$E78,0))","v":""},{"$f":"IF(ISNA($A78),\"\",IFERROR(SUMIFS(D_D[DEC],D_D[MT],5,D_D[CAT],SMS, D_D[EP],499,D_D[LOC],$A78)/$E78,0))","v":""},{"$f":"IF(ISNA($A78),\"\",IFERROR(SUMIFS(D_D[AWD],D_D[MT],5,D_D[CAT],SMS, D_D[EP],499,D_D[LOC],$A78)/$E78,0))","v":""},{"$f":"IF(ISNA($A78),\"\",IFERROR(SUMIFS(D_D[AUT],D_D[MT],5,D_D[CAT],SMS, D_D[EP],499,D_D[LOC],$A78)/$E78,0))","v":""}]
[{"$error":"#N/A"},66,"","",{"$f":"IF(ISNA($A79),\"\",IFERROR(SUMIFS(D_D[INV],D_D[MT],5,D_D[CAT],SMS, D_D[EP],499,D_D[LOC],$A79),0))","v":""},{"$f":"IF(ISNA($A79),\"\",IFERROR(SUMIFS(D_D[BL],D_D[MT],5,D_D[CAT],SMS, D_D[EP],499,D_D[LOC],$A79),0))","v":""},"",{"$f":"IF(ISNA($A79),\"\",IFERROR(SUMIFS(D_D[DEV],D_D[MT],5,D_D[CAT],SMS, D_D[EP],499,D_D[LOC],$A79)/$E79,0))","v":""},{"$f":"IF(ISNA($A79),\"\",IFERROR(SUMIFS(D_D[EVD],D_D[MT],5,D_D[CAT],SMS, D_D[EP],499,D_D[LOC],$A79)/$E79,0))","v":""},{"$f":"IF(ISNA($A79),\"\",IFERROR(SUMIFS(D_D[DEC],D_D[MT],5,D_D[CAT],SMS, D_D[EP],499,D_D[LOC],$A79)/$E79,0))","v":""},{"$f":"IF(ISNA($A79),\"\",IFERROR(SUMIFS(D_D[AWD],D_D[MT],5,D_D[CAT],SMS, D_D[EP],499,D_D[LOC],$A79)/$E79,0))","v":""},{"$f":"IF(ISNA($A79),\"\",IFERROR(SUMIFS(D_D[AUT],D_D[MT],5,D_D[CAT],SMS, D_D[EP],499,D_D[LOC],$A79)/$E79,0))","v":""}]
[{"$error":"#N/A"},67,"","",{"$f":"IF(ISNA($A80),\"\",IFERROR(SUMIFS(D_D[INV],D_D[MT],5,D_D[CAT],SMS, D_D[EP],499,D_D[LOC],$A80),0))","v":""},{"$f":"IF(ISNA($A80),\"\",IFERROR(SUMIFS(D_D[BL],D_D[MT],5,D_D[CAT],SMS, D_D[EP],499,D_D[LOC],$A80),0))","v":""},"",{"$f":"IF(ISNA($A80),\"\",IFERROR(SUMIFS(D_D[DEV],D_D[MT],5,D_D[CAT],SMS, D_D[EP],499,D_D[LOC],$A80)/$E80,0))","v":""},{"$f":"IF(ISNA($A80),\"\",IFERROR(SUMIFS(D_D[EVD],D_D[MT],5,D_D[CAT],SMS, D_D[EP],499,D_D[LOC],$A80)/$E80,0))","v":""},{"$f":"IF(ISNA($A80),\"\",IFERROR(SUMIFS(D_D[DEC],D_D[MT],5,D_D[CAT],SMS, D_D[EP],499,D_D[LOC],$A80)/$E80,0))","v":""},{"$f":"IF(ISNA($A80),\"\",IFERROR(SUMIFS(D_D[AWD],D_D[MT],5,D_D[CAT],SMS, D_D[EP],499,D_D[LOC],$A80)/$E80,0))","v":""},{"$f":"IF(ISNA($A80),\"\",IFERROR(SUMIFS(D_D[AUT],D_D[MT],5,D_D[CAT],SMS, D_D[EP],499,D_D[LOC],$A80)/$E80,0))","v":""}]
[{"$error":"#N/A"},68,{"$f":"IFERROR(INDEX(INDIRECT(DS_NWQ),B81),\"\")","v":""},"",{"$f":"IF(ISNA($A81),\"\",IFERROR(SUMIFS(D_D[INV],D_D[MT],5,D_D[CAT],SMS, D_D[EP],499,D_D[LOC],$A81),0))","v":""},{"$f":"IF(ISNA($A81),\"\",IFERROR(SUMIFS(D_D[BL],D_D[MT],5,D_D[CAT],SMS, D_D[EP],499,D_D[LOC],$A81),0))","v":""},"",{"$f":"IF(ISNA($A81),\"\",IFERROR(SUMIFS(D_D[DEV],D_D[MT],5,D_D[CAT],SMS, D_D[EP],499,D_D[LOC],$A81)/$E81,0))","v":""},{"$f":"IF(ISNA($A81),\"\",IFERROR(SUMIFS(D_D[EVD],D_D[MT],5,D_D[CAT],SMS, D_D[EP],499,D_D[LOC],$A81)/$E81,0))","v":""},{"$f":"IF(ISNA($A81),\"\",IFERROR(SUMIFS(D_D[DEC],D_D[MT],5,D_D[CAT],SMS, D_D[EP],499,D_D[LOC],$A81)/$E81,0))","v":""},{"$f":"IF(ISNA($A81),\"\",IFERROR(SUMIFS(D_D[AWD],D_D[MT],5,D_D[CAT],SMS, D_D[EP],499,D_D[LOC],$A81)/$E81,0))","v":""},{"$f":"IF(ISNA($A81),\"\",IFERROR(SUMIFS(D_D[AUT],D_D[MT],5,D_D[CAT],SMS, D_D[EP],499,D_D[LOC],$A81)/$E81,0))","v":""}]
[{"$error":"#N/A"},69,"",{"$f":"IFERROR(INDEX(INDIRECT(DS_NWQD),B82),\"\")","v":""},{"$f":"IF(ISNA($A82),\"\",IFERROR(SUMIFS(D_D[INV],D_D[MT],5,D_D[CAT],SMS, D_D[EP],499,D_D[LOC],$A82),0))","v":""},{"$f":"IF(ISNA($A82),\"\",IFERROR(SUMIFS(D_D[BL],D_D[MT],5,D_D[CAT],SMS, D_D[EP],499,D_D[LOC],$A82),0))","v":""},{"$f":"IF(ISNA($A82),\"\",IFERROR(F82/E82,0))","v":""},{"$f":"IF(ISNA($A82),\"\",IFERROR(SUMIFS(D_D[DEV],D_D[MT],5,D_D[CAT],SMS, D_D[EP],499,D_D[LOC],$A82)/$E82,0))","v":""},{"$f":"IF(ISNA($A82),\"\",IFERROR(SUMIFS(D_D[EVD],D_D[MT],5,D_D[CAT],SMS, D_D[EP],499,D_D[LOC],$A82)/$E82,0))","v":""},{"$f":"IF(ISNA($A82),\"\",IFERROR(SUMIFS(D_D[DEC],D_D[MT],5,D_D[CAT],SMS, D_D[EP],499,D_D[LOC],$A82)/$E82,0))","v":""},{"$f":"IF(ISNA($A82),\"\",IFERROR(SUMIFS(D_D[AWD],D_D[MT],5,D_D[CAT],SMS, D_D[EP],499,D_D[LOC],$A82)/$E82,0))","v":""},{"$f":"IF(ISNA($A82),\"\",IFERROR(SUMIFS(D_D[AUT],D_D[MT],5,D_D[CAT],SMS, D_D[EP],499,D_D[LOC],$A82)/$E82,0))","v":""}]
[{"$error":"#N/A"},70,"","",{"$f":"IF(ISNA($A83),\"\",IFERROR(SUMIFS(D_D[INV],D_D[MT],5,D_D[CAT],SMS, D_D[EP],499,D_D[LOC],$A83),0))","v":""},{"$f":"IF(ISNA($A83),\"\",IFERROR(SUMIFS(D_D[BL],D_D[MT],5,D_D[CAT],SMS, D_D[EP],499,D_D[LOC],$A83),0))","v":""},"",{"$f":"IF(ISNA($A83),\"\",IFERROR(SUMIFS(D_D[DEV],D_D[MT],5,D_D[CAT],SMS, D_D[EP],499,D_D[LOC],$A83)/$E83,0))","v":""},{"$f":"IF(ISNA($A83),\"\",IFERROR(SUMIFS(D_D[EVD],D_D[MT],5,D_D[CAT],SMS, D_D[EP],499,D_D[LOC],$A83)/$E83,0))","v":""},{"$f":"IF(ISNA($A83),\"\",IFERROR(SUMIFS(D_D[DEC],D_D[MT],5,D_D[CAT],SMS, D_D[EP],499,D_D[LOC],$A83)/$E83,0))","v":""},{"$f":"IF(ISNA($A83),\"\",IFERROR(SUMIFS(D_D[AWD],D_D[MT],5,D_D[CAT],SMS, D_D[EP],499,D_D[LOC],$A83)/$E83,0))","v":""},{"$f":"IF(ISNA($A83),\"\",IFERROR(SUMIFS(D_D[AUT],D_D[MT],5,D_D[CAT],SMS, D_D[EP],499,D_D[LOC],$A83)/$E83,0))","v":""}]
[{"$error":"#N/A"},71,"","",{"$f":"IF(ISNA($A84),\"\",IFERROR(SUMIFS(D_D[INV],D_D[MT],5,D_D[CAT],SMS, D_D[EP],499,D_D[LOC],$A84),0))","v":""},{"$f":"IF(ISNA($A84),\"\",IFERROR(SUMIFS(D_D[BL],D_D[MT],5,D_D[CAT],SMS, D_D[EP],499,D_D[LOC],$A84),0))","v":""},"",{"$f":"IF(ISNA($A84),\"\",IFERROR(SUMIFS(D_D[DEV],D_D[MT],5,D_D[CAT],SMS, D_D[EP],499,D_D[LOC],$A84)/$E84,0))","v":""},{"$f":"IF(ISNA($A84),\"\",IFERROR(SUMIFS(D_D[EVD],D_D[MT],5,D_D[CAT],SMS, D_D[EP],499,D_D[LOC],$A84)/$E84,0))","v":""},{"$f":"IF(ISNA($A84),\"\",IFERROR(SUMIFS(D_D[DEC],D_D[MT],5,D_D[CAT],SMS, D_D[EP],499,D_D[LOC],$A84)/$E84,0))","v":""},{"$f":"IF(ISNA($A84),\"\",IFERROR(SUMIFS(D_D[AWD],D_D[MT],5,D_D[CAT],SMS, D_D[EP],499,D_D[LOC],$A84)/$E84,0))","v":""},{"$f":"IF(ISNA($A84),\"\",IFERROR(SUMIFS(D_D[AUT],D_D[MT],5,D_D[CAT],SMS, D_D[EP],499,D_D[LOC],$A84)/$E84,0))","v":""}]
[{"$error":"#N/A"},72,"","",{"$f":"IF(ISNA($A85),\"\",IFERROR(SUMIFS(D_D[INV],D_D[MT],5,D_D[CAT],SMS, D_D[EP],499,D_D[LOC],$A85),0))","v":""},{"$f":"IF(ISNA($A85),\"\",IFERROR(SUMIFS(D_D[BL],D_D[MT],5,D_D[CAT],SMS, D_D[EP],499,D_D[LOC],$A85),0))","v":""},"",{"$f":"IF(ISNA($A85),\"\",IFERROR(SUMIFS(D_D[DEV],D_D[MT],5,D_D[CAT],SMS, D_D[EP],499,D_D[LOC],$A85)/$E85,0))","v":""},{"$f":"IF(ISNA($A85),\"\",IFERROR(SUMIFS(D_D[EVD],D_D[MT],5,D_D[CAT],SMS, D_D[EP],499,D_D[LOC],$A85)/$E85,0))","v":""},{"$f":"IF(ISNA($A85),\"\",IFERROR(SUMIFS(D_D[DEC],D_D[MT],5,D_D[CAT],SMS, D_D[EP],499,D_D[LOC],$A85)/$E85,0))","v":""},{"$f":"IF(ISNA($A85),\"\",IFERROR(SUMIFS(D_D[AWD],D_D[MT],5,D_D[CAT],SMS, D_D[EP],499,D_D[LOC],$A85)/$E85,0))","v":""},{"$f":"IF(ISNA($A85),\"\",IFERROR(SUMIFS(D_D[AUT],D_D[MT],5,D_D[CAT],SMS, D_D[EP],499,D_D[LOC],$A85)/$E85,0))","v":""}]
[{"$error":"#N/A"},73,"","",{"$f":"IF(ISNA($A86),\"\",IFERROR(SUMIFS(D_D[INV],D_D[MT],5,D_D[CAT],SMS, D_D[EP],499,D_D[LOC],$A86),0))","v":""},{"$f":"IF(ISNA($A86),\"\",IFERROR(SUMIFS(D_D[BL],D_D[MT],5,D_D[CAT],SMS, D_D[EP],499,D_D[LOC],$A86),0))","v":""},"",{"$f":"IF(ISNA($A86),\"\",IFERROR(SUMIFS(D_D[DEV],D_D[MT],5,D_D[CAT],SMS, D_D[EP],499,D_D[LOC],$A86)/$E86,0))","v":""},{"$f":"IF(ISNA($A86),\"\",IFERROR(SUMIFS(D_D[EVD],D_D[MT],5,D_D[CAT],SMS, D_D[EP],499,D_D[LOC],$A86)/$E86,0))","v":""},{"$f":"IF(ISNA($A86),\"\",IFERROR(SUMIFS(D_D[DEC],D_D[MT],5,D_D[CAT],SMS, D_D[EP],499,D_D[LOC],$A86)/$E86,0))","v":""},{"$f":"IF(ISNA($A86),\"\",IFERROR(SUMIFS(D_D[AWD],D_D[MT],5,D_D[CAT],SMS, D_D[EP],499,D_D[LOC],$A86)/$E86,0))","v":""},{"$f":"IF(ISNA($A86),\"\",IFERROR(SUMIFS(D_D[AUT],D_D[MT],5,D_D[CAT],SMS, D_D[EP],499,D_D[LOC],$A86)/$E86,0))","v":""}]
[{"$error":"#N/A"},74,"","",{"$f":"IF(ISNA($A87),\"\",IFERROR(SUMIFS(D_D[INV],D_D[MT],5,D_D[CAT],SMS, D_D[EP],499,D_D[LOC],$A87),0))","v":""},{"$f":"IF(ISNA($A87),\"\",IFERROR(SUMIFS(D_D[BL],D_D[MT],5,D_D[CAT],SMS, D_D[EP],499,D_D[LOC],$A87),0))","v":""},"",{"$f":"IF(ISNA($A87),\"\",IFERROR(SUMIFS(D_D[DEV],D_D[MT],5,D_D[CAT],SMS, D_D[EP],499,D_D[LOC],$A87)/$E87,0))","v":""},{"$f":"IF(ISNA($A87),\"\",IFERROR(SUMIFS(D_D[EVD],D_D[MT],5,D_D[CAT],SMS, D_D[EP],499,D_D[LOC],$A87)/$E87,0))","v":""},{"$f":"IF(ISNA($A87),\"\",IFERROR(SUMIFS(D_D[DEC],D_D[MT],5,D_D[CAT],SMS, D_D[EP],499,D_D[LOC],$A87)/$E87,0))","v":""},{"$f":"IF(ISNA($A87),\"\",IFERROR(SUMIFS(D_D[AWD],D_D[MT],5,D_D[CAT],SMS, D_D[EP],499,D_D[LOC],$A87)/$E87,0))","v":""},{"$f":"IF(ISNA($A87),\"\",IFERROR(SUMIFS(D_D[AUT],D_D[MT],5,D_D[CAT],SMS, D_D[EP],499,D_D[LOC],$A87)/$E87,0))","v":""}]
[{"$error":"#N/A"},75,"","",{"$f":"IF(ISNA($A88),\"\",IFERROR(SUMIFS(D_D[INV],D_D[MT],5,D_D[CAT],SMS, D_D[EP],499,D_D[LOC],$A88),0))","v":""},{"$f":"IF(ISNA($A88),\"\",IFERROR(SUMIFS(D_D[BL],D_D[MT],5,D_D[CAT],SMS, D_D[EP],499,D_D[LOC],$A88),0))","v":""},"",{"$f":"IF(ISNA($A88),\"\",IFERROR(SUMIFS(D_D[DEV],D_D[MT],5,D_D[CAT],SMS, D_D[EP],499,D_D[LOC],$A88)/$E88,0))","v":""},{"$f":"IF(ISNA($A88),\"\",IFERROR(SUMIFS(D_D[EVD],D_D[MT],5,D_D[CAT],SMS, D_D[EP],499,D_D[LOC],$A88)/$E88,0))","v":""},{"$f":"IF(ISNA($A88),\"\",IFERROR(SUMIFS(D_D[DEC],D_D[MT],5,D_D[CAT],SMS, D_D[EP],499,D_D[LOC],$A88)/$E88,0))","v":""},{"$f":"IF(ISNA($A88),\"\",IFERROR(SUMIFS(D_D[AWD],D_D[MT],5,D_D[CAT],SMS, D_D[EP],499,D_D[LOC],$A88)/$E88,0))","v":""},{"$f":"IF(ISNA($A88),\"\",IFERROR(SUMIFS(D_D[AUT],D_D[MT],5,D_D[CAT],SMS, D_D[EP],499,D_D[LOC],$A88)/$E88,0))","v":""}]
[{"$error":"#N/A"},77,"",{"$f":"IFERROR(INDEX(INDIRECT(DS_NWQD),B89),\"\")","v":""},{"$f":"IF(ISNA($A89),\"\",IFERROR(SUMIFS(D_D[INV],D_D[MT],5,D_D[CAT],SMS, D_D[EP],499,D_D[LOC],$A89),0))","v":""},{"$f":"IF(ISNA($A89),\"\",IFERROR(SUMIFS(D_D[BL],D_D[MT],5,D_D[CAT],SMS, D_D[EP],499,D_D[LOC],$A89),0))","v":""},{"$f":"IF(ISNA($A89),\"\",IFERROR(F89/E89,0))","v":""},{"$f":"IF(ISNA($A89),\"\",IFERROR(SUMIFS(D_D[DEV],D_D[MT],5,D_D[CAT],SMS, D_D[EP],499,D_D[LOC],$A89)/$E89,0))","v":""},{"$f":"IF(ISNA($A89),\"\",IFERROR(SUMIFS(D_D[EVD],D_D[MT],5,D_D[CAT],SMS, D_D[EP],499,D_D[LOC],$A89)/$E89,0))","v":""},{"$f":"IF(ISNA($A89),\"\",IFERROR(SUMIFS(D_D[DEC],D_D[MT],5,D_D[CAT],SMS, D_D[EP],499,D_D[LOC],$A89)/$E89,0))","v":""},{"$f":"IF(ISNA($A89),\"\",IFERROR(SUMIFS(D_D[AWD],D_D[MT],5,D_D[CAT],SMS, D_D[EP],499,D_D[LOC],$A89)/$E89,0))","v":""},{"$f":"IF(ISNA($A89),\"\",IFERROR(SUMIFS(D_D[AUT],D_D[MT],5,D_D[CAT],SMS, D_D[EP],499,D_D[LOC],$A89)/$E89,0))","v":""}]

{"sheet":"Traditional Aggregate (TA)","index":10,"n_rows":48,"n_cols":14,"rows_kept":48,"cut":false,"hidden":false,"merged":[[1,1,1,6],[1,7,1,11],[10,11,10,13],[31,11,31,13],[32,11,32,12],[11,11,11,13],[2,1,2,13],[3,6,3,9],[3,1,3,4],[3,11,3,13],[16,11,16,13]]}
[]
[null,{"$f":"\"Compensation and Pension National Inventory - Historical Reporting Bundles* - Data through \"","v":"Compensation and Pension National Inventory - Historical Reporting Bundles* - Data through "},null,null,null,null,null,{"$f":"D_DT[]","v":"2022-05-28"}]
[null,"*The data on this page represents historical, alternative reporting on VBA claims processing.  VBA actively measures and monitors these workloads, but the bundles are not specifically tied to VBA's strategic target 125 Days and 98% Accuracy.  The Rating Bundle measures are the only claims processing bundle that is directly related to the strategic 2015 goals.\nEnd products which are included in the Rating Bundle group are highlighted in green."]
[null,"Compensation Entitlement",null,null,null,null,"Pension Entitlement",null,null,null,null,"Legacy Appeals"]
[null,"Measurement","Claims Pending","Pending over 125 days","Percent Pending over 125 days",null,"Measurement","Claims Pending","Pending over 125 days","Percent Pending over 125 days",null,"Measurement","Appeals Pending","Average Days Pending"]
[null,"Original Entitlement - Veterans1",{"$f":"SUM(C7:C9)","v":137465},{"$f":"SUM(D7:D9)","v":51133},{"$f":"IFERROR(D6/C6,0)","v":0.37197104717564472},null,"Original Entitlement ",{"$f":"SUM(H7:H9)","v":15647},{"$f":"SUM(I7:I9)","v":1190},{"$f":"IFERROR(I6/H6,0)","v":7.6052917492171024E-2},1,"Notice of Disagreements",{"$f":"IFERROR(SUMIFS(D_D[INV],D_D[MT],7,D_D[CAT],1,D_D[EP],$K6),0)","v":785},{"$f":"IFERROR(SUMIFS(D_D[ADP],D_D[MT],7,D_D[CAT],1,D_D[EP],$K6),0)","v":1608.26}]
["095","EP 095 - Initial entitlement decisions for Voc Rehab",{"$f":"IFERROR(SUMIFS(D_D[INV],D_D[MT],3,D_D[CAT],TA_21,D_D[EP],$A7),0)","v":12},{"$f":"IFERROR(SUMIFS(D_D[BL],D_D[MT],3,D_D[CAT],TA_21,D_D[EP],$A7),0)","v":1},{"$f":"IFERROR(D7/C7,0)","v":8.3333333333333329E-2},180,"EP 180 - Initial entitlement - Veteran ",{"$f":"IFERROR(SUMIFS(D_D[INV],D_D[MT],3,D_D[CAT],TA_31,D_D[EP],$F7),0)","v":7107},{"$f":"IFERROR(SUMIFS(D_D[BL],D_D[MT],3,D_D[CAT],TA_31,D_D[EP],$F7),0)","v":567},7.9780498100464337E-2,9,"Statement of the Case*",{"$f":"IFERROR(SUMIFS(D_D[INV],D_D[MT],7,D_D[CAT],1,D_D[EP],$K7),0)","v":577},{"$f":"IFERROR(SUMIFS(D_D[ADP],D_D[MT],7,D_D[CAT],1,D_D[EP],$K7),0)","v":1815.36}]
["010","EP 010 - Initial entitlement for service-connected disability (=>8)",{"$f":"IFERROR(SUMIFS(D_D[INV],D_D[MT],3,D_D[CAT],TA_21,D_D[EP],$A8),0)","v":48734},{"$f":"IFERROR(SUMIFS(D_D[BL],D_D[MT],3,D_D[CAT],TA_21,D_D[EP],$A8),0)","v":19548},0.40111626379940085,120,"EP 120 - Increased entitlement and/or reconsideration ",{"$f":"IFERROR(SUMIFS(D_D[INV],D_D[MT],3,D_D[CAT],TA_31,D_D[EP],$F8),0)","v":4232},{"$f":"IFERROR(SUMIFS(D_D[BL],D_D[MT],3,D_D[CAT],TA_31,D_D[EP],$F8),0)","v":309},7.3015122873345939E-2,"2","Form 9s",{"$f":"IFERROR(SUMIFS(D_D[INV],D_D[MT],7,D_D[CAT],1,D_D[EP],$K8),0)","v":1202},{"$f":"IFERROR(SUMIFS(D_D[ADP],D_D[MT],7,D_D[CAT],1,D_D[EP],$K8),0)","v":1136.3399999999999}]
["110","EP 110 - Initial entitlement for service-connected disability (<=7)",{"$f":"IFERROR(SUMIFS(D_D[INV],D_D[MT],3,D_D[CAT],TA_21,D_D[EP],$A9),0)","v":88719},{"$f":"IFERROR(SUMIFS(D_D[BL],D_D[MT],3,D_D[CAT],TA_21,D_D[EP],$A9),0)","v":31584},0.35600040577553849,190,"EP 190 - Initial entitlement - Survivor ",{"$f":"IFERROR(SUMIFS(D_D[INV],D_D[MT],3,D_D[CAT],TA_31,D_D[EP],$F9),0)","v":4308},{"$f":"IFERROR(SUMIFS(D_D[BL],D_D[MT],3,D_D[CAT],TA_31,D_D[EP],$F9),0)","v":314},7.2887650882079852E-2,"3","Remands",{"$f":"IFERROR(SUMIFS(D_D[INV],D_D[MT],7,D_D[CAT],1,D_D[EP],$K9),0)","v":28239},{"$f":"IFERROR(SUMIFS(D_D[ADP],D_D[MT],7,D_D[CAT],1,D_D[EP],$K9),0)","v":275.75}]
[null,"Original Entitlement - Survivors2",{"$f":"SUM(C11:C12)","v":14134},{"$f":"SUM(D11:D12)","v":3845},0.27203905476156787,null,"Pension Award Adjustments",{"$f":"SUM(H11:H16)","v":5863},{"$f":"SUM(I11:I16)","v":1008},0.1719256353402695,null,"Total Appeals Pending Under VBA control",{"$f":"M6+M7+M8+M9","v":30803}]
["140","EP 140 - Initial claims from surviving spouses, children or parents",{"$f":"IFERROR(SUMIFS(D_D[INV],D_D[MT],3,D_D[CAT],TA_21,D_D[EP],$A11),0)","v":14090},{"$f":"IFERROR(SUMIFS(D_D[BL],D_D[MT],3,D_D[CAT],TA_21,D_D[EP],$A11),0)","v":3831},0.27189496096522359,135,"EP 135 - Hospitalization adjustment (non-rating)",{"$f":"IFERROR(SUMIFS(D_D[INV],D_D[MT],3,D_D[CAT],TA_32,D_D[EP],$F11),0)","v":138},{"$f":"IFERROR(SUMIFS(D_D[BL],D_D[MT],3,D_D[CAT],TA_32,D_D[EP],$F11),0)","v":13},{"$f":"IFERROR(I11/H11,0)","v":9.420289855072464E-2},null,"*the veteran has 60 days to respond to an SOC to continue onto the Form 9 stage"]
["410","EP 410 - Initial claims from Veterans' children with Spina bifida and/or birth defects",{"$f":"IFERROR(SUMIFS(D_D[INV],D_D[MT],3,D_D[CAT],TA_21,D_D[EP],$A12),0)","v":44},{"$f":"IFERROR(SUMIFS(D_D[BL],D_D[MT],3,D_D[CAT],TA_21,D_D[EP],$A12),0)","v":14},0.31818181818181818,137,"EP 137 - Dependency",{"$f":"IFERROR(SUMIFS(D_D[INV],D_D[MT],3,D_D[CAT],TA_32,D_D[EP],$F12),0)","v":6},{"$f":"IFERROR(SUMIFS(D_D[BL],D_D[MT],3,D_D[CAT],TA_32,D_D[EP],$F12),0)","v":3},0.5,null,"RAMP (Rapid Appeals Modernization Program)"]
[null,"Supplemental Entitlement",{"$f":"SUM(C14:C17)","v":358771},{"$f":"SUM(D14:D17)","v":97356},0.27135972528437358,"150G","EP 150 - Income adjustments",{"$f":"IFERROR(SUMIFS(D_D[INV],D_D[MT],3,D_D[CAT],TA_32,D_D[EP],$F13),0)","v":5701},{"$f":"IFERROR(SUMIFS(D_D[BL],D_D[MT],3,D_D[CAT],TA_32,D_D[EP],$F13),0)","v":986},0.17295211366426944,"7","EP 682 - Higher Level Review",{"$f":"IFERROR(SUMIFS(D_D[INV],D_D[MT],7,D_D[CAT],1,D_D[EP],$K13),0)","v":0},{"$f":"IFERROR(SUMIFS(D_D[ADP],D_D[MT],7,D_D[CAT],1,D_D[EP],$K13),0)","v":0}]
["040","EP 040 - Supplemental Claims (AMA)",{"$f":"IFERROR(SUMIFS(D_D[INV],D_D[MT],3,D_D[CAT],TA_21,D_D[EP],$A14),0)","v":92207},{"$f":"IFERROR(SUMIFS(D_D[BL],D_D[MT],3,D_D[CAT],TA_21,D_D[EP],$A14),0)","v":27390},0.29704903098463242,155,"EP 155 - Annual eligibility verification reporting (EVRs)",{"$f":"IFERROR(SUMIFS(D_D[INV],D_D[MT],3,D_D[CAT],TA_32,D_D[EP],$F14),0)","v":0},{"$f":"IFERROR(SUMIFS(D_D[BL],D_D[MT],3,D_D[CAT],TA_32,D_D[EP],$F14),0)","v":0},0,8,"EP 683 - Supplemental Evidence",{"$f":"IFERROR(SUMIFS(D_D[INV],D_D[MT],7,D_D[CAT],1,D_D[EP],$K14),0)","v":13},{"$f":"IFERROR(SUMIFS(D_D[ADP],D_D[MT],7,D_D[CAT],1,D_D[EP],$K14),0)","v":1261.77}]
["020","EP 020 - Increased evaluation and/or additional claimed conditions",{"$f":"IFERROR(SUMIFS(D_D[INV],D_D[MT],3,D_D[CAT],TA_21,D_D[EP],$A15),0)","v":264970},{"$f":"IFERROR(SUMIFS(D_D[BL],D_D[MT],3,D_D[CAT],TA_21,D_D[EP],$A15),0)","v":69910},0.2638411895686304,297,"EP 297 - Misc determinations",{"$f":"IFERROR(SUMIFS(D_D[INV],D_D[MT],3,D_D[CAT],TA_32,D_D[EP],$F15),0)","v":9},{"$f":"IFERROR(SUMIFS(D_D[BL],D_D[MT],3,D_D[CAT],TA_32,D_D[EP],$F15),0)","v":6},0.66666666666666663,6,"Total RAMP",{"$f":"IFERROR(SUMIFS(D_D[INV],D_D[MT],7,D_D[CAT],1,D_D[EP],$K15),0)","v":13},{"$f":"IFERROR(SUMIFS(D_D[ADP],D_D[MT],7,D_D[CAT],1,D_D[EP],$K15),0)","v":1261.77}]
["320","EP 320 -Increased entitlement due to hospitalization or surgery",{"$f":"IFERROR(SUMIFS(D_D[INV],D_D[MT],3,D_D[CAT],TA_21,D_D[EP],$A16),0)","v":1582},{"$f":"IFERROR(SUMIFS(D_D[BL],D_D[MT],3,D_D[CAT],TA_21,D_D[EP],$A16),0)","v":51},3.2237673830594185E-2,607,"EP 607 - Due process",{"$f":"IFERROR(SUMIFS(D_D[INV],D_D[MT],3,D_D[CAT],TA_32,D_D[EP],$F16),0)","v":9},{"$f":"IFERROR(SUMIFS(D_D[BL],D_D[MT],3,D_D[CAT],TA_32,D_D[EP],$F16),0)","v":0},0]
["420","EP 420 - Spina bifida and/or birth defects reconsideration",{"$f":"IFERROR(SUMIFS(D_D[INV],D_D[MT],3,D_D[CAT],TA_21,D_D[EP],$A17),0)","v":12},{"$f":"IFERROR(SUMIFS(D_D[BL],D_D[MT],3,D_D[CAT],TA_21,D_D[EP],$A17),0)","v":5},0.41666666666666669,null,"Program Reviews",{"$f":"SUM(H18:H20)","v":4830},{"$f":"SUM(I18:I20)","v":596},{"$f":"IFERROR(I17/H17,0)","v":0.12339544513457557},null,"DROC Decision Review Workload (AMA)"]
["12","Award Adjustments",{"$f":"SUM(C19:C25)","v":209869},{"$f":"SUM(D19:D25)","v":44978},0.21431464389690713,"154","EP 154 - Income Verification Match",{"$f":"IFERROR(SUMIFS(D_D[INV],D_D[MT],3,D_D[CAT],TA_33,D_D[EP],$F18),0)","v":4165},{"$f":"IFERROR(SUMIFS(D_D[BL],D_D[MT],3,D_D[CAT],TA_33,D_D[EP],$F18),0)","v":2},4.8019207683073231E-4,null,null,"Claims Pending","Average Days Pending"]
["130G","EP 130 - Dependency",{"$f":"IFERROR(SUMIFS(D_D[INV],D_D[MT],3,D_D[CAT],TA_22,D_D[EP],$A19),0)","v":48868},{"$f":"IFERROR(SUMIFS(D_D[BL],D_D[MT],3,D_D[CAT],TA_22,D_D[EP],$A19),0)","v":2373},{"$f":"IFERROR(D19/C19,0)","v":4.8559384464271098E-2},"696","EP 696 - Cost of Living Adjustments",{"$f":"IFERROR(SUMIFS(D_D[INV],D_D[MT],3,D_D[CAT],TA_33,D_D[EP],$F19),0)","v":665},{"$f":"IFERROR(SUMIFS(D_D[BL],D_D[MT],3,D_D[CAT],TA_33,D_D[EP],$F19),0)","v":594},0.89323308270676693,1,"EP 030 - Higher-Level Reviews (HLR)",{"$f":"IFERROR(SUMIFS(D_D[INV],D_D[MT],12,D_D[CAT],9000,D_D[EP],$K19),0)","v":10175},{"$f":"IFERROR(SUMIFS(D_D[ADP],D_D[MT],12,D_D[CAT],9000,D_D[EP],$K19),0)","v":18.322063882063883}]
["133","EP 133 - Survivor restored entitlement",{"$f":"IFERROR(SUMIFS(D_D[INV],D_D[MT],3,D_D[CAT],TA_22,D_D[EP],$A20),0)","v":3},{"$f":"IFERROR(SUMIFS(D_D[BL],D_D[MT],3,D_D[CAT],TA_22,D_D[EP],$A20),0)","v":1},0.33333333333333331,"697","EP 697 - Non-entitlement reviews",{"$f":"IFERROR(SUMIFS(D_D[INV],D_D[MT],3,D_D[CAT],TA_33,D_D[EP],$F20),0)","v":0},{"$f":"IFERROR(SUMIFS(D_D[BL],D_D[MT],3,D_D[CAT],TA_33,D_D[EP],$F20),0)","v":0},0,1.1000000000000001,"HLR - Compensation",{"$f":"IFERROR(SUMIFS(D_D[INV],D_D[MT],12,D_D[CAT],9000,D_D[EP],$K20),0)","v":9998},{"$f":"IFERROR(SUMIFS(D_D[ADP],D_D[MT],12,D_D[CAT],9000,D_D[EP],$K20),0)","v":18.129425885177035}]
["135","EP 135 - Hospitalization adjustment (non-rating)",{"$f":"IFERROR(SUMIFS(D_D[INV],D_D[MT],3,D_D[CAT],TA_22,D_D[EP],$A21),0)","v":312},{"$f":"IFERROR(SUMIFS(D_D[BL],D_D[MT],3,D_D[CAT],TA_22,D_D[EP],$A21),0)","v":35},0.11217948717948718,null,"Pension Other",{"$f":"SUM(H22:H25)","v":118},{"$f":"SUM(I22:I25)","v":18},{"$f":"IFERROR(I21/H21,0)","v":0.15254237288135594},1.2,"HLR - Pension",{"$f":"IFERROR(SUMIFS(D_D[INV],D_D[MT],12,D_D[CAT],9000,D_D[EP],$K21),0)","v":177},{"$f":"IFERROR(SUMIFS(D_D[ADP],D_D[MT],12,D_D[CAT],9000,D_D[EP],$K21),0)","v":29.203389830508474}]
["290G","EP 290 - Misc determinations",{"$f":"IFERROR(SUMIFS(D_D[INV],D_D[MT],3,D_D[CAT],TA_22,D_D[EP],$A22),0)","v":53354},{"$f":"IFERROR(SUMIFS(D_D[BL],D_D[MT],3,D_D[CAT],TA_22,D_D[EP],$A22),0)","v":8666},0.1624245604828129,"407","EP 407 - Correspondence ",{"$f":"IFERROR(SUMIFS(D_D[INV],D_D[MT],3,D_D[CAT],TA_34,D_D[EP],$F22),0)","v":117},{"$f":"IFERROR(SUMIFS(D_D[BL],D_D[MT],3,D_D[CAT],TA_34,D_D[EP],$F22),0)","v":17},0.14529914529914531,2,"EP 040 - Higher-Level Review Returns (HLRR)",{"$f":"IFERROR(SUMIFS(D_D[INV],D_D[MT],12,D_D[CAT],9000,D_D[EP],$K22),0)","v":15034},{"$f":"IFERROR(SUMIFS(D_D[ADP],D_D[MT],12,D_D[CAT],9000,D_D[EP],$K22),0)","v":119.64799787149128}]
["450","EP 450 - Spina bifida and/or birth defects adjustments",{"$f":"IFERROR(SUMIFS(D_D[INV],D_D[MT],3,D_D[CAT],TA_22,D_D[EP],$A23),0)","v":11},{"$f":"IFERROR(SUMIFS(D_D[BL],D_D[MT],3,D_D[CAT],TA_22,D_D[EP],$A23),0)","v":7},0.63636363636363635,"507","EP 507 - Congressional correspondence ",{"$f":"IFERROR(SUMIFS(D_D[INV],D_D[MT],3,D_D[CAT],TA_34,D_D[EP],$F23),0)","v":0},{"$f":"IFERROR(SUMIFS(D_D[BL],D_D[MT],3,D_D[CAT],TA_34,D_D[EP],$F23),0)","v":0},0,2.1,"HLRR - Compensation",{"$f":"IFERROR(SUMIFS(D_D[INV],D_D[MT],12,D_D[CAT],9000,D_D[EP],$K23),0)","v":14786},{"$f":"IFERROR(SUMIFS(D_D[ADP],D_D[MT],12,D_D[CAT],9000,D_D[EP],$K23),0)","v":119.45644528608143}]
["310G","EP 310 -Future examination for disabilities",{"$f":"IFERROR(SUMIFS(D_D[INV],D_D[MT],3,D_D[CAT],TA_22,D_D[EP],$A24),0)","v":7278},{"$f":"IFERROR(SUMIFS(D_D[BL],D_D[MT],3,D_D[CAT],TA_22,D_D[EP],$A24),0)","v":1913},0.26284693597142073,"937","EP 937 - Internal quality reviews",{"$f":"IFERROR(SUMIFS(D_D[INV],D_D[MT],3,D_D[CAT],TA_34,D_D[EP],$F24),0)","v":1},{"$f":"IFERROR(SUMIFS(D_D[BL],D_D[MT],3,D_D[CAT],TA_34,D_D[EP],$F24),0)","v":1},1,2.2000000000000002,"HLRR - Pension",{"$f":"IFERROR(SUMIFS(D_D[INV],D_D[MT],12,D_D[CAT],9000,D_D[EP],$K24),0)","v":248},{"$f":"IFERROR(SUMIFS(D_D[ADP],D_D[MT],12,D_D[CAT],9000,D_D[EP],$K24),0)","v":131.06854838709677}]
["600G","EP 600 - Due process",{"$f":"IFERROR(SUMIFS(D_D[INV],D_D[MT],3,D_D[CAT],TA_22,D_D[EP],$A25),0)","v":100043},{"$f":"IFERROR(SUMIFS(D_D[BL],D_D[MT],3,D_D[CAT],TA_22,D_D[EP],$A25),0)","v":31983},0.31969253221114918,"967","EP 967 - Correction of errors",{"$f":"IFERROR(SUMIFS(D_D[INV],D_D[MT],3,D_D[CAT],TA_34,D_D[EP],$F25),0)","v":0},{"$f":"IFERROR(SUMIFS(D_D[BL],D_D[MT],3,D_D[CAT],TA_34,D_D[EP],$F25),0)","v":0},0,3,"EP 040 - Board AMA Returns (Remands)",{"$f":"IFERROR(SUMIFS(D_D[INV],D_D[MT],12,D_D[CAT],9000,D_D[EP],$K25),0)","v":4490},{"$f":"IFERROR(SUMIFS(D_D[ADP],D_D[MT],12,D_D[CAT],9000,D_D[EP],$K25),0)","v":139.08975501113585}]
[null,"Program Reviews ",{"$f":"SUM(C27:C33)","v":2218},{"$f":"SUM(D27:D33)","v":266},{"$f":"IFERROR(D26/C26,0)","v":0.11992786293958521},null,"Pension Burial/Accrued",{"$f":"SUM(H27:H29)","v":3420},{"$f":"SUM(I27:I29)","v":2109},{"$f":"IFERROR(I26/H26,0)","v":0.6166666666666667},3.1,"Remands - Compensation",{"$f":"IFERROR(SUMIFS(D_D[INV],D_D[MT],12,D_D[CAT],9000,D_D[EP],$K26),0)","v":4389},{"$f":"IFERROR(SUMIFS(D_D[ADP],D_D[MT],12,D_D[CAT],9000,D_D[EP],$K26),0)","v":139.75620870357713}]
["314","EP 314 - Income verification for unemployability",{"$f":"IFERROR(SUMIFS(D_D[INV],D_D[MT],3,D_D[CAT],TA_23,D_D[EP],$A27),0)","v":0},{"$f":"IFERROR(SUMIFS(D_D[BL],D_D[MT],3,D_D[CAT],TA_23,D_D[EP],$A27),0)","v":0},0,"167","EP 167 - Burials",{"$f":"IFERROR(SUMIFS(D_D[INV],D_D[MT],3,D_D[CAT],TA_35,D_D[EP],$F27),0)","v":0},{"$f":"IFERROR(SUMIFS(D_D[BL],D_D[MT],3,D_D[CAT],TA_35,D_D[EP],$F27),0)","v":0},0,3.2,"Remands - Pension",{"$f":"IFERROR(SUMIFS(D_D[INV],D_D[MT],12,D_D[CAT],9000,D_D[EP],$K27),0)","v":101},{"$f":"IFERROR(SUMIFS(D_D[ADP],D_D[MT],12,D_D[CAT],9000,D_D[EP],$K27),0)","v":110.12871287128714}]
["680G","EP 680 - Review of Hemodialysis related cases/conditions ",{"$f":"IFERROR(SUMIFS(D_D[INV],D_D[MT],3,D_D[CAT],TA_23,D_D[EP],$A28),0)","v":15},{"$f":"IFERROR(SUMIFS(D_D[BL],D_D[MT],3,D_D[CAT],TA_23,D_D[EP],$A28),0)","v":15},1,"165","EP 165 - Accrued",{"$f":"IFERROR(SUMIFS(D_D[INV],D_D[MT],3,D_D[CAT],TA_36,D_D[EP],$F28),0)","v":3420},{"$f":"IFERROR(SUMIFS(D_D[BL],D_D[MT],3,D_D[CAT],TA_36,D_D[EP],$F28),0)","v":2109},0.6166666666666667,4,"EP 030 - Board AMA Full Grants",{"$f":"IFERROR(SUMIFS(D_D[INV],D_D[MT],12,D_D[CAT],9000,D_D[EP],$K28),0)","v":543},{"$f":"IFERROR(SUMIFS(D_D[ADP],D_D[MT],12,D_D[CAT],9000,D_D[EP],$K28),0)","v":53.02209944751381}]
["682","EP 682 - Review of Radiation related cases/conditions",{"$f":"IFERROR(SUMIFS(D_D[INV],D_D[MT],3,D_D[CAT],TA_23,D_D[EP],$A29),0)","v":0},{"$f":"IFERROR(SUMIFS(D_D[BL],D_D[MT],3,D_D[CAT],TA_23,D_D[EP],$A29),0)","v":0},0,null,null,null,null,null,4.0999999999999996,"Grants - Compensation",{"$f":"IFERROR(SUMIFS(D_D[INV],D_D[MT],12,D_D[CAT],9000,D_D[EP],$K29),0)","v":525},{"$f":"IFERROR(SUMIFS(D_D[ADP],D_D[MT],12,D_D[CAT],9000,D_D[EP],$K29),0)","v":52.695238095238096}]
["684","EP 684 - Review of Misc cases referred to central office",{"$f":"IFERROR(SUMIFS(D_D[INV],D_D[MT],3,D_D[CAT],TA_23,D_D[EP],$A30),0)","v":2},{"$f":"IFERROR(SUMIFS(D_D[BL],D_D[MT],3,D_D[CAT],TA_23,D_D[EP],$A30),0)","v":1},0.5,null,null,null,null,null,4.2,"Grants - Pension",{"$f":"IFERROR(SUMIFS(D_D[INV],D_D[MT],12,D_D[CAT],9000,D_D[EP],$K30),0)","v":18},{"$f":"IFERROR(SUMIFS(D_D[ADP],D_D[MT],12,D_D[CAT],9000,D_D[EP],$K30),0)","v":62.555555555555557}]
["685","EP 685 - Review of effective date related to herbicide exposure",{"$f":"IFERROR(SUMIFS(D_D[INV],D_D[MT],3,D_D[CAT],TA_23,D_D[EP],$A31),0)","v":245},{"$f":"IFERROR(SUMIFS(D_D[BL],D_D[MT],3,D_D[CAT],TA_23,D_D[EP],$A31),0)","v":184},0.75102040816326532]
["690G","EP 690 - Cost of Living Adjustments (COLAs) and other reviews",{"$f":"IFERROR(SUMIFS(D_D[INV],D_D[MT],3,D_D[CAT],TA_23,D_D[EP],$A32),0)","v":1952},{"$f":"IFERROR(SUMIFS(D_D[BL],D_D[MT],3,D_D[CAT],TA_23,D_D[EP],$A32),0)","v":66},3.3811475409836068E-2,null,null,null,null,null,null,"Integrated Disability Evaluation System (IDES)"]
["690","EP 690 - Social Security number verification",{"$f":"IFERROR(SUMIFS(D_D[INV],D_D[MT],3,D_D[CAT],TA_23,D_D[EP],$A33),0)","v":4},{"$f":"IFERROR(SUMIFS(D_D[BL],D_D[MT],3,D_D[CAT],TA_23,D_D[EP],$A33),0)","v":0},0,null,null,null,null,null,null,"Number of IDES claims pending",null,{"$f":"IFERROR(SUMIFS(D_D[INV],D_D[MT],10,D_D[CAT],1,D_D[EP],-1),0)","v":23458}]
[null,"Compensation Other",{"$f":"SUM(C35:C45)","v":111767},{"$f":"SUM(D35:D45)","v":56976},{"$f":"IFERROR(D34/C34,0)","v":0.50977479935938153}]
["335","EP 335 - Blue Water Navy (Agent Orange)",{"$f":"IFERROR(SUMIFS(D_D[INV],D_D[MT],3,D_D[CAT],TA_24,D_D[EP],$A35),0)","v":14355},{"$f":"IFERROR(SUMIFS(D_D[BL],D_D[MT],3,D_D[CAT],TA_24,D_D[EP],$A35),0)","v":12994},{"$f":"IFERROR(D35/C35,0)","v":0.90518982932776038}]
["400G","EP 400 - Correspondence ",{"$f":"IFERROR(SUMIFS(D_D[INV],D_D[MT],3,D_D[CAT],TA_24,D_D[EP],$A36),0)","v":15243},{"$f":"IFERROR(SUMIFS(D_D[BL],D_D[MT],3,D_D[CAT],TA_24,D_D[EP],$A36),0)","v":3774},0.24758905727219052]
["500G","EP 500 - Congressional correspondence",{"$f":"IFERROR(SUMIFS(D_D[INV],D_D[MT],3,D_D[CAT],TA_24,D_D[EP],$A37),0)","v":477},{"$f":"IFERROR(SUMIFS(D_D[BL],D_D[MT],3,D_D[CAT],TA_24,D_D[EP],$A37),0)","v":29},6.0796645702306078E-2]
["510","EP 510 - Freedom of Information Act (FOIA) requests",{"$f":"IFERROR(SUMIFS(D_D[INV],D_D[MT],3,D_D[CAT],TA_24,D_D[EP],$A38),0)","v":37476},{"$f":"IFERROR(SUMIFS(D_D[BL],D_D[MT],3,D_D[CAT],TA_24,D_D[EP],$A38),0)","v":2669},7.1218913437933615E-2]
["930G","EP 930 - Review, including quality assurance",{"$f":"IFERROR(SUMIFS(D_D[INV],D_D[MT],3,D_D[CAT],TA_24,D_D[EP],$A39),0)","v":14147},{"$f":"IFERROR(SUMIFS(D_D[BL],D_D[MT],3,D_D[CAT],TA_24,D_D[EP],$A39),0)","v":8611},0.60868028557291298]
["960G","EP 960 - Correction of errors",{"$f":"IFERROR(SUMIFS(D_D[INV],D_D[MT],3,D_D[CAT],TA_24,D_D[EP],$A40),0)","v":522},{"$f":"IFERROR(SUMIFS(D_D[BL],D_D[MT],3,D_D[CAT],TA_24,D_D[EP],$A40),0)","v":144},0.27586206896551724]
["681","EP 681 - Used to control claims under the Nehmer Agent Orange stipulation",{"$f":"IFERROR(SUMIFS(D_D[INV],D_D[MT],3,D_D[CAT],TA_24,D_D[EP],$A41),0)","v":1204},{"$f":"IFERROR(SUMIFS(D_D[BL],D_D[MT],3,D_D[CAT],TA_24,D_D[EP],$A41),0)","v":928},{"$f":"IFERROR(D41/C41,0)","v":0.77076411960132896}]
["687","EP 687 - Blue Water Navy Agent Orange Nehmer Reviews",{"$f":"IFERROR(SUMIFS(D_D[INV],D_D[MT],3,D_D[CAT],TA_24,D_D[EP],$A42),0)","v":1885},{"$f":"IFERROR(SUMIFS(D_D[BL],D_D[MT],3,D_D[CAT],TA_24,D_D[EP],$A42),0)","v":1881},{"$f":"IFERROR(D42/C42,0)","v":0.9978779840848806}]
["688","EP 688 - NDAA Agent Orange Nehmer Reviews (3 new authorized AO disabilities)",{"$f":"IFERROR(SUMIFS(D_D[INV],D_D[MT],3,D_D[CAT],TA_24,D_D[EP],$A43),0)","v":26436},{"$f":"IFERROR(SUMIFS(D_D[BL],D_D[MT],3,D_D[CAT],TA_24,D_D[EP],$A43),0)","v":25946},{"$f":"IFERROR(D43/C43,0)","v":0.98146466939022547}]
["405","EP 405 - Reopened or new Agent Orange claims between 9/01/10 and 10/24/2011",{"$f":"IFERROR(SUMIFS(D_D[INV],D_D[MT],3,D_D[CAT],TA_24,D_D[EP],$A44),0)","v":0},{"$f":"IFERROR(SUMIFS(D_D[BL],D_D[MT],3,D_D[CAT],TA_24,D_D[EP],$A44),0)","v":0},{"$f":"IFERROR(D44/C44,0)","v":0}]
["409","EP 409 - Agent Orange claims where an interim decision was provided; No longer used as of 10/24/2011",{"$f":"IFERROR(SUMIFS(D_D[INV],D_D[MT],3,D_D[CAT],TA_24,D_D[EP],$A45),0)","v":22},{"$f":"IFERROR(SUMIFS(D_D[BL],D_D[MT],3,D_D[CAT],TA_24,D_D[EP],$A45),0)","v":0},{"$f":"IFERROR(D45/C45,0)","v":0}]
[null,"Compensation Burial/Accrued",{"$f":"SUM(C47:C49)","v":20212},{"$f":"SUM(D47:D49)","v":13844},{"$f":"IFERROR(D46/C46,0)","v":0.68493963981792994}]
["160G","EP 160 - Burials",{"$f":"IFERROR(SUMIFS(D_D[INV],D_D[MT],3,D_D[CAT],TA_25,D_D[EP],$A47),0)","v":8996},{"$f":"IFERROR(SUMIFS(D_D[BL],D_D[MT],3,D_D[CAT],TA_25,D_D[EP],$A47),0)","v":3227},0.35871498443752781]
["165","EP 165 - Accrued",{"$f":"IFERROR(SUMIFS(D_D[INV],D_D[MT],3,D_D[CAT],TA_26,D_D[EP],$A48),0)","v":11216},{"$f":"IFERROR(SUMIFS(D_D[BL],D_D[MT],3,D_D[CAT],TA_26,D_D[EP],$A48),0)","v":10617},0.94659415121255353]

{"sheet":"Diarys and Future Claims","index":11,"n_rows":47,"n_cols":6,"rows_kept":47,"cut":false,"hidden":false,"merged":[[29,4,29,5],[0,1,0,4],[2,1,2,2],[2,4,2,5],[1,1,1,5]]}
[null,"Compensation and Pension Diary and Future Claims - Historical Reporting Bundles* - Data through ",null,null,null,{"$f":"D_DT[]","v":"2022-05-28"}]
[null,"The data on this page represents future claims that VA is aware of.  A portion of these claims roll into the traditional Rating Bundle group of end-products (EP) once the date of claim matures.\t\t\t\t"]
[null,"Compensation Entitlement",null,null,"Pension Entitlement"]
[null,"Measurement","Claims Pending",null,"Measurement","Claims Pending"]
[null,"Original Entitlement - Veterans1",{"$f":"SUM(C6:C8)","v":20955},null,"Original Entitlement ",{"$f":"SUM(F6:F8)","v":0}]
["095","EP 095 - Initial entitlement decisions for Voc Rehab",{"$f":"IFERROR(SUMIFS(D_D[INV],D_D[MT],11,D_D[CAT],TA_21,D_D[EP],$A6),0)","v":0},180,"EP 180 - Initial entitlement - Veteran ",{"$f":"IFERROR(SUMIFS(D_D[INV],D_D[MT],11,D_D[CAT],TA_31,D_D[EP],$D6),0)","v":0}]
["010","EP 010 - Initial entitlement for service-connected disability (=>8)",{"$f":"IFERROR(SUMIFS(D_D[INV],D_D[MT],11,D_D[CAT],TA_21,D_D[EP],$A7),0)","v":17769},120,"EP 120 - Increased entitlement and/or reconsideration ",{"$f":"IFERROR(SUMIFS(D_D[INV],D_D[MT],11,D_D[CAT],TA_31,D_D[EP],$D7),0)","v":0}]
["110","EP 110 - Initial entitlement for service-connected disability (<=7)",{"$f":"IFERROR(SUMIFS(D_D[INV],D_D[MT],11,D_D[CAT],TA_21,D_D[EP],$A8),0)","v":3186},190,"EP 190 - Initial entitlement - Survivor ",{"$f":"IFERROR(SUMIFS(D_D[INV],D_D[MT],11,D_D[CAT],TA_31,D_D[EP],$D8),0)","v":0}]
[null,"Original Entitlement - Survivors2",{"$f":"SUM(C10:C11)","v":0},null,"Pension Award Adjustments",{"$f":"SUM(F10:F15)","v":0}]
["140","EP 140 - Initial claims from surviving spouses, children or parents",{"$f":"IFERROR(SUMIFS(D_D[INV],D_D[MT],11,D_D[CAT],TA_21,D_D[EP],$A10),0)","v":0},135,"EP 135 - Hospitalization adjustment (non-rating)",{"$f":"IFERROR(SUMIFS(D_D[INV],D_D[MT],11,D_D[CAT],TA_31,D_D[EP],$D10),0)","v":0}]
["410","EP 410 - Initial claims from Veterans' children with Spina bifida and/or birth defects",{"$f":"IFERROR(SUMIFS(D_D[INV],D_D[MT],11,D_D[CAT],TA_21,D_D[EP],$A11),0)","v":0},137,"EP 137 - Dependency",{"$f":"IFERROR(SUMIFS(D_D[INV],D_D[MT],11,D_D[CAT],TA_31,D_D[EP],$D11),0)","v":0}]
[null,"Supplemental Entitlement",{"$f":"SUM(C13:C16)","v":738},"150G","EP 150 - Income adjustments",{"$f":"IFERROR(SUMIFS(D_D[INV],D_D[MT],11,D_D[CAT],TA_31,D_D[EP],$D12),0)","v":0}]
["040","EP 040 - Decision Review Request",{"$f":"IFERROR(SUMIFS(D_D[INV],D_D[MT],11,D_D[CAT],TA_21,D_D[EP],$A13),0)","v":0},155,"EP 155 - Annual eligibility verification reporting (EVRs)",{"$f":"IFERROR(SUMIFS(D_D[INV],D_D[MT],11,D_D[CAT],TA_31,D_D[EP],$D13),0)","v":0}]
["020","EP 020 - Increased evaluation and/or additional claimed conditions",{"$f":"IFERROR(SUMIFS(D_D[INV],D_D[MT],11,D_D[CAT],TA_21,D_D[EP],$A14),0)","v":738},297,"EP 297 - Misc determinations",{"$f":"IFERROR(SUMIFS(D_D[INV],D_D[MT],11,D_D[CAT],TA_31,D_D[EP],$D14),0)","v":0}]
["320","EP 320 -Increased entitlement due to hospitalization or surgery",{"$f":"IFERROR(SUMIFS(D_D[INV],D_D[MT],11,D_D[CAT],TA_21,D_D[EP],$A15),0)","v":0},607,"EP 607 - Due process",{"$f":"IFERROR(SUMIFS(D_D[INV],D_D[MT],11,D_D[CAT],TA_31,D_D[EP],$D15),0)","v":0}]
["420","EP 420 - Spina bifida and/or birth defects reconsideration",{"$f":"IFERROR(SUMIFS(D_D[INV],D_D[MT],11,D_D[CAT],TA_21,D_D[EP],$A16),0)","v":0},null,"Program Reviews",{"$f":"SUM(F17:F19)","v":0}]
["12","Award Adjustments",{"$f":"SUM(C18:C24)","v":50},"154","EP 154 - Income Verification Match",{"$f":"IFERROR(SUMIFS(D_D[INV],D_D[MT],11,D_D[CAT],TA_31,D_D[EP],$D17),0)","v":0}]
["130G","EP 130 - Dependency",{"$f":"IFERROR(SUMIFS(D_D[INV],D_D[MT],11,D_D[CAT],TA_22,D_D[EP],$A18),0)","v":28},"696","EP 696 - Cost of Living Adjustments",{"$f":"IFERROR(SUMIFS(D_D[INV],D_D[MT],11,D_D[CAT],TA_31,D_D[EP],$D18),0)","v":0}]
["133","EP 133 - Survivor restored entitlement",{"$f":"IFERROR(SUMIFS(D_D[INV],D_D[MT],11,D_D[CAT],TA_22,D_D[EP],$A19),0)","v":0},"697","EP 697 - Non-entitlement reviews",{"$f":"IFERROR(SUMIFS(D_D[INV],D_D[MT],11,D_D[CAT],TA_31,D_D[EP],$D19),0)","v":0}]
["135","EP 135 - Hospitalization adjustment (non-rating)",{"$f":"IFERROR(SUMIFS(D_D[INV],D_D[MT],11,D_D[CAT],TA_22,D_D[EP],$A20),0)","v":0},null,"Pension Other",{"$f":"SUM(F21:F24)","v":0}]
["290G","EP 290 - Misc determinations",{"$f":"IFERROR(SUMIFS(D_D[INV],D_D[MT],11,D_D[CAT],TA_22,D_D[EP],$A21),0)","v":22},"407","EP 407 - Correspondence ",{"$f":"IFERROR(SUMIFS(D_D[INV],D_D[MT],11,D_D[CAT],TA_31,D_D[EP],$D21),0)","v":0}]
["450","EP 450 - Spina bifida and/or birth defects adjustments",{"$f":"IFERROR(SUMIFS(D_D[INV],D_D[MT],11,D_D[CAT],TA_22,D_D[EP],$A22),0)","v":0},"507","EP 507 - Congressional correspondence ",{"$f":"IFERROR(SUMIFS(D_D[INV],D_D[MT],11,D_D[CAT],TA_31,D_D[EP],$D22),0)","v":0}]
["310G","EP 310 -Future examination for disabilities",{"$f":"IFERROR(SUMIFS(D_D[INV],D_D[MT],11,D_D[CAT],TA_22,D_D[EP],$A23),0)","v":0},"937","EP 937 - Internal quality reviews",{"$f":"IFERROR(SUMIFS(D_D[INV],D_D[MT],11,D_D[CAT],TA_31,D_D[EP],$D23),0)","v":0}]
["600G","EP 600 - Due process",{"$f":"IFERROR(SUMIFS(D_D[INV],D_D[MT],11,D_D[CAT],TA_22,D_D[EP],$A24),0)","v":0},"967","EP 967 - Correction of errors",{"$f":"IFERROR(SUMIFS(D_D[INV],D_D[MT],11,D_D[CAT],TA_31,D_D[EP],$D24),0)","v":0}]
[null,"Program Reviews ",{"$f":"SUM(C26:C33)","v":1766},null,"Pension Burial/Accrued",{"$f":"SUM(F26:F27)","v":0}]
["314","EP 314 - Income verification for unemployability",{"$f":"IFERROR(SUMIFS(D_D[INV],D_D[MT],11,D_D[CAT],TA_23,D_D[EP],$A26),0)","v":0},"167","EP 167 - Burials",{"$f":"IFERROR(SUMIFS(D_D[INV],D_D[MT],11,D_D[CAT],TA_31,D_D[EP],$D26),0)","v":0}]
["330","EP 330 - Reviews",{"$f":"IFERROR(SUMIFS(D_D[INV],D_D[MT],11,D_D[CAT],TA_23,D_D[EP],$A27),0)","v":1766},"165","EP 165 - Accrued",{"$f":"IFERROR(SUMIFS(D_D[INV],D_D[MT],11,D_D[CAT],TA_31,D_D[EP],$D27),0)","v":0}]
["680G","EP 680 - Review of Hemodialysis related cases/conditions ",{"$f":"IFERROR(SUMIFS(D_D[INV],D_D[MT],11,D_D[CAT],TA_23,D_D[EP],$A28),0)","v":0}]
["682","EP 682 - Review of Radiation related cases/conditions",{"$f":"IFERROR(SUMIFS(D_D[INV],D_D[MT],11,D_D[CAT],TA_23,D_D[EP],$A29),0)","v":0}]
["684","EP 684 - Review of Misc cases referred to central office",{"$f":"IFERROR(SUMIFS(D_D[INV],D_D[MT],11,D_D[CAT],TA_23,D_D[EP],$A30),0)","v":0},null,"Integrated Disability Evaluation System (IDES)"]
["685","EP 685 - Review of effective date related to herbicide exposure",{"$f":"IFERROR(SUMIFS(D_D[INV],D_D[MT],11,D_D[CAT],TA_23,D_D[EP],$A31),0)","v":0},null,"EP 689 - IDES",{"$f":"IFERROR(SUMIFS(D_D[INV],D_D[MT],11,D_D[CAT],1,D_D[EP],-1),0)","v":0}]
["690G","EP 690 - Cost of Living Adjustments (COLAs) and other reviews",{"$f":"IFERROR(SUMIFS(D_D[INV],D_D[MT],11,D_D[CAT],TA_23,D_D[EP],$A32),0)","v":0}]
["690","EP 690 - Social Security number verification",{"$f":"IFERROR(SUMIFS(D_D[INV],D_D[MT],11,D_D[CAT],TA_23,D_D[EP],$A33),0)","v":0}]
[null,"Compensation Other",{"$f":"SUM(C35:C44)","v":88}]
["335","EP 335 - Blue Water Navy (Agent Orange)",{"$f":"IFERROR(SUMIFS(D_D[INV],D_D[MT],11,D_D[CAT],TA_24,D_D[EP],$A35),0)","v":0}]
["400G","EP 400 - Correspondence ",{"$f":"IFERROR(SUMIFS(D_D[INV],D_D[MT],11,D_D[CAT],TA_24,D_D[EP],$A36),0)","v":86}]
["500G","EP 500 - Congressional correspondence",{"$f":"IFERROR(SUMIFS(D_D[INV],D_D[MT],11,D_D[CAT],TA_24,D_D[EP],$A37),0)","v":0}]
["510","EP 510 - Freedom of Information Act (FOIA) requests",{"$f":"IFERROR(SUMIFS(D_D[INV],D_D[MT],11,D_D[CAT],TA_24,D_D[EP],$A38),0)","v":0}]
["930G","EP 930 - Review, including quality assurance",{"$f":"IFERROR(SUMIFS(D_D[INV],D_D[MT],11,D_D[CAT],TA_24,D_D[EP],$A39),0)","v":2}]
["960G","EP 960 - Correction of errors",{"$f":"IFERROR(SUMIFS(D_D[INV],D_D[MT],11,D_D[CAT],TA_24,D_D[EP],$A40),0)","v":0}]
["681","EP 681 - Used to control claims under the Nehmer Agent Orange stipulation",{"$f":"IFERROR(SUMIFS(D_D[INV],D_D[MT],11,D_D[CAT],TA_24,D_D[EP],$A41),0)","v":0}]
["687","EP 687 - Previously used for Nehmer Agent Orange presumptive issues",{"$f":"IFERROR(SUMIFS(D_D[INV],D_D[MT],11,D_D[CAT],TA_24,D_D[EP],$A42),0)","v":0}]
["405","EP 405 - Reopened or new Agent Orange claims between 9/01/10 and 10/24/2011",{"$f":"IFERROR(SUMIFS(D_D[INV],D_D[MT],11,D_D[CAT],TA_24,D_D[EP],$A43),0)","v":0}]
["409","EP 409 - Agent Orange claims where an interim decision was provided; No longer used as of 10/24/2011",{"$f":"IFERROR(SUMIFS(D_D[INV],D_D[MT],11,D_D[CAT],TA_24,D_D[EP],$A44),0)","v":0}]
[null,"Compensation Burial/Accrued",{"$f":"SUM(C46:C47)","v":0}]
["160G","EP 160 - Burials",{"$f":"IFERROR(SUMIFS(D_D[INV],D_D[MT],11,D_D[CAT],TA_25,D_D[EP],$A46),0)","v":0}]
["165","EP 165 - Accrued",{"$f":"IFERROR(SUMIFS(D_D[INV],D_D[MT],11,D_D[CAT],TA_25,D_D[EP],$A47),0)","v":0}]

{"sheet":"TA-Regional Office","index":12,"n_rows":80,"n_cols":19,"rows_kept":80,"cut":false,"hidden":false,"merged":[[1,1,3,1],[5,2,5,18],[72,2,72,18],[73,2,73,3],[73,4,73,6],[73,7,73,9],[73,10,73,12],[73,13,73,15],[3,2,3,3],[3,4,3,6],[3,7,3,9],[3,10,3,12],[3,13,3,15],[1,2,1,5],[1,6,1,9],[2,2,2,18]]}
[null,null,2000,2000,11,11,null,12,12,null,13,13,null,14,14,null,15,16,1]
[null,"Scroll down to see Pension",{"$f":"(\"Inventory by Regional Office - Data through \")","v":"Inventory by Regional Office - Data through "},null,null,null,{"$f":"D_DT[]","v":"2022-05-28"}]
[null,null,"*The claims pending under 'Non-Rating' are a subset of claims listed under the 'Award Adjustment' column and should not be counted twice when computing totals"]
[null,null,"Non-Rating",null,"Entitlement   ",null,null,"Award Adjustment ",null,null,"Program Review ",null,null,"Other",null,null,"Burial  ","Accrued  ","Legacy Appeals"]
[null,null,"Claims Pending","Avg. Days Pending","Claims Pending","Pending over 125 days","Percent Pending over 125 days","Claims Pending","Pending over 125 days","Percent Pending over 125 days","Claims Pending","Pending over 125 days","Percent Pending over 125 days","Claims Pending","Pending over 125 days","Percent Pending over 125 days","Claims Pending","Claims Pending","Appeals Pending"]
[null,null,"Compensation"]
[100,"USA Compensation",{"$f":"IFERROR(SUMIFS(D_D[INV],D_D[MT],1,D_D[CAT],TA_20,D_D[EP],-1, D_D[LOC],$A7),0)","v":102222},{"$f":"IFERROR(SUMIFS(D_D[ADP],D_D[MT],1,D_D[CAT],D$1,D_D[EP],-1, D_D[LOC],$A7),0)","v":70.98},{"$f":"IFERROR(SUMIFS(D_D[INV],D_D[MT],2,D_D[CAT],TA_21,D_D[EP],-1, D_D[LOC],$A7),0)","v":529894},{"$f":"IFERROR(SUMIFS(D_D[BL],D_D[MT],2,D_D[CAT],TA_21,D_D[EP],-1, D_D[LOC],$A7),0)","v":152334},{"$f":"IFERROR(F7/E7,\"0%\")","v":0.28748013753694135},{"$f":"IFERROR(SUMIFS(D_D[INV],D_D[MT],2,D_D[CAT],TA_22,D_D[EP],-1, D_D[LOC],$A7),0)","v":209869},{"$f":"IFERROR(SUMIFS(D_D[BL],D_D[MT],2,D_D[CAT],TA_22,D_D[EP],-1, D_D[LOC],$A7),0)","v":44978},{"$f":"IFERROR(I7/H7,\"0%\")","v":0.21431464389690713},{"$f":"IFERROR(SUMIFS(D_D[INV],D_D[MT],2,D_D[CAT],TA_23,D_D[EP],-1, D_D[LOC],$A7),0)","v":5188},{"$f":"IFERROR(SUMIFS(D_D[BL],D_D[MT],2,D_D[CAT],TA_23,D_D[EP],-1, D_D[LOC],$A7),0)","v":361},{"$f":"IFERROR(L7/K7,\"0%\")","v":6.9583654587509633E-2},{"$f":"IFERROR(SUMIFS(D_D[INV],D_D[MT],2,D_D[CAT],TA_24,D_D[EP],-1, D_D[LOC],$A7),0) - 'Diarys and Future Claims'!C35","v":111768},{"$f":"IFERROR(SUMIFS(D_D[BL],D_D[MT],2,D_D[CAT],TA_24,D_D[EP],-1, D_D[LOC],$A7),0)","v":56976},{"$f":"IFERROR(O7/N7,\"0%\")","v":0.50977023835086965},{"$f":"IFERROR(SUMIFS(D_D[INV],D_D[MT],2,D_D[CAT],TA_25,D_D[EP],-1, D_D[LOC],$A7),0)","v":8996},{"$f":"IFERROR(SUMIFS(D_D[INV],D_D[MT],2,D_D[CAT],TA_26,D_D[EP],-1, D_D[LOC],$A7),0)","v":11216},{"$f":"IFERROR(SUMIFS(D_D[INV],D_D[MT],7,D_D[CAT],2,D_D[EP],TA_20, D_D[LOC],$A7),0)","v":29888}]
[394,"Northeast",{"$f":"IFERROR(SUMIFS(D_D[INV],D_D[MT],1,D_D[CAT],TA_20,D_D[EP],-1, D_D[LOC],$A8),0)","v":24878},{"$f":"IFERROR(SUMIFS(D_D[ADP],D_D[MT],1,D_D[CAT],D$1,D_D[EP],-1, D_D[LOC],$A8),0)","v":100.42},{"$f":"IFERROR(SUMIFS(D_D[INV],D_D[MT],2,D_D[CAT],TA_21,D_D[EP],-1, D_D[LOC],$A8),0)","v":92184},{"$f":"IFERROR(SUMIFS(D_D[BL],D_D[MT],2,D_D[CAT],TA_21,D_D[EP],-1, D_D[LOC],$A8),0)","v":28670},{"$f":"IFERROR(F8/E8,\"0%\")","v":0.31100841794671524},{"$f":"IFERROR(SUMIFS(D_D[INV],D_D[MT],2,D_D[CAT],TA_22,D_D[EP],-1, D_D[LOC],$A8),0)","v":56690},{"$f":"IFERROR(SUMIFS(D_D[BL],D_D[MT],2,D_D[CAT],TA_22,D_D[EP],-1, D_D[LOC],$A8),0)","v":14508},{"$f":"IFERROR(I8/H8,\"0%\")","v":0.25591815134944434},{"$f":"IFERROR(SUMIFS(D_D[INV],D_D[MT],2,D_D[CAT],TA_23,D_D[EP],-1, D_D[LOC],$A8),0)","v":1284},{"$f":"IFERROR(SUMIFS(D_D[BL],D_D[MT],2,D_D[CAT],TA_23,D_D[EP],-1, D_D[LOC],$A8),0)","v":46},{"$f":"IFERROR(L8/K8,\"0%\")","v":3.5825545171339561E-2},{"$f":"IFERROR(SUMIFS(D_D[INV],D_D[MT],2,D_D[CAT],TA_24,D_D[EP],-1, D_D[LOC],$A8),0)","v":27615},{"$f":"IFERROR(SUMIFS(D_D[BL],D_D[MT],2,D_D[CAT],TA_24,D_D[EP],-1, D_D[LOC],$A8),0)","v":7221},{"$f":"IFERROR(O8/N8,\"0%\")","v":0.26148832156436719},{"$f":"IFERROR(SUMIFS(D_D[INV],D_D[MT],2,D_D[CAT],TA_25,D_D[EP],-1, D_D[LOC],$A8),0)","v":2716},{"$f":"IFERROR(SUMIFS(D_D[INV],D_D[MT],2,D_D[CAT],TA_26,D_D[EP],-1, D_D[LOC],$A8),0)","v":1154},{"$f":"IFERROR(SUMIFS(D_D[INV],D_D[MT],7,D_D[CAT],2,D_D[EP],TA_20, D_D[LOC],$A8),0)","v":209}]
["313","Baltimore",{"$f":"IFERROR(SUMIFS(D_D[INV],D_D[MT],1,D_D[CAT],TA_20,D_D[EP],-1, D_D[LOC],$A9),0)","v":960},{"$f":"IFERROR(SUMIFS(D_D[ADP],D_D[MT],1,D_D[CAT],D$1,D_D[EP],-1, D_D[LOC],$A9),0)","v":36.299999999999997},{"$f":"IFERROR(SUMIFS(D_D[INV],D_D[MT],2,D_D[CAT],TA_21,D_D[EP],-1, D_D[LOC],$A9),0)","v":7175},{"$f":"IFERROR(SUMIFS(D_D[BL],D_D[MT],2,D_D[CAT],TA_21,D_D[EP],-1, D_D[LOC],$A9),0)","v":1899},0.26466898954703832,{"$f":"IFERROR(SUMIFS(D_D[INV],D_D[MT],2,D_D[CAT],TA_22,D_D[EP],-1, D_D[LOC],$A9),0)","v":1807},{"$f":"IFERROR(SUMIFS(D_D[BL],D_D[MT],2,D_D[CAT],TA_22,D_D[EP],-1, D_D[LOC],$A9),0)","v":152},8.4117321527393471E-2,{"$f":"IFERROR(SUMIFS(D_D[INV],D_D[MT],2,D_D[CAT],TA_23,D_D[EP],-1, D_D[LOC],$A9),0)","v":84},{"$f":"IFERROR(SUMIFS(D_D[BL],D_D[MT],2,D_D[CAT],TA_23,D_D[EP],-1, D_D[LOC],$A9),0)","v":0},0,{"$f":"IFERROR(SUMIFS(D_D[INV],D_D[MT],2,D_D[CAT],TA_24,D_D[EP],-1, D_D[LOC],$A9),0)","v":834},{"$f":"IFERROR(SUMIFS(D_D[BL],D_D[MT],2,D_D[CAT],TA_24,D_D[EP],-1, D_D[LOC],$A9),0)","v":170},0.2038369304556355,{"$f":"IFERROR(SUMIFS(D_D[INV],D_D[MT],2,D_D[CAT],TA_25,D_D[EP],-1, D_D[LOC],$A9),0)","v":37},{"$f":"IFERROR(SUMIFS(D_D[INV],D_D[MT],2,D_D[CAT],TA_26,D_D[EP],-1, D_D[LOC],$A9),0)","v":1},{"$f":"IFERROR(SUMIFS(D_D[INV],D_D[MT],7,D_D[CAT],2,D_D[EP],TA_20, D_D[LOC],$A9),0)","v":5}]
["301","Boston",{"$f":"IFERROR(SUMIFS(D_D[INV],D_D[MT],1,D_D[CAT],TA_20,D_D[EP],-1, D_D[LOC],$A10),0)","v":390},{"$f":"IFERROR(SUMIFS(D_D[ADP],D_D[MT],1,D_D[CAT],D$1,D_D[EP],-1, D_D[LOC],$A10),0)","v":32.26},{"$f":"IFERROR(SUMIFS(D_D[INV],D_D[MT],2,D_D[CAT],TA_21,D_D[EP],-1, D_D[LOC],$A10),0)","v":3006},{"$f":"IFERROR(SUMIFS(D_D[BL],D_D[MT],2,D_D[CAT],TA_21,D_D[EP],-1, D_D[LOC],$A10),0)","v":893},{"$f":"IFERROR(F10/E10,\"0%\")","v":0.29707252162341985},{"$f":"IFERROR(SUMIFS(D_D[INV],D_D[MT],2,D_D[CAT],TA_22,D_D[EP],-1, D_D[LOC],$A10),0)","v":1035},{"$f":"IFERROR(SUMIFS(D_D[BL],D_D[MT],2,D_D[CAT],TA_22,D_D[EP],-1, D_D[LOC],$A10),0)","v":120},{"$f":"IFERROR(I10/H10,\"0%\")","v":0.11594202898550725},{"$f":"IFERROR(SUMIFS(D_D[INV],D_D[MT],2,D_D[CAT],TA_23,D_D[EP],-1, D_D[LOC],$A10),0)","v":51},{"$f":"IFERROR(SUMIFS(D_D[BL],D_D[MT],2,D_D[CAT],TA_23,D_D[EP],-1, D_D[LOC],$A10),0)","v":2},{"$f":"IFERROR(L10/K10,\"0%\")","v":3.9215686274509803E-2},{"$f":"IFERROR(SUMIFS(D_D[INV],D_D[MT],2,D_D[CAT],TA_24,D_D[EP],-1, D_D[LOC],$A10),0)","v":199},{"$f":"IFERROR(SUMIFS(D_D[BL],D_D[MT],2,D_D[CAT],TA_24,D_D[EP],-1, D_D[LOC],$A10),0)","v":124},{"$f":"IFERROR(O10/N10,\"0%\")","v":0.62311557788944727},{"$f":"IFERROR(SUMIFS(D_D[INV],D_D[MT],2,D_D[CAT],TA_25,D_D[EP],-1, D_D[LOC],$A10),0)","v":29},{"$f":"IFERROR(SUMIFS(D_D[INV],D_D[MT],2,D_D[CAT],TA_26,D_D[EP],-1, D_D[LOC],$A10),0)","v":1},{"$f":"IFERROR(SUMIFS(D_D[INV],D_D[MT],7,D_D[CAT],2,D_D[EP],TA_20, D_D[LOC],$A10),0)","v":2}]
["307","Buffalo",{"$f":"IFERROR(SUMIFS(D_D[INV],D_D[MT],1,D_D[CAT],TA_20,D_D[EP],-1, D_D[LOC],$A11),0)","v":503},{"$f":"IFERROR(SUMIFS(D_D[ADP],D_D[MT],1,D_D[CAT],D$1,D_D[EP],-1, D_D[LOC],$A11),0)","v":35.68},{"$f":"IFERROR(SUMIFS(D_D[INV],D_D[MT],2,D_D[CAT],TA_21,D_D[EP],-1, D_D[LOC],$A11),0)","v":3578},{"$f":"IFERROR(SUMIFS(D_D[BL],D_D[MT],2,D_D[CAT],TA_21,D_D[EP],-1, D_D[LOC],$A11),0)","v":1108},0.30967020681945223,{"$f":"IFERROR(SUMIFS(D_D[INV],D_D[MT],2,D_D[CAT],TA_22,D_D[EP],-1, D_D[LOC],$A11),0)","v":1289},{"$f":"IFERROR(SUMIFS(D_D[BL],D_D[MT],2,D_D[CAT],TA_22,D_D[EP],-1, D_D[LOC],$A11),0)","v":164},0.12723041117145073,{"$f":"IFERROR(SUMIFS(D_D[INV],D_D[MT],2,D_D[CAT],TA_23,D_D[EP],-1, D_D[LOC],$A11),0)","v":48},{"$f":"IFERROR(SUMIFS(D_D[BL],D_D[MT],2,D_D[CAT],TA_23,D_D[EP],-1, D_D[LOC],$A11),0)","v":3},6.25E-2,{"$f":"IFERROR(SUMIFS(D_D[INV],D_D[MT],2,D_D[CAT],TA_24,D_D[EP],-1, D_D[LOC],$A11),0)","v":215},{"$f":"IFERROR(SUMIFS(D_D[BL],D_D[MT],2,D_D[CAT],TA_24,D_D[EP],-1, D_D[LOC],$A11),0)","v":130},0.60465116279069764,{"$f":"IFERROR(SUMIFS(D_D[INV],D_D[MT],2,D_D[CAT],TA_25,D_D[EP],-1, D_D[LOC],$A11),0)","v":50},{"$f":"IFERROR(SUMIFS(D_D[INV],D_D[MT],2,D_D[CAT],TA_26,D_D[EP],-1, D_D[LOC],$A11),0)","v":0},{"$f":"IFERROR(SUMIFS(D_D[INV],D_D[MT],7,D_D[CAT],2,D_D[EP],TA_20, D_D[LOC],$A11),0)","v":3}]
["328","Chicago",{"$f":"IFERROR(SUMIFS(D_D[INV],D_D[MT],1,D_D[CAT],TA_20,D_D[EP],-1, D_D[LOC],$A12),0)","v":994},{"$f":"IFERROR(SUMIFS(D_D[ADP],D_D[MT],1,D_D[CAT],D$1,D_D[EP],-1, D_D[LOC],$A12),0)","v":40.61},{"$f":"IFERROR(SUMIFS(D_D[INV],D_D[MT],2,D_D[CAT],TA_21,D_D[EP],-1, D_D[LOC],$A12),0)","v":8256},{"$f":"IFERROR(SUMIFS(D_D[BL],D_D[MT],2,D_D[CAT],TA_21,D_D[EP],-1, D_D[LOC],$A12),0)","v":2580},0.3125,{"$f":"IFERROR(SUMIFS(D_D[INV],D_D[MT],2,D_D[CAT],TA_22,D_D[EP],-1, D_D[LOC],$A12),0)","v":1986},{"$f":"IFERROR(SUMIFS(D_D[BL],D_D[MT],2,D_D[CAT],TA_22,D_D[EP],-1, D_D[LOC],$A12),0)","v":268},0.13494461228600202,{"$f":"IFERROR(SUMIFS(D_D[INV],D_D[MT],2,D_D[CAT],TA_23,D_D[EP],-1, D_D[LOC],$A12),0)","v":106},{"$f":"IFERROR(SUMIFS(D_D[BL],D_D[MT],2,D_D[CAT],TA_23,D_D[EP],-1, D_D[LOC],$A12),0)","v":0},0,{"$f":"IFERROR(SUMIFS(D_D[INV],D_D[MT],2,D_D[CAT],TA_24,D_D[EP],-1, D_D[LOC],$A12),0)","v":552},{"$f":"IFERROR(SUMIFS(D_D[BL],D_D[MT],2,D_D[CAT],TA_24,D_D[EP],-1, D_D[LOC],$A12),0)","v":273},0.49456521739130432,{"$f":"IFERROR(SUMIFS(D_D[INV],D_D[MT],2,D_D[CAT],TA_25,D_D[EP],-1, D_D[LOC],$A12),0)","v":100},{"$f":"IFERROR(SUMIFS(D_D[INV],D_D[MT],2,D_D[CAT],TA_26,D_D[EP],-1, D_D[LOC],$A12),0)","v":6},{"$f":"IFERROR(SUMIFS(D_D[INV],D_D[MT],7,D_D[CAT],2,D_D[EP],TA_20, D_D[LOC],$A12),0)","v":5}]
["325","Cleveland",{"$f":"IFERROR(SUMIFS(D_D[INV],D_D[MT],1,D_D[CAT],TA_20,D_D[EP],-1, D_D[LOC],$A13),0)","v":1905},{"$f":"IFERROR(SUMIFS(D_D[ADP],D_D[MT],1,D_D[CAT],D$1,D_D[EP],-1, D_D[LOC],$A13),0)","v":57.62},{"$f":"IFERROR(SUMIFS(D_D[INV],D_D[MT],2,D_D[CAT],TA_21,D_D[EP],-1, D_D[LOC],$A13),0)","v":10201},{"$f":"IFERROR(SUMIFS(D_D[BL],D_D[MT],2,D_D[CAT],TA_21,D_D[EP],-1, D_D[LOC],$A13),0)","v":3126},0.3064405450446035,{"$f":"IFERROR(SUMIFS(D_D[INV],D_D[MT],2,D_D[CAT],TA_22,D_D[EP],-1, D_D[LOC],$A13),0)","v":3403},{"$f":"IFERROR(SUMIFS(D_D[BL],D_D[MT],2,D_D[CAT],TA_22,D_D[EP],-1, D_D[LOC],$A13),0)","v":464},0.13635027916544226,{"$f":"IFERROR(SUMIFS(D_D[INV],D_D[MT],2,D_D[CAT],TA_23,D_D[EP],-1, D_D[LOC],$A13),0)","v":128},{"$f":"IFERROR(SUMIFS(D_D[BL],D_D[MT],2,D_D[CAT],TA_23,D_D[EP],-1, D_D[LOC],$A13),0)","v":6},4.6875E-2,{"$f":"IFERROR(SUMIFS(D_D[INV],D_D[MT],2,D_D[CAT],TA_24,D_D[EP],-1, D_D[LOC],$A13),0)","v":1528},{"$f":"IFERROR(SUMIFS(D_D[BL],D_D[MT],2,D_D[CAT],TA_24,D_D[EP],-1, D_D[LOC],$A13),0)","v":1165},0.76243455497382195,{"$f":"IFERROR(SUMIFS(D_D[INV],D_D[MT],2,D_D[CAT],TA_25,D_D[EP],-1, D_D[LOC],$A13),0)","v":112},{"$f":"IFERROR(SUMIFS(D_D[INV],D_D[MT],2,D_D[CAT],TA_26,D_D[EP],-1, D_D[LOC],$A13),0)","v":12},{"$f":"IFERROR(SUMIFS(D_D[INV],D_D[MT],7,D_D[CAT],2,D_D[EP],TA_20, D_D[LOC],$A13),0)","v":7}]
["329","Detroit",{"$f":"IFERROR(SUMIFS(D_D[INV],D_D[MT],1,D_D[CAT],TA_20,D_D[EP],-1, D_D[LOC],$A14),0)","v":2158},{"$f":"IFERROR(SUMIFS(D_D[ADP],D_D[MT],1,D_D[CAT],D$1,D_D[EP],-1, D_D[LOC],$A14),0)","v":52.82},{"$f":"IFERROR(SUMIFS(D_D[INV],D_D[MT],2,D_D[CAT],TA_21,D_D[EP],-1, D_D[LOC],$A14),0)","v":6926},{"$f":"IFERROR(SUMIFS(D_D[BL],D_D[MT],2,D_D[CAT],TA_21,D_D[EP],-1, D_D[LOC],$A14),0)","v":2107},0.30421599768986429,{"$f":"IFERROR(SUMIFS(D_D[INV],D_D[MT],2,D_D[CAT],TA_22,D_D[EP],-1, D_D[LOC],$A14),0)","v":7078},{"$f":"IFERROR(SUMIFS(D_D[BL],D_D[MT],2,D_D[CAT],TA_22,D_D[EP],-1, D_D[LOC],$A14),0)","v":1705},0.24088725628708674,{"$f":"IFERROR(SUMIFS(D_D[INV],D_D[MT],2,D_D[CAT],TA_23,D_D[EP],-1, D_D[LOC],$A14),0)","v":84},{"$f":"IFERROR(SUMIFS(D_D[BL],D_D[MT],2,D_D[CAT],TA_23,D_D[EP],-1, D_D[LOC],$A14),0)","v":7},8.3333333333333329E-2,{"$f":"IFERROR(SUMIFS(D_D[INV],D_D[MT],2,D_D[CAT],TA_24,D_D[EP],-1, D_D[LOC],$A14),0)","v":784},{"$f":"IFERROR(SUMIFS(D_D[BL],D_D[MT],2,D_D[CAT],TA_24,D_D[EP],-1, D_D[LOC],$A14),0)","v":386},0.49234693877551022,{"$f":"IFERROR(SUMIFS(D_D[INV],D_D[MT],2,D_D[CAT],TA_25,D_D[EP],-1, D_D[LOC],$A14),0)","v":101},{"$f":"IFERROR(SUMIFS(D_D[INV],D_D[MT],2,D_D[CAT],TA_26,D_D[EP],-1, D_D[LOC],$A14),0)","v":7},{"$f":"IFERROR(SUMIFS(D_D[INV],D_D[MT],7,D_D[CAT],2,D_D[EP],TA_20, D_D[LOC],$A14),0)","v":2}]
["308","Hartford",{"$f":"IFERROR(SUMIFS(D_D[INV],D_D[MT],1,D_D[CAT],TA_20,D_D[EP],-1, D_D[LOC],$A15),0)","v":282},{"$f":"IFERROR(SUMIFS(D_D[ADP],D_D[MT],1,D_D[CAT],D$1,D_D[EP],-1, D_D[LOC],$A15),0)","v":38.46},{"$f":"IFERROR(SUMIFS(D_D[INV],D_D[MT],2,D_D[CAT],TA_21,D_D[EP],-1, D_D[LOC],$A15),0)","v":2037},{"$f":"IFERROR(SUMIFS(D_D[BL],D_D[MT],2,D_D[CAT],TA_21,D_D[EP],-1, D_D[LOC],$A15),0)","v":676},0.33186057928325968,{"$f":"IFERROR(SUMIFS(D_D[INV],D_D[MT],2,D_D[CAT],TA_22,D_D[EP],-1, D_D[LOC],$A15),0)","v":756},{"$f":"IFERROR(SUMIFS(D_D[BL],D_D[MT],2,D_D[CAT],TA_22,D_D[EP],-1, D_D[LOC],$A15),0)","v":113},0.14947089947089948,{"$f":"IFERROR(SUMIFS(D_D[INV],D_D[MT],2,D_D[CAT],TA_23,D_D[EP],-1, D_D[LOC],$A15),0)","v":21},{"$f":"IFERROR(SUMIFS(D_D[BL],D_D[MT],2,D_D[CAT],TA_23,D_D[EP],-1, D_D[LOC],$A15),0)","v":1},4.7619047619047616E-2,{"$f":"IFERROR(SUMIFS(D_D[INV],D_D[MT],2,D_D[CAT],TA_24,D_D[EP],-1, D_D[LOC],$A15),0)","v":202},{"$f":"IFERROR(SUMIFS(D_D[BL],D_D[MT],2,D_D[CAT],TA_24,D_D[EP],-1, D_D[LOC],$A15),0)","v":98},0.48514851485148514,{"$f":"IFERROR(SUMIFS(D_D[INV],D_D[MT],2,D_D[CAT],TA_25,D_D[EP],-1, D_D[LOC],$A15),0)","v":20},{"$f":"IFERROR(SUMIFS(D_D[INV],D_D[MT],2,D_D[CAT],TA_26,D_D[EP],-1, D_D[LOC],$A15),0)","v":0},{"$f":"IFERROR(SUMIFS(D_D[INV],D_D[MT],7,D_D[CAT],2,D_D[EP],TA_20, D_D[LOC],$A15),0)","v":1}]
["326","Indianapolis",{"$f":"IFERROR(SUMIFS(D_D[INV],D_D[MT],1,D_D[CAT],TA_20,D_D[EP],-1, D_D[LOC],$A16),0)","v":5086},{"$f":"IFERROR(SUMIFS(D_D[ADP],D_D[MT],1,D_D[CAT],D$1,D_D[EP],-1, D_D[LOC],$A16),0)","v":46.12},{"$f":"IFERROR(SUMIFS(D_D[INV],D_D[MT],2,D_D[CAT],TA_21,D_D[EP],-1, D_D[LOC],$A16),0)","v":6004},{"$f":"IFERROR(SUMIFS(D_D[BL],D_D[MT],2,D_D[CAT],TA_21,D_D[EP],-1, D_D[LOC],$A16),0)","v":1805},0.30063291139240506,{"$f":"IFERROR(SUMIFS(D_D[INV],D_D[MT],2,D_D[CAT],TA_22,D_D[EP],-1, D_D[LOC],$A16),0)","v":6134},{"$f":"IFERROR(SUMIFS(D_D[BL],D_D[MT],2,D_D[CAT],TA_22,D_D[EP],-1, D_D[LOC],$A16),0)","v":543},8.8522986631887832E-2,{"$f":"IFERROR(SUMIFS(D_D[INV],D_D[MT],2,D_D[CAT],TA_23,D_D[EP],-1, D_D[LOC],$A16),0)","v":81},{"$f":"IFERROR(SUMIFS(D_D[BL],D_D[MT],2,D_D[CAT],TA_23,D_D[EP],-1, D_D[LOC],$A16),0)","v":3},3.7037037037037035E-2,{"$f":"IFERROR(SUMIFS(D_D[INV],D_D[MT],2,D_D[CAT],TA_24,D_D[EP],-1, D_D[LOC],$A16),0)","v":367},{"$f":"IFERROR(SUMIFS(D_D[BL],D_D[MT],2,D_D[CAT],TA_24,D_D[EP],-1, D_D[LOC],$A16),0)","v":228},0.62125340599455037,{"$f":"IFERROR(SUMIFS(D_D[INV],D_D[MT],2,D_D[CAT],TA_25,D_D[EP],-1, D_D[LOC],$A16),0)","v":48},{"$f":"IFERROR(SUMIFS(D_D[INV],D_D[MT],2,D_D[CAT],TA_26,D_D[EP],-1, D_D[LOC],$A16),0)","v":11},{"$f":"IFERROR(SUMIFS(D_D[INV],D_D[MT],7,D_D[CAT],2,D_D[EP],TA_20, D_D[LOC],$A16),0)","v":0}]
["373","Manchester",{"$f":"IFERROR(SUMIFS(D_D[INV],D_D[MT],1,D_D[CAT],TA_20,D_D[EP],-1, D_D[LOC],$A17),0)","v":184},{"$f":"IFERROR(SUMIFS(D_D[ADP],D_D[MT],1,D_D[CAT],D$1,D_D[EP],-1, D_D[LOC],$A17),0)","v":68.260000000000005},{"$f":"IFERROR(SUMIFS(D_D[INV],D_D[MT],2,D_D[CAT],TA_21,D_D[EP],-1, D_D[LOC],$A17),0)","v":1137},{"$f":"IFERROR(SUMIFS(D_D[BL],D_D[MT],2,D_D[CAT],TA_21,D_D[EP],-1, D_D[LOC],$A17),0)","v":358},0.3148636763412489,{"$f":"IFERROR(SUMIFS(D_D[INV],D_D[MT],2,D_D[CAT],TA_22,D_D[EP],-1, D_D[LOC],$A17),0)","v":431},{"$f":"IFERROR(SUMIFS(D_D[BL],D_D[MT],2,D_D[CAT],TA_22,D_D[EP],-1, D_D[LOC],$A17),0)","v":76},0.17633410672853828,{"$f":"IFERROR(SUMIFS(D_D[INV],D_D[MT],2,D_D[CAT],TA_23,D_D[EP],-1, D_D[LOC],$A17),0)","v":18},{"$f":"IFERROR(SUMIFS(D_D[BL],D_D[MT],2,D_D[CAT],TA_23,D_D[EP],-1, D_D[LOC],$A17),0)","v":0},0,{"$f":"IFERROR(SUMIFS(D_D[INV],D_D[MT],2,D_D[CAT],TA_24,D_D[EP],-1, D_D[LOC],$A17),0)","v":72},{"$f":"IFERROR(SUMIFS(D_D[BL],D_D[MT],2,D_D[CAT],TA_24,D_D[EP],-1, D_D[LOC],$A17),0)","v":48},0.66666666666666663,{"$f":"IFERROR(SUMIFS(D_D[INV],D_D[MT],2,D_D[CAT],TA_25,D_D[EP],-1, D_D[LOC],$A17),0)","v":12},{"$f":"IFERROR(SUMIFS(D_D[INV],D_D[MT],2,D_D[CAT],TA_26,D_D[EP],-1, D_D[LOC],$A17),0)","v":1},{"$f":"IFERROR(SUMIFS(D_D[INV],D_D[MT],7,D_D[CAT],2,D_D[EP],TA_20, D_D[LOC],$A17),0)","v":0}]
["330","Milwaukee",{"$f":"IFERROR(SUMIFS(D_D[INV],D_D[MT],1,D_D[CAT],TA_20,D_D[EP],-1, D_D[LOC],$A18),0)","v":4941},{"$f":"IFERROR(SUMIFS(D_D[ADP],D_D[MT],1,D_D[CAT],D$1,D_D[EP],-1, D_D[LOC],$A18),0)","v":55.62},{"$f":"IFERROR(SUMIFS(D_D[INV],D_D[MT],2,D_D[CAT],TA_21,D_D[EP],-1, D_D[LOC],$A18),0)","v":6846},{"$f":"IFERROR(SUMIFS(D_D[BL],D_D[MT],2,D_D[CAT],TA_21,D_D[EP],-1, D_D[LOC],$A18),0)","v":2253},0.32909728308501313,{"$f":"IFERROR(SUMIFS(D_D[INV],D_D[MT],2,D_D[CAT],TA_22,D_D[EP],-1, D_D[LOC],$A18),0)","v":15353},{"$f":"IFERROR(SUMIFS(D_D[BL],D_D[MT],2,D_D[CAT],TA_22,D_D[EP],-1, D_D[LOC],$A18),0)","v":5625},0.36637790659805902,{"$f":"IFERROR(SUMIFS(D_D[INV],D_D[MT],2,D_D[CAT],TA_23,D_D[EP],-1, D_D[LOC],$A18),0)","v":182},{"$f":"IFERROR(SUMIFS(D_D[BL],D_D[MT],2,D_D[CAT],TA_23,D_D[EP],-1, D_D[LOC],$A18),0)","v":6},3.2967032967032968E-2,{"$f":"IFERROR(SUMIFS(D_D[INV],D_D[MT],2,D_D[CAT],TA_24,D_D[EP],-1, D_D[LOC],$A18),0)","v":1087},{"$f":"IFERROR(SUMIFS(D_D[BL],D_D[MT],2,D_D[CAT],TA_24,D_D[EP],-1, D_D[LOC],$A18),0)","v":682},0.62741490340386386,{"$f":"IFERROR(SUMIFS(D_D[INV],D_D[MT],2,D_D[CAT],TA_25,D_D[EP],-1, D_D[LOC],$A18),0)","v":746},{"$f":"IFERROR(SUMIFS(D_D[INV],D_D[MT],2,D_D[CAT],TA_26,D_D[EP],-1, D_D[LOC],$A18),0)","v":0},{"$f":"IFERROR(SUMIFS(D_D[INV],D_D[MT],7,D_D[CAT],2,D_D[EP],TA_20, D_D[LOC],$A18),0)","v":1}]
["306","New York",{"$f":"IFERROR(SUMIFS(D_D[INV],D_D[MT],1,D_D[CAT],TA_20,D_D[EP],-1, D_D[LOC],$A19),0)","v":729},{"$f":"IFERROR(SUMIFS(D_D[ADP],D_D[MT],1,D_D[CAT],D$1,D_D[EP],-1, D_D[LOC],$A19),0)","v":44.39},{"$f":"IFERROR(SUMIFS(D_D[INV],D_D[MT],2,D_D[CAT],TA_21,D_D[EP],-1, D_D[LOC],$A19),0)","v":5404},{"$f":"IFERROR(SUMIFS(D_D[BL],D_D[MT],2,D_D[CAT],TA_21,D_D[EP],-1, D_D[LOC],$A19),0)","v":1727},0.31957809030347889,{"$f":"IFERROR(SUMIFS(D_D[INV],D_D[MT],2,D_D[CAT],TA_22,D_D[EP],-1, D_D[LOC],$A19),0)","v":1785},{"$f":"IFERROR(SUMIFS(D_D[BL],D_D[MT],2,D_D[CAT],TA_22,D_D[EP],-1, D_D[LOC],$A19),0)","v":255},0.14285714285714285,{"$f":"IFERROR(SUMIFS(D_D[INV],D_D[MT],2,D_D[CAT],TA_23,D_D[EP],-1, D_D[LOC],$A19),0)","v":67},{"$f":"IFERROR(SUMIFS(D_D[BL],D_D[MT],2,D_D[CAT],TA_23,D_D[EP],-1, D_D[LOC],$A19),0)","v":5},7.4626865671641784E-2,{"$f":"IFERROR(SUMIFS(D_D[INV],D_D[MT],2,D_D[CAT],TA_24,D_D[EP],-1, D_D[LOC],$A19),0)","v":380},{"$f":"IFERROR(SUMIFS(D_D[BL],D_D[MT],2,D_D[CAT],TA_24,D_D[EP],-1, D_D[LOC],$A19),0)","v":155},0.40789473684210525,{"$f":"IFERROR(SUMIFS(D_D[INV],D_D[MT],2,D_D[CAT],TA_25,D_D[EP],-1, D_D[LOC],$A19),0)","v":66},{"$f":"IFERROR(SUMIFS(D_D[INV],D_D[MT],2,D_D[CAT],TA_26,D_D[EP],-1, D_D[LOC],$A19),0)","v":7},{"$f":"IFERROR(SUMIFS(D_D[INV],D_D[MT],7,D_D[CAT],2,D_D[EP],TA_20, D_D[LOC],$A19),0)","v":1}]
["309","Newark",{"$f":"IFERROR(SUMIFS(D_D[INV],D_D[MT],1,D_D[CAT],TA_20,D_D[EP],-1, D_D[LOC],$A20),0)","v":409},{"$f":"IFERROR(SUMIFS(D_D[ADP],D_D[MT],1,D_D[CAT],D$1,D_D[EP],-1, D_D[LOC],$A20),0)","v":38.89},{"$f":"IFERROR(SUMIFS(D_D[INV],D_D[MT],2,D_D[CAT],TA_21,D_D[EP],-1, D_D[LOC],$A20),0)","v":3414},{"$f":"IFERROR(SUMIFS(D_D[BL],D_D[MT],2,D_D[CAT],TA_21,D_D[EP],-1, D_D[LOC],$A20),0)","v":1032},0.30228471001757468,{"$f":"IFERROR(SUMIFS(D_D[INV],D_D[MT],2,D_D[CAT],TA_22,D_D[EP],-1, D_D[LOC],$A20),0)","v":985},{"$f":"IFERROR(SUMIFS(D_D[BL],D_D[MT],2,D_D[CAT],TA_22,D_D[EP],-1, D_D[LOC],$A20),0)","v":134},0.13604060913705585,{"$f":"IFERROR(SUMIFS(D_D[INV],D_D[MT],2,D_D[CAT],TA_23,D_D[EP],-1, D_D[LOC],$A20),0)","v":37},{"$f":"IFERROR(SUMIFS(D_D[BL],D_D[MT],2,D_D[CAT],TA_23,D_D[EP],-1, D_D[LOC],$A20),0)","v":0},0,{"$f":"IFERROR(SUMIFS(D_D[INV],D_D[MT],2,D_D[CAT],TA_24,D_D[EP],-1, D_D[LOC],$A20),0)","v":232},{"$f":"IFERROR(SUMIFS(D_D[BL],D_D[MT],2,D_D[CAT],TA_24,D_D[EP],-1, D_D[LOC],$A20),0)","v":99},0.42672413793103448,{"$f":"IFERROR(SUMIFS(D_D[INV],D_D[MT],2,D_D[CAT],TA_25,D_D[EP],-1, D_D[LOC],$A20),0)","v":23},{"$f":"IFERROR(SUMIFS(D_D[INV],D_D[MT],2,D_D[CAT],TA_26,D_D[EP],-1, D_D[LOC],$A20),0)","v":7},{"$f":"IFERROR(SUMIFS(D_D[INV],D_D[MT],7,D_D[CAT],2,D_D[EP],TA_20, D_D[LOC],$A20),0)","v":3}]
["310","Philadelphia",{"$f":"IFERROR(SUMIFS(D_D[INV],D_D[MT],1,D_D[CAT],TA_20,D_D[EP],-1, D_D[LOC],$A21),0)","v":2846},{"$f":"IFERROR(SUMIFS(D_D[ADP],D_D[MT],1,D_D[CAT],D$1,D_D[EP],-1, D_D[LOC],$A21),0)","v":39.46},{"$f":"IFERROR(SUMIFS(D_D[INV],D_D[MT],2,D_D[CAT],TA_21,D_D[EP],-1, D_D[LOC],$A21),0)","v":9369},{"$f":"IFERROR(SUMIFS(D_D[BL],D_D[MT],2,D_D[CAT],TA_21,D_D[EP],-1, D_D[LOC],$A21),0)","v":2943},0.31412103746397696,{"$f":"IFERROR(SUMIFS(D_D[INV],D_D[MT],2,D_D[CAT],TA_22,D_D[EP],-1, D_D[LOC],$A21),0)","v":8017},{"$f":"IFERROR(SUMIFS(D_D[BL],D_D[MT],2,D_D[CAT],TA_22,D_D[EP],-1, D_D[LOC],$A21),0)","v":4032},0.5029312710490208,{"$f":"IFERROR(SUMIFS(D_D[INV],D_D[MT],2,D_D[CAT],TA_23,D_D[EP],-1, D_D[LOC],$A21),0)","v":141},{"$f":"IFERROR(SUMIFS(D_D[BL],D_D[MT],2,D_D[CAT],TA_23,D_D[EP],-1, D_D[LOC],$A21),0)","v":5},3.5460992907801421E-2,{"$f":"IFERROR(SUMIFS(D_D[INV],D_D[MT],2,D_D[CAT],TA_24,D_D[EP],-1, D_D[LOC],$A21),0)","v":1397},{"$f":"IFERROR(SUMIFS(D_D[BL],D_D[MT],2,D_D[CAT],TA_24,D_D[EP],-1, D_D[LOC],$A21),0)","v":974},0.69720830350751606,{"$f":"IFERROR(SUMIFS(D_D[INV],D_D[MT],2,D_D[CAT],TA_25,D_D[EP],-1, D_D[LOC],$A21),0)","v":898},{"$f":"IFERROR(SUMIFS(D_D[INV],D_D[MT],2,D_D[CAT],TA_26,D_D[EP],-1, D_D[LOC],$A21),0)","v":0},{"$f":"IFERROR(SUMIFS(D_D[INV],D_D[MT],7,D_D[CAT],2,D_D[EP],TA_20, D_D[LOC],$A21),0)","v":8}]
["311","Pittsburgh",{"$f":"IFERROR(SUMIFS(D_D[INV],D_D[MT],1,D_D[CAT],TA_20,D_D[EP],-1, D_D[LOC],$A22),0)","v":677},{"$f":"IFERROR(SUMIFS(D_D[ADP],D_D[MT],1,D_D[CAT],D$1,D_D[EP],-1, D_D[LOC],$A22),0)","v":37.24},{"$f":"IFERROR(SUMIFS(D_D[INV],D_D[MT],2,D_D[CAT],TA_21,D_D[EP],-1, D_D[LOC],$A22),0)","v":6206},{"$f":"IFERROR(SUMIFS(D_D[BL],D_D[MT],2,D_D[CAT],TA_21,D_D[EP],-1, D_D[LOC],$A22),0)","v":2272},0.36609732516919108,{"$f":"IFERROR(SUMIFS(D_D[INV],D_D[MT],2,D_D[CAT],TA_22,D_D[EP],-1, D_D[LOC],$A22),0)","v":1633},{"$f":"IFERROR(SUMIFS(D_D[BL],D_D[MT],2,D_D[CAT],TA_22,D_D[EP],-1, D_D[LOC],$A22),0)","v":178},0.10900183710961421,{"$f":"IFERROR(SUMIFS(D_D[INV],D_D[MT],2,D_D[CAT],TA_23,D_D[EP],-1, D_D[LOC],$A22),0)","v":59},{"$f":"IFERROR(SUMIFS(D_D[BL],D_D[MT],2,D_D[CAT],TA_23,D_D[EP],-1, D_D[LOC],$A22),0)","v":3},5.0847457627118647E-2,{"$f":"IFERROR(SUMIFS(D_D[INV],D_D[MT],2,D_D[CAT],TA_24,D_D[EP],-1, D_D[LOC],$A22),0)","v":366},{"$f":"IFERROR(SUMIFS(D_D[BL],D_D[MT],2,D_D[CAT],TA_24,D_D[EP],-1, D_D[LOC],$A22),0)","v":196},0.53551912568306015,{"$f":"IFERROR(SUMIFS(D_D[INV],D_D[MT],2,D_D[CAT],TA_25,D_D[EP],-1, D_D[LOC],$A22),0)","v":53},{"$f":"IFERROR(SUMIFS(D_D[INV],D_D[MT],2,D_D[CAT],TA_26,D_D[EP],-1, D_D[LOC],$A22),0)","v":0},{"$f":"IFERROR(SUMIFS(D_D[INV],D_D[MT],7,D_D[CAT],2,D_D[EP],TA_20, D_D[LOC],$A22),0)","v":163}]
["304","Providence",{"$f":"IFERROR(SUMIFS(D_D[INV],D_D[MT],1,D_D[CAT],TA_20,D_D[EP],-1, D_D[LOC],$A23),0)","v":577},{"$f":"IFERROR(SUMIFS(D_D[ADP],D_D[MT],1,D_D[CAT],D$1,D_D[EP],-1, D_D[LOC],$A23),0)","v":43.28},{"$f":"IFERROR(SUMIFS(D_D[INV],D_D[MT],2,D_D[CAT],TA_21,D_D[EP],-1, D_D[LOC],$A23),0)","v":2330},{"$f":"IFERROR(SUMIFS(D_D[BL],D_D[MT],2,D_D[CAT],TA_21,D_D[EP],-1, D_D[LOC],$A23),0)","v":607},0.26051502145922745,{"$f":"IFERROR(SUMIFS(D_D[INV],D_D[MT],2,D_D[CAT],TA_22,D_D[EP],-1, D_D[LOC],$A23),0)","v":1176},{"$f":"IFERROR(SUMIFS(D_D[BL],D_D[MT],2,D_D[CAT],TA_22,D_D[EP],-1, D_D[LOC],$A23),0)","v":210},0.17857142857142858,{"$f":"IFERROR(SUMIFS(D_D[INV],D_D[MT],2,D_D[CAT],TA_23,D_D[EP],-1, D_D[LOC],$A23),0)","v":30},{"$f":"IFERROR(SUMIFS(D_D[BL],D_D[MT],2,D_D[CAT],TA_23,D_D[EP],-1, D_D[LOC],$A23),0)","v":0},0,{"$f":"IFERROR(SUMIFS(D_D[INV],D_D[MT],2,D_D[CAT],TA_24,D_D[EP],-1, D_D[LOC],$A23),0)","v":194},{"$f":"IFERROR(SUMIFS(D_D[BL],D_D[MT],2,D_D[CAT],TA_24,D_D[EP],-1, D_D[LOC],$A23),0)","v":112},0.57731958762886593,{"$f":"IFERROR(SUMIFS(D_D[INV],D_D[MT],2,D_D[CAT],TA_25,D_D[EP],-1, D_D[LOC],$A23),0)","v":18},{"$f":"IFERROR(SUMIFS(D_D[INV],D_D[MT],2,D_D[CAT],TA_26,D_D[EP],-1, D_D[LOC],$A23),0)","v":2},{"$f":"IFERROR(SUMIFS(D_D[INV],D_D[MT],7,D_D[CAT],2,D_D[EP],TA_20, D_D[LOC],$A23),0)","v":3}]
["376","St. Louis RMC",{"$f":"IFERROR(SUMIFS(D_D[INV],D_D[MT],1,D_D[CAT],TA_20,D_D[EP],-1, D_D[LOC],$A24),0)","v":2},{"$f":"IFERROR(SUMIFS(D_D[ADP],D_D[MT],1,D_D[CAT],D$1,D_D[EP],-1, D_D[LOC],$A24),0)","v":241},{"$f":"IFERROR(SUMIFS(D_D[INV],D_D[MT],2,D_D[CAT],TA_21,D_D[EP],-1, D_D[LOC],$A24),0)","v":203},{"$f":"IFERROR(SUMIFS(D_D[BL],D_D[MT],2,D_D[CAT],TA_21,D_D[EP],-1, D_D[LOC],$A24),0)","v":202},0.99507389162561577,{"$f":"IFERROR(SUMIFS(D_D[INV],D_D[MT],2,D_D[CAT],TA_22,D_D[EP],-1, D_D[LOC],$A24),0)","v":2},{"$f":"IFERROR(SUMIFS(D_D[BL],D_D[MT],2,D_D[CAT],TA_22,D_D[EP],-1, D_D[LOC],$A24),0)","v":1},0.5,{"$f":"IFERROR(SUMIFS(D_D[INV],D_D[MT],2,D_D[CAT],TA_23,D_D[EP],-1, D_D[LOC],$A24),0)","v":0},{"$f":"IFERROR(SUMIFS(D_D[BL],D_D[MT],2,D_D[CAT],TA_23,D_D[EP],-1, D_D[LOC],$A24),0)","v":0},"0%",{"$f":"IFERROR(SUMIFS(D_D[INV],D_D[MT],2,D_D[CAT],TA_24,D_D[EP],-1, D_D[LOC],$A24),0)","v":17358},{"$f":"IFERROR(SUMIFS(D_D[BL],D_D[MT],2,D_D[CAT],TA_24,D_D[EP],-1, D_D[LOC],$A24),0)","v":961},5.5363521142988821E-2,{"$f":"IFERROR(SUMIFS(D_D[INV],D_D[MT],2,D_D[CAT],TA_25,D_D[EP],-1, D_D[LOC],$A24),0)","v":1},{"$f":"IFERROR(SUMIFS(D_D[INV],D_D[MT],2,D_D[CAT],TA_26,D_D[EP],-1, D_D[LOC],$A24),0)","v":0},{"$f":"IFERROR(SUMIFS(D_D[INV],D_D[MT],7,D_D[CAT],2,D_D[EP],TA_20, D_D[LOC],$A24),0)","v":0}]
["331","St. Louis",{"$f":"IFERROR(SUMIFS(D_D[INV],D_D[MT],1,D_D[CAT],TA_20,D_D[EP],-1, D_D[LOC],$A25),0)","v":1163},{"$f":"IFERROR(SUMIFS(D_D[ADP],D_D[MT],1,D_D[CAT],D$1,D_D[EP],-1, D_D[LOC],$A25),0)","v":55.59},{"$f":"IFERROR(SUMIFS(D_D[INV],D_D[MT],2,D_D[CAT],TA_21,D_D[EP],-1, D_D[LOC],$A25),0)","v":6862},{"$f":"IFERROR(SUMIFS(D_D[BL],D_D[MT],2,D_D[CAT],TA_21,D_D[EP],-1, D_D[LOC],$A25),0)","v":2096},0.30545030603322648,{"$f":"IFERROR(SUMIFS(D_D[INV],D_D[MT],2,D_D[CAT],TA_22,D_D[EP],-1, D_D[LOC],$A25),0)","v":2071},{"$f":"IFERROR(SUMIFS(D_D[BL],D_D[MT],2,D_D[CAT],TA_22,D_D[EP],-1, D_D[LOC],$A25),0)","v":288},0.13906325446644133,{"$f":"IFERROR(SUMIFS(D_D[INV],D_D[MT],2,D_D[CAT],TA_23,D_D[EP],-1, D_D[LOC],$A25),0)","v":101},{"$f":"IFERROR(SUMIFS(D_D[BL],D_D[MT],2,D_D[CAT],TA_23,D_D[EP],-1, D_D[LOC],$A25),0)","v":3},2.9702970297029702E-2,{"$f":"IFERROR(SUMIFS(D_D[INV],D_D[MT],2,D_D[CAT],TA_24,D_D[EP],-1, D_D[LOC],$A25),0)","v":1025},{"$f":"IFERROR(SUMIFS(D_D[BL],D_D[MT],2,D_D[CAT],TA_24,D_D[EP],-1, D_D[LOC],$A25),0)","v":765},0.74634146341463414,{"$f":"IFERROR(SUMIFS(D_D[INV],D_D[MT],2,D_D[CAT],TA_25,D_D[EP],-1, D_D[LOC],$A25),0)","v":79},{"$f":"IFERROR(SUMIFS(D_D[INV],D_D[MT],2,D_D[CAT],TA_26,D_D[EP],-1, D_D[LOC],$A25),0)","v":5},{"$f":"IFERROR(SUMIFS(D_D[INV],D_D[MT],7,D_D[CAT],2,D_D[EP],TA_20, D_D[LOC],$A25),0)","v":5}]
["402","Togus",{"$f":"IFERROR(SUMIFS(D_D[INV],D_D[MT],1,D_D[CAT],TA_20,D_D[EP],-1, D_D[LOC],$A26),0)","v":341},{"$f":"IFERROR(SUMIFS(D_D[ADP],D_D[MT],1,D_D[CAT],D$1,D_D[EP],-1, D_D[LOC],$A26),0)","v":62.91},{"$f":"IFERROR(SUMIFS(D_D[INV],D_D[MT],2,D_D[CAT],TA_21,D_D[EP],-1, D_D[LOC],$A26),0)","v":1635},{"$f":"IFERROR(SUMIFS(D_D[BL],D_D[MT],2,D_D[CAT],TA_21,D_D[EP],-1, D_D[LOC],$A26),0)","v":542},0.33149847094801221,{"$f":"IFERROR(SUMIFS(D_D[INV],D_D[MT],2,D_D[CAT],TA_22,D_D[EP],-1, D_D[LOC],$A26),0)","v":702},{"$f":"IFERROR(SUMIFS(D_D[BL],D_D[MT],2,D_D[CAT],TA_22,D_D[EP],-1, D_D[LOC],$A26),0)","v":119},0.16951566951566951,{"$f":"IFERROR(SUMIFS(D_D[INV],D_D[MT],2,D_D[CAT],TA_23,D_D[EP],-1, D_D[LOC],$A26),0)","v":25},{"$f":"IFERROR(SUMIFS(D_D[BL],D_D[MT],2,D_D[CAT],TA_23,D_D[EP],-1, D_D[LOC],$A26),0)","v":1},0.04,{"$f":"IFERROR(SUMIFS(D_D[INV],D_D[MT],2,D_D[CAT],TA_24,D_D[EP],-1, D_D[LOC],$A26),0)","v":704},{"$f":"IFERROR(SUMIFS(D_D[BL],D_D[MT],2,D_D[CAT],TA_24,D_D[EP],-1, D_D[LOC],$A26),0)","v":599},0.85085227272727271,{"$f":"IFERROR(SUMIFS(D_D[INV],D_D[MT],2,D_D[CAT],TA_25,D_D[EP],-1, D_D[LOC],$A26),0)","v":311},{"$f":"IFERROR(SUMIFS(D_D[INV],D_D[MT],2,D_D[CAT],TA_26,D_D[EP],-1, D_D[LOC],$A26),0)","v":1091},{"$f":"IFERROR(SUMIFS(D_D[INV],D_D[MT],7,D_D[CAT],2,D_D[EP],TA_20, D_D[LOC],$A26),0)","v":0}]
["372","Washington",{"$f":"IFERROR(SUMIFS(D_D[INV],D_D[MT],1,D_D[CAT],TA_20,D_D[EP],-1, D_D[LOC],$A27),0)","v":547},{"$f":"IFERROR(SUMIFS(D_D[ADP],D_D[MT],1,D_D[CAT],D$1,D_D[EP],-1, D_D[LOC],$A27),0)","v":2436.96},{"$f":"IFERROR(SUMIFS(D_D[INV],D_D[MT],2,D_D[CAT],TA_21,D_D[EP],-1, D_D[LOC],$A27),0)","v":217},{"$f":"IFERROR(SUMIFS(D_D[BL],D_D[MT],2,D_D[CAT],TA_21,D_D[EP],-1, D_D[LOC],$A27),0)","v":55},0.25345622119815669,{"$f":"IFERROR(SUMIFS(D_D[INV],D_D[MT],2,D_D[CAT],TA_22,D_D[EP],-1, D_D[LOC],$A27),0)","v":594},{"$f":"IFERROR(SUMIFS(D_D[BL],D_D[MT],2,D_D[CAT],TA_22,D_D[EP],-1, D_D[LOC],$A27),0)","v":14},2.3569023569023569E-2,{"$f":"IFERROR(SUMIFS(D_D[INV],D_D[MT],2,D_D[CAT],TA_23,D_D[EP],-1, D_D[LOC],$A27),0)","v":4},{"$f":"IFERROR(SUMIFS(D_D[BL],D_D[MT],2,D_D[CAT],TA_23,D_D[EP],-1, D_D[LOC],$A27),0)","v":0},0,{"$f":"IFERROR(SUMIFS(D_D[INV],D_D[MT],2,D_D[CAT],TA_24,D_D[EP],-1, D_D[LOC],$A27),0)","v":47},{"$f":"IFERROR(SUMIFS(D_D[BL],D_D[MT],2,D_D[CAT],TA_24,D_D[EP],-1, D_D[LOC],$A27),0)","v":9},0.19148936170212766,{"$f":"IFERROR(SUMIFS(D_D[INV],D_D[MT],2,D_D[CAT],TA_25,D_D[EP],-1, D_D[LOC],$A27),0)","v":1},{"$f":"IFERROR(SUMIFS(D_D[INV],D_D[MT],2,D_D[CAT],TA_26,D_D[EP],-1, D_D[LOC],$A27),0)","v":0},{"$f":"IFERROR(SUMIFS(D_D[INV],D_D[MT],7,D_D[CAT],2,D_D[EP],TA_20, D_D[LOC],$A27),0)","v":0}]
["405","White River Junction",{"$f":"IFERROR(SUMIFS(D_D[INV],D_D[MT],1,D_D[CAT],TA_20,D_D[EP],-1, D_D[LOC],$A28),0)","v":61},{"$f":"IFERROR(SUMIFS(D_D[ADP],D_D[MT],1,D_D[CAT],D$1,D_D[EP],-1, D_D[LOC],$A28),0)","v":36.1},{"$f":"IFERROR(SUMIFS(D_D[INV],D_D[MT],2,D_D[CAT],TA_21,D_D[EP],-1, D_D[LOC],$A28),0)","v":397},{"$f":"IFERROR(SUMIFS(D_D[BL],D_D[MT],2,D_D[CAT],TA_21,D_D[EP],-1, D_D[LOC],$A28),0)","v":129},0.32493702770780858,{"$f":"IFERROR(SUMIFS(D_D[INV],D_D[MT],2,D_D[CAT],TA_22,D_D[EP],-1, D_D[LOC],$A28),0)","v":177},{"$f":"IFERROR(SUMIFS(D_D[BL],D_D[MT],2,D_D[CAT],TA_22,D_D[EP],-1, D_D[LOC],$A28),0)","v":25},0.14124293785310735,{"$f":"IFERROR(SUMIFS(D_D[INV],D_D[MT],2,D_D[CAT],TA_23,D_D[EP],-1, D_D[LOC],$A28),0)","v":3},{"$f":"IFERROR(SUMIFS(D_D[BL],D_D[MT],2,D_D[CAT],TA_23,D_D[EP],-1, D_D[LOC],$A28),0)","v":0},0,{"$f":"IFERROR(SUMIFS(D_D[INV],D_D[MT],2,D_D[CAT],TA_24,D_D[EP],-1, D_D[LOC],$A28),0)","v":27},{"$f":"IFERROR(SUMIFS(D_D[BL],D_D[MT],2,D_D[CAT],TA_24,D_D[EP],-1, D_D[LOC],$A28),0)","v":17},0.62962962962962965,{"$f":"IFERROR(SUMIFS(D_D[INV],D_D[MT],2,D_D[CAT],TA_25,D_D[EP],-1, D_D[LOC],$A28),0)","v":3},{"$f":"IFERROR(SUMIFS(D_D[INV],D_D[MT],2,D_D[CAT],TA_26,D_D[EP],-1, D_D[LOC],$A28),0)","v":2},{"$f":"IFERROR(SUMIFS(D_D[INV],D_D[MT],7,D_D[CAT],2,D_D[EP],TA_20, D_D[LOC],$A28),0)","v":0}]
["460","Wilmington",{"$f":"IFERROR(SUMIFS(D_D[INV],D_D[MT],1,D_D[CAT],TA_20,D_D[EP],-1, D_D[LOC],$A29),0)","v":123},{"$f":"IFERROR(SUMIFS(D_D[ADP],D_D[MT],1,D_D[CAT],D$1,D_D[EP],-1, D_D[LOC],$A29),0)","v":28.62},{"$f":"IFERROR(SUMIFS(D_D[INV],D_D[MT],2,D_D[CAT],TA_21,D_D[EP],-1, D_D[LOC],$A29),0)","v":981},{"$f":"IFERROR(SUMIFS(D_D[BL],D_D[MT],2,D_D[CAT],TA_21,D_D[EP],-1, D_D[LOC],$A29),0)","v":260},0.2650356778797146,{"$f":"IFERROR(SUMIFS(D_D[INV],D_D[MT],2,D_D[CAT],TA_22,D_D[EP],-1, D_D[LOC],$A29),0)","v":276},{"$f":"IFERROR(SUMIFS(D_D[BL],D_D[MT],2,D_D[CAT],TA_22,D_D[EP],-1, D_D[LOC],$A29),0)","v":22},7.9710144927536225E-2,{"$f":"IFERROR(SUMIFS(D_D[INV],D_D[MT],2,D_D[CAT],TA_23,D_D[EP],-1, D_D[LOC],$A29),0)","v":14},{"$f":"IFERROR(SUMIFS(D_D[BL],D_D[MT],2,D_D[CAT],TA_23,D_D[EP],-1, D_D[LOC],$A29),0)","v":1},7.1428571428571425E-2,{"$f":"IFERROR(SUMIFS(D_D[INV],D_D[MT],2,D_D[CAT],TA_24,D_D[EP],-1, D_D[LOC],$A29),0)","v":45},{"$f":"IFERROR(SUMIFS(D_D[BL],D_D[MT],2,D_D[CAT],TA_24,D_D[EP],-1, D_D[LOC],$A29),0)","v":30},0.66666666666666663,{"$f":"IFERROR(SUMIFS(D_D[INV],D_D[MT],2,D_D[CAT],TA_25,D_D[EP],-1, D_D[LOC],$A29),0)","v":8},{"$f":"IFERROR(SUMIFS(D_D[INV],D_D[MT],2,D_D[CAT],TA_26,D_D[EP],-1, D_D[LOC],$A29),0)","v":1},{"$f":"IFERROR(SUMIFS(D_D[INV],D_D[MT],7,D_D[CAT],2,D_D[EP],TA_20, D_D[LOC],$A29),0)","v":0}]
[393,"Southeast",{"$f":"IFERROR(SUMIFS(D_D[INV],D_D[MT],1,D_D[CAT],TA_20,D_D[EP],-1, D_D[LOC],$A30),0)","v":25293},{"$f":"IFERROR(SUMIFS(D_D[ADP],D_D[MT],1,D_D[CAT],D$1,D_D[EP],-1, D_D[LOC],$A30),0)","v":46.97},{"$f":"IFERROR(SUMIFS(D_D[INV],D_D[MT],2,D_D[CAT],TA_21,D_D[EP],-1, D_D[LOC],$A30),0)","v":135124},{"$f":"IFERROR(SUMIFS(D_D[BL],D_D[MT],2,D_D[CAT],TA_21,D_D[EP],-1, D_D[LOC],$A30),0)","v":37754},0.27940262277611677,{"$f":"IFERROR(SUMIFS(D_D[INV],D_D[MT],2,D_D[CAT],TA_22,D_D[EP],-1, D_D[LOC],$A30),0)","v":54577},{"$f":"IFERROR(SUMIFS(D_D[BL],D_D[MT],2,D_D[CAT],TA_22,D_D[EP],-1, D_D[LOC],$A30),0)","v":8899},0.16305403375048097,{"$f":"IFERROR(SUMIFS(D_D[INV],D_D[MT],2,D_D[CAT],TA_23,D_D[EP],-1, D_D[LOC],$A30),0)","v":1841},{"$f":"IFERROR(SUMIFS(D_D[BL],D_D[MT],2,D_D[CAT],TA_23,D_D[EP],-1, D_D[LOC],$A30),0)","v":229},0.12438891906572515,{"$f":"IFERROR(SUMIFS(D_D[INV],D_D[MT],2,D_D[CAT],TA_24,D_D[EP],-1, D_D[LOC],$A30),0)","v":13831},{"$f":"IFERROR(SUMIFS(D_D[BL],D_D[MT],2,D_D[CAT],TA_24,D_D[EP],-1, D_D[LOC],$A30),0)","v":7224},0.52230496710288488,{"$f":"IFERROR(SUMIFS(D_D[INV],D_D[MT],2,D_D[CAT],TA_25,D_D[EP],-1, D_D[LOC],$A30),0)","v":1194},{"$f":"IFERROR(SUMIFS(D_D[INV],D_D[MT],2,D_D[CAT],TA_26,D_D[EP],-1, D_D[LOC],$A30),0)","v":495},{"$f":"IFERROR(SUMIFS(D_D[INV],D_D[MT],7,D_D[CAT],2,D_D[EP],TA_20, D_D[LOC],$A30),0)","v":551}]
["316","Atlanta",{"$f":"IFERROR(SUMIFS(D_D[INV],D_D[MT],1,D_D[CAT],TA_20,D_D[EP],-1, D_D[LOC],$A31),0)","v":2246},{"$f":"IFERROR(SUMIFS(D_D[ADP],D_D[MT],1,D_D[CAT],D$1,D_D[EP],-1, D_D[LOC],$A31),0)","v":46.2},{"$f":"IFERROR(SUMIFS(D_D[INV],D_D[MT],2,D_D[CAT],TA_21,D_D[EP],-1, D_D[LOC],$A31),0)","v":18700},{"$f":"IFERROR(SUMIFS(D_D[BL],D_D[MT],2,D_D[CAT],TA_21,D_D[EP],-1, D_D[LOC],$A31),0)","v":4914},0.26278074866310158,{"$f":"IFERROR(SUMIFS(D_D[INV],D_D[MT],2,D_D[CAT],TA_22,D_D[EP],-1, D_D[LOC],$A31),0)","v":4249},{"$f":"IFERROR(SUMIFS(D_D[BL],D_D[MT],2,D_D[CAT],TA_22,D_D[EP],-1, D_D[LOC],$A31),0)","v":531},0.12497058131325017,{"$f":"IFERROR(SUMIFS(D_D[INV],D_D[MT],2,D_D[CAT],TA_23,D_D[EP],-1, D_D[LOC],$A31),0)","v":136},{"$f":"IFERROR(SUMIFS(D_D[BL],D_D[MT],2,D_D[CAT],TA_23,D_D[EP],-1, D_D[LOC],$A31),0)","v":2},1.4705882352941176E-2,{"$f":"IFERROR(SUMIFS(D_D[INV],D_D[MT],2,D_D[CAT],TA_24,D_D[EP],-1, D_D[LOC],$A31),0)","v":1077},{"$f":"IFERROR(SUMIFS(D_D[BL],D_D[MT],2,D_D[CAT],TA_24,D_D[EP],-1, D_D[LOC],$A31),0)","v":463},0.4298978644382544,{"$f":"IFERROR(SUMIFS(D_D[INV],D_D[MT],2,D_D[CAT],TA_25,D_D[EP],-1, D_D[LOC],$A31),0)","v":107},{"$f":"IFERROR(SUMIFS(D_D[INV],D_D[MT],2,D_D[CAT],TA_26,D_D[EP],-1, D_D[LOC],$A31),0)","v":1},{"$f":"IFERROR(SUMIFS(D_D[INV],D_D[MT],7,D_D[CAT],2,D_D[EP],TA_20, D_D[LOC],$A31),0)","v":6}]
["319","Columbia",{"$f":"IFERROR(SUMIFS(D_D[INV],D_D[MT],1,D_D[CAT],TA_20,D_D[EP],-1, D_D[LOC],$A32),0)","v":3742},{"$f":"IFERROR(SUMIFS(D_D[ADP],D_D[MT],1,D_D[CAT],D$1,D_D[EP],-1, D_D[LOC],$A32),0)","v":47.17},{"$f":"IFERROR(SUMIFS(D_D[INV],D_D[MT],2,D_D[CAT],TA_21,D_D[EP],-1, D_D[LOC],$A32),0)","v":9522},{"$f":"IFERROR(SUMIFS(D_D[BL],D_D[MT],2,D_D[CAT],TA_21,D_D[EP],-1, D_D[LOC],$A32),0)","v":2576},{"$f":"IFERROR(F32/E32,\"0%\")","v":0.27053140096618356},{"$f":"IFERROR(SUMIFS(D_D[INV],D_D[MT],2,D_D[CAT],TA_22,D_D[EP],-1, D_D[LOC],$A32),0)","v":5210},{"$f":"IFERROR(SUMIFS(D_D[BL],D_D[MT],2,D_D[CAT],TA_22,D_D[EP],-1, D_D[LOC],$A32),0)","v":589},{"$f":"IFERROR(I32/H32,\"0%\")","v":0.11305182341650671},{"$f":"IFERROR(SUMIFS(D_D[INV],D_D[MT],2,D_D[CAT],TA_23,D_D[EP],-1, D_D[LOC],$A32),0)","v":126},{"$f":"IFERROR(SUMIFS(D_D[BL],D_D[MT],2,D_D[CAT],TA_23,D_D[EP],-1, D_D[LOC],$A32),0)","v":3},{"$f":"IFERROR(L32/K32,\"0%\")","v":2.3809523809523808E-2},{"$f":"IFERROR(SUMIFS(D_D[INV],D_D[MT],2,D_D[CAT],TA_24,D_D[EP],-1, D_D[LOC],$A32),0)","v":894},{"$f":"IFERROR(SUMIFS(D_D[BL],D_D[MT],2,D_D[CAT],TA_24,D_D[EP],-1, D_D[LOC],$A32),0)","v":318},{"$f":"IFERROR(O32/N32,\"0%\")","v":0.35570469798657717},{"$f":"IFERROR(SUMIFS(D_D[INV],D_D[MT],2,D_D[CAT],TA_25,D_D[EP],-1, D_D[LOC],$A32),0)","v":68},{"$f":"IFERROR(SUMIFS(D_D[INV],D_D[MT],2,D_D[CAT],TA_26,D_D[EP],-1, D_D[LOC],$A32),0)","v":8},{"$f":"IFERROR(SUMIFS(D_D[INV],D_D[MT],7,D_D[CAT],2,D_D[EP],TA_20, D_D[LOC],$A32),0)","v":3}]
[315,"Huntington",{"$f":"IFERROR(SUMIFS(D_D[INV],D_D[MT],1,D_D[CAT],TA_20,D_D[EP],-1, D_D[LOC],$A33),0)","v":358},{"$f":"IFERROR(SUMIFS(D_D[ADP],D_D[MT],1,D_D[CAT],D$1,D_D[EP],-1, D_D[LOC],$A33),0)","v":50.78},{"$f":"IFERROR(SUMIFS(D_D[INV],D_D[MT],2,D_D[CAT],TA_21,D_D[EP],-1, D_D[LOC],$A33),0)","v":2283},{"$f":"IFERROR(SUMIFS(D_D[BL],D_D[MT],2,D_D[CAT],TA_21,D_D[EP],-1, D_D[LOC],$A33),0)","v":673},0.29478756022777047,{"$f":"IFERROR(SUMIFS(D_D[INV],D_D[MT],2,D_D[CAT],TA_22,D_D[EP],-1, D_D[LOC],$A33),0)","v":763},{"$f":"IFERROR(SUMIFS(D_D[BL],D_D[MT],2,D_D[CAT],TA_22,D_D[EP],-1, D_D[LOC],$A33),0)","v":129},0.1690694626474443,{"$f":"IFERROR(SUMIFS(D_D[INV],D_D[MT],2,D_D[CAT],TA_23,D_D[EP],-1, D_D[LOC],$A33),0)","v":45},{"$f":"IFERROR(SUMIFS(D_D[BL],D_D[MT],2,D_D[CAT],TA_23,D_D[EP],-1, D_D[LOC],$A33),0)","v":1},2.2222222222222223E-2,{"$f":"IFERROR(SUMIFS(D_D[INV],D_D[MT],2,D_D[CAT],TA_24,D_D[EP],-1, D_D[LOC],$A33),0)","v":661},{"$f":"IFERROR(SUMIFS(D_D[BL],D_D[MT],2,D_D[CAT],TA_24,D_D[EP],-1, D_D[LOC],$A33),0)","v":590},0.89258698940998482,{"$f":"IFERROR(SUMIFS(D_D[INV],D_D[MT],2,D_D[CAT],TA_25,D_D[EP],-1, D_D[LOC],$A33),0)","v":68},{"$f":"IFERROR(SUMIFS(D_D[INV],D_D[MT],2,D_D[CAT],TA_26,D_D[EP],-1, D_D[LOC],$A33),0)","v":399},{"$f":"IFERROR(SUMIFS(D_D[INV],D_D[MT],7,D_D[CAT],2,D_D[EP],TA_20, D_D[LOC],$A33),0)","v":2}]
["323","Jackson",{"$f":"IFERROR(SUMIFS(D_D[INV],D_D[MT],1,D_D[CAT],TA_20,D_D[EP],-1, D_D[LOC],$A34),0)","v":803},{"$f":"IFERROR(SUMIFS(D_D[ADP],D_D[MT],1,D_D[CAT],D$1,D_D[EP],-1, D_D[LOC],$A34),0)","v":52.62},{"$f":"IFERROR(SUMIFS(D_D[INV],D_D[MT],2,D_D[CAT],TA_21,D_D[EP],-1, D_D[LOC],$A34),0)","v":4747},{"$f":"IFERROR(SUMIFS(D_D[BL],D_D[MT],2,D_D[CAT],TA_21,D_D[EP],-1, D_D[LOC],$A34),0)","v":1328},0.27975563513798191,{"$f":"IFERROR(SUMIFS(D_D[INV],D_D[MT],2,D_D[CAT],TA_22,D_D[EP],-1, D_D[LOC],$A34),0)","v":1550},{"$f":"IFERROR(SUMIFS(D_D[BL],D_D[MT],2,D_D[CAT],TA_22,D_D[EP],-1, D_D[LOC],$A34),0)","v":181},0.1167741935483871,{"$f":"IFERROR(SUMIFS(D_D[INV],D_D[MT],2,D_D[CAT],TA_23,D_D[EP],-1, D_D[LOC],$A34),0)","v":35},{"$f":"IFERROR(SUMIFS(D_D[BL],D_D[MT],2,D_D[CAT],TA_23,D_D[EP],-1, D_D[LOC],$A34),0)","v":2},5.7142857142857141E-2,{"$f":"IFERROR(SUMIFS(D_D[INV],D_D[MT],2,D_D[CAT],TA_24,D_D[EP],-1, D_D[LOC],$A34),0)","v":393},{"$f":"IFERROR(SUMIFS(D_D[BL],D_D[MT],2,D_D[CAT],TA_24,D_D[EP],-1, D_D[LOC],$A34),0)","v":149},0.37913486005089059,{"$f":"IFERROR(SUMIFS(D_D[INV],D_D[MT],2,D_D[CAT],TA_25,D_D[EP],-1, D_D[LOC],$A34),0)","v":42},{"$f":"IFERROR(SUMIFS(D_D[INV],D_D[MT],2,D_D[CAT],TA_26,D_D[EP],-1, D_D[LOC],$A34),0)","v":1},{"$f":"IFERROR(SUMIFS(D_D[INV],D_D[MT],7,D_D[CAT],2,D_D[EP],TA_20, D_D[LOC],$A34),0)","v":226}]
["350","Little Rock",{"$f":"IFERROR(SUMIFS(D_D[INV],D_D[MT],1,D_D[CAT],TA_20,D_D[EP],-1, D_D[LOC],$A35),0)","v":812},{"$f":"IFERROR(SUMIFS(D_D[ADP],D_D[MT],1,D_D[CAT],D$1,D_D[EP],-1, D_D[LOC],$A35),0)","v":61.39},{"$f":"IFERROR(SUMIFS(D_D[INV],D_D[MT],2,D_D[CAT],TA_21,D_D[EP],-1, D_D[LOC],$A35),0)","v":4114},{"$f":"IFERROR(SUMIFS(D_D[BL],D_D[MT],2,D_D[CAT],TA_21,D_D[EP],-1, D_D[LOC],$A35),0)","v":1267},0.30797277588721439,{"$f":"IFERROR(SUMIFS(D_D[INV],D_D[MT],2,D_D[CAT],TA_22,D_D[EP],-1, D_D[LOC],$A35),0)","v":2969},{"$f":"IFERROR(SUMIFS(D_D[BL],D_D[MT],2,D_D[CAT],TA_22,D_D[EP],-1, D_D[LOC],$A35),0)","v":788},0.26540922869653083,{"$f":"IFERROR(SUMIFS(D_D[INV],D_D[MT],2,D_D[CAT],TA_23,D_D[EP],-1, D_D[LOC],$A35),0)","v":66},{"$f":"IFERROR(SUMIFS(D_D[BL],D_D[MT],2,D_D[CAT],TA_23,D_D[EP],-1, D_D[LOC],$A35),0)","v":5},7.575757575757576E-2,{"$f":"IFERROR(SUMIFS(D_D[INV],D_D[MT],2,D_D[CAT],TA_24,D_D[EP],-1, D_D[LOC],$A35),0)","v":435},{"$f":"IFERROR(SUMIFS(D_D[BL],D_D[MT],2,D_D[CAT],TA_24,D_D[EP],-1, D_D[LOC],$A35),0)","v":233},0.53563218390804601,{"$f":"IFERROR(SUMIFS(D_D[INV],D_D[MT],2,D_D[CAT],TA_25,D_D[EP],-1, D_D[LOC],$A35),0)","v":47},{"$f":"IFERROR(SUMIFS(D_D[INV],D_D[MT],2,D_D[CAT],TA_26,D_D[EP],-1, D_D[LOC],$A35),0)","v":3},{"$f":"IFERROR(SUMIFS(D_D[INV],D_D[MT],7,D_D[CAT],2,D_D[EP],TA_20, D_D[LOC],$A35),0)","v":2}]
["327","Louisville",{"$f":"IFERROR(SUMIFS(D_D[INV],D_D[MT],1,D_D[CAT],TA_20,D_D[EP],-1, D_D[LOC],$A36),0)","v":3189},{"$f":"IFERROR(SUMIFS(D_D[ADP],D_D[MT],1,D_D[CAT],D$1,D_D[EP],-1, D_D[LOC],$A36),0)","v":57.77},{"$f":"IFERROR(SUMIFS(D_D[INV],D_D[MT],2,D_D[CAT],TA_21,D_D[EP],-1, D_D[LOC],$A36),0)","v":4816},{"$f":"IFERROR(SUMIFS(D_D[BL],D_D[MT],2,D_D[CAT],TA_21,D_D[EP],-1, D_D[LOC],$A36),0)","v":1465},0.30419435215946844,{"$f":"IFERROR(SUMIFS(D_D[INV],D_D[MT],2,D_D[CAT],TA_22,D_D[EP],-1, D_D[LOC],$A36),0)","v":4177},{"$f":"IFERROR(SUMIFS(D_D[BL],D_D[MT],2,D_D[CAT],TA_22,D_D[EP],-1, D_D[LOC],$A36),0)","v":484},0.11587263586305961,{"$f":"IFERROR(SUMIFS(D_D[INV],D_D[MT],2,D_D[CAT],TA_23,D_D[EP],-1, D_D[LOC],$A36),0)","v":324},{"$f":"IFERROR(SUMIFS(D_D[BL],D_D[MT],2,D_D[CAT],TA_23,D_D[EP],-1, D_D[LOC],$A36),0)","v":186},0.57407407407407407,{"$f":"IFERROR(SUMIFS(D_D[INV],D_D[MT],2,D_D[CAT],TA_24,D_D[EP],-1, D_D[LOC],$A36),0)","v":421},{"$f":"IFERROR(SUMIFS(D_D[BL],D_D[MT],2,D_D[CAT],TA_24,D_D[EP],-1, D_D[LOC],$A36),0)","v":245},0.58194774346793354,{"$f":"IFERROR(SUMIFS(D_D[INV],D_D[MT],2,D_D[CAT],TA_25,D_D[EP],-1, D_D[LOC],$A36),0)","v":32},{"$f":"IFERROR(SUMIFS(D_D[INV],D_D[MT],2,D_D[CAT],TA_26,D_D[EP],-1, D_D[LOC],$A36),0)","v":9},{"$f":"IFERROR(SUMIFS(D_D[INV],D_D[MT],7,D_D[CAT],2,D_D[EP],TA_20, D_D[LOC],$A36),0)","v":264}]
["322","Montgomery",{"$f":"IFERROR(SUMIFS(D_D[INV],D_D[MT],1,D_D[CAT],TA_20,D_D[EP],-1, D_D[LOC],$A37),0)","v":1152},{"$f":"IFERROR(SUMIFS(D_D[ADP],D_D[MT],1,D_D[CAT],D$1,D_D[EP],-1, D_D[LOC],$A37),0)","v":37.06},{"$f":"IFERROR(SUMIFS(D_D[INV],D_D[MT],2,D_D[CAT],TA_21,D_D[EP],-1, D_D[LOC],$A37),0)","v":8061},{"$f":"IFERROR(SUMIFS(D_D[BL],D_D[MT],2,D_D[CAT],TA_21,D_D[EP],-1, D_D[LOC],$A37),0)","v":2139},0.2653516933382955,{"$f":"IFERROR(SUMIFS(D_D[INV],D_D[MT],2,D_D[CAT],TA_22,D_D[EP],-1, D_D[LOC],$A37),0)","v":2152},{"$f":"IFERROR(SUMIFS(D_D[BL],D_D[MT],2,D_D[CAT],TA_22,D_D[EP],-1, D_D[LOC],$A37),0)","v":232},0.10780669144981413,{"$f":"IFERROR(SUMIFS(D_D[INV],D_D[MT],2,D_D[CAT],TA_23,D_D[EP],-1, D_D[LOC],$A37),0)","v":75},{"$f":"IFERROR(SUMIFS(D_D[BL],D_D[MT],2,D_D[CAT],TA_23,D_D[EP],-1, D_D[LOC],$A37),0)","v":1},1.3333333333333334E-2,{"$f":"IFERROR(SUMIFS(D_D[INV],D_D[MT],2,D_D[CAT],TA_24,D_D[EP],-1, D_D[LOC],$A37),0)","v":429},{"$f":"IFERROR(SUMIFS(D_D[BL],D_D[MT],2,D_D[CAT],TA_24,D_D[EP],-1, D_D[LOC],$A37),0)","v":195},0.45454545454545453,{"$f":"IFERROR(SUMIFS(D_D[INV],D_D[MT],2,D_D[CAT],TA_25,D_D[EP],-1, D_D[LOC],$A37),0)","v":111},{"$f":"IFERROR(SUMIFS(D_D[INV],D_D[MT],2,D_D[CAT],TA_26,D_D[EP],-1, D_D[LOC],$A37),0)","v":4},{"$f":"IFERROR(SUMIFS(D_D[INV],D_D[MT],7,D_D[CAT],2,D_D[EP],TA_20, D_D[LOC],$A37),0)","v":2}]
["320","Nashville",{"$f":"IFERROR(SUMIFS(D_D[INV],D_D[MT],1,D_D[CAT],TA_20,D_D[EP],-1, D_D[LOC],$A38),0)","v":1890},{"$f":"IFERROR(SUMIFS(D_D[ADP],D_D[MT],1,D_D[CAT],D$1,D_D[EP],-1, D_D[LOC],$A38),0)","v":58.59},{"$f":"IFERROR(SUMIFS(D_D[INV],D_D[MT],2,D_D[CAT],TA_21,D_D[EP],-1, D_D[LOC],$A38),0)","v":9361},{"$f":"IFERROR(SUMIFS(D_D[BL],D_D[MT],2,D_D[CAT],TA_21,D_D[EP],-1, D_D[LOC],$A38),0)","v":2666},0.28479863262471961,{"$f":"IFERROR(SUMIFS(D_D[INV],D_D[MT],2,D_D[CAT],TA_22,D_D[EP],-1, D_D[LOC],$A38),0)","v":8355},{"$f":"IFERROR(SUMIFS(D_D[BL],D_D[MT],2,D_D[CAT],TA_22,D_D[EP],-1, D_D[LOC],$A38),0)","v":2056},0.24608019150209456,{"$f":"IFERROR(SUMIFS(D_D[INV],D_D[MT],2,D_D[CAT],TA_23,D_D[EP],-1, D_D[LOC],$A38),0)","v":139},{"$f":"IFERROR(SUMIFS(D_D[BL],D_D[MT],2,D_D[CAT],TA_23,D_D[EP],-1, D_D[LOC],$A38),0)","v":6},4.3165467625899283E-2,{"$f":"IFERROR(SUMIFS(D_D[INV],D_D[MT],2,D_D[CAT],TA_24,D_D[EP],-1, D_D[LOC],$A38),0)","v":789},{"$f":"IFERROR(SUMIFS(D_D[BL],D_D[MT],2,D_D[CAT],TA_24,D_D[EP],-1, D_D[LOC],$A38),0)","v":407},0.51584283903675543,{"$f":"IFERROR(SUMIFS(D_D[INV],D_D[MT],2,D_D[CAT],TA_25,D_D[EP],-1, D_D[LOC],$A38),0)","v":95},{"$f":"IFERROR(SUMIFS(D_D[INV],D_D[MT],2,D_D[CAT],TA_26,D_D[EP],-1, D_D[LOC],$A38),0)","v":4},{"$f":"IFERROR(SUMIFS(D_D[INV],D_D[MT],7,D_D[CAT],2,D_D[EP],TA_20, D_D[LOC],$A38),0)","v":3}]
["321","New Orleans",{"$f":"IFERROR(SUMIFS(D_D[INV],D_D[MT],1,D_D[CAT],TA_20,D_D[EP],-1, D_D[LOC],$A39),0)","v":764},{"$f":"IFERROR(SUMIFS(D_D[ADP],D_D[MT],1,D_D[CAT],D$1,D_D[EP],-1, D_D[LOC],$A39),0)","v":37.14},{"$f":"IFERROR(SUMIFS(D_D[INV],D_D[MT],2,D_D[CAT],TA_21,D_D[EP],-1, D_D[LOC],$A39),0)","v":6279},{"$f":"IFERROR(SUMIFS(D_D[BL],D_D[MT],2,D_D[CAT],TA_21,D_D[EP],-1, D_D[LOC],$A39),0)","v":1646},0.26214365344800128,{"$f":"IFERROR(SUMIFS(D_D[INV],D_D[MT],2,D_D[CAT],TA_22,D_D[EP],-1, D_D[LOC],$A39),0)","v":1593},{"$f":"IFERROR(SUMIFS(D_D[BL],D_D[MT],2,D_D[CAT],TA_22,D_D[EP],-1, D_D[LOC],$A39),0)","v":171},0.10734463276836158,{"$f":"IFERROR(SUMIFS(D_D[INV],D_D[MT],2,D_D[CAT],TA_23,D_D[EP],-1, D_D[LOC],$A39),0)","v":50},{"$f":"IFERROR(SUMIFS(D_D[BL],D_D[MT],2,D_D[CAT],TA_23,D_D[EP],-1, D_D[LOC],$A39),0)","v":2},0.04,{"$f":"IFERROR(SUMIFS(D_D[INV],D_D[MT],2,D_D[CAT],TA_24,D_D[EP],-1, D_D[LOC],$A39),0)","v":322},{"$f":"IFERROR(SUMIFS(D_D[BL],D_D[MT],2,D_D[CAT],TA_24,D_D[EP],-1, D_D[LOC],$A39),0)","v":149},0.46273291925465837,{"$f":"IFERROR(SUMIFS(D_D[INV],D_D[MT],2,D_D[CAT],TA_25,D_D[EP],-1, D_D[LOC],$A39),0)","v":58},{"$f":"IFERROR(SUMIFS(D_D[INV],D_D[MT],2,D_D[CAT],TA_26,D_D[EP],-1, D_D[LOC],$A39),0)","v":2},{"$f":"IFERROR(SUMIFS(D_D[INV],D_D[MT],7,D_D[CAT],2,D_D[EP],TA_20, D_D[LOC],$A39),0)","v":7}]
["314","Roanoke",{"$f":"IFERROR(SUMIFS(D_D[INV],D_D[MT],1,D_D[CAT],TA_20,D_D[EP],-1, D_D[LOC],$A40),0)","v":2478},{"$f":"IFERROR(SUMIFS(D_D[ADP],D_D[MT],1,D_D[CAT],D$1,D_D[EP],-1, D_D[LOC],$A40),0)","v":34.270000000000003},{"$f":"IFERROR(SUMIFS(D_D[INV],D_D[MT],2,D_D[CAT],TA_21,D_D[EP],-1, D_D[LOC],$A40),0)","v":16685},{"$f":"IFERROR(SUMIFS(D_D[BL],D_D[MT],2,D_D[CAT],TA_21,D_D[EP],-1, D_D[LOC],$A40),0)","v":4588},0.2749775247228049,{"$f":"IFERROR(SUMIFS(D_D[INV],D_D[MT],2,D_D[CAT],TA_22,D_D[EP],-1, D_D[LOC],$A40),0)","v":4072},{"$f":"IFERROR(SUMIFS(D_D[BL],D_D[MT],2,D_D[CAT],TA_22,D_D[EP],-1, D_D[LOC],$A40),0)","v":373},9.1601178781925349E-2,{"$f":"IFERROR(SUMIFS(D_D[INV],D_D[MT],2,D_D[CAT],TA_23,D_D[EP],-1, D_D[LOC],$A40),0)","v":168},{"$f":"IFERROR(SUMIFS(D_D[BL],D_D[MT],2,D_D[CAT],TA_23,D_D[EP],-1, D_D[LOC],$A40),0)","v":1},5.9523809523809521E-3,{"$f":"IFERROR(SUMIFS(D_D[INV],D_D[MT],2,D_D[CAT],TA_24,D_D[EP],-1, D_D[LOC],$A40),0)","v":1649},{"$f":"IFERROR(SUMIFS(D_D[BL],D_D[MT],2,D_D[CAT],TA_24,D_D[EP],-1, D_D[LOC],$A40),0)","v":1134},0.687689508793208,{"$f":"IFERROR(SUMIFS(D_D[INV],D_D[MT],2,D_D[CAT],TA_25,D_D[EP],-1, D_D[LOC],$A40),0)","v":100},{"$f":"IFERROR(SUMIFS(D_D[INV],D_D[MT],2,D_D[CAT],TA_26,D_D[EP],-1, D_D[LOC],$A40),0)","v":5},{"$f":"IFERROR(SUMIFS(D_D[INV],D_D[MT],7,D_D[CAT],2,D_D[EP],TA_20, D_D[LOC],$A40),0)","v":5}]
["355","San Juan",{"$f":"IFERROR(SUMIFS(D_D[INV],D_D[MT],1,D_D[CAT],TA_20,D_D[EP],-1, D_D[LOC],$A41),0)","v":548},{"$f":"IFERROR(SUMIFS(D_D[ADP],D_D[MT],1,D_D[CAT],D$1,D_D[EP],-1, D_D[LOC],$A41),0)","v":43.59},{"$f":"IFERROR(SUMIFS(D_D[INV],D_D[MT],2,D_D[CAT],TA_21,D_D[EP],-1, D_D[LOC],$A41),0)","v":2139},{"$f":"IFERROR(SUMIFS(D_D[BL],D_D[MT],2,D_D[CAT],TA_21,D_D[EP],-1, D_D[LOC],$A41),0)","v":634},0.29640018700327253,{"$f":"IFERROR(SUMIFS(D_D[INV],D_D[MT],2,D_D[CAT],TA_22,D_D[EP],-1, D_D[LOC],$A41),0)","v":1446},{"$f":"IFERROR(SUMIFS(D_D[BL],D_D[MT],2,D_D[CAT],TA_22,D_D[EP],-1, D_D[LOC],$A41),0)","v":85},5.8782849239280774E-2,{"$f":"IFERROR(SUMIFS(D_D[INV],D_D[MT],2,D_D[CAT],TA_23,D_D[EP],-1, D_D[LOC],$A41),0)","v":33},{"$f":"IFERROR(SUMIFS(D_D[BL],D_D[MT],2,D_D[CAT],TA_23,D_D[EP],-1, D_D[LOC],$A41),0)","v":1},3.0303030303030304E-2,{"$f":"IFERROR(SUMIFS(D_D[INV],D_D[MT],2,D_D[CAT],TA_24,D_D[EP],-1, D_D[LOC],$A41),0)","v":221},{"$f":"IFERROR(SUMIFS(D_D[BL],D_D[MT],2,D_D[CAT],TA_24,D_D[EP],-1, D_D[LOC],$A41),0)","v":85},0.38461538461538464,{"$f":"IFERROR(SUMIFS(D_D[INV],D_D[MT],2,D_D[CAT],TA_25,D_D[EP],-1, D_D[LOC],$A41),0)","v":28},{"$f":"IFERROR(SUMIFS(D_D[INV],D_D[MT],2,D_D[CAT],TA_26,D_D[EP],-1, D_D[LOC],$A41),0)","v":2},{"$f":"IFERROR(SUMIFS(D_D[INV],D_D[MT],7,D_D[CAT],2,D_D[EP],TA_20, D_D[LOC],$A41),0)","v":12}]
["317","St. Petersburg",{"$f":"IFERROR(SUMIFS(D_D[INV],D_D[MT],1,D_D[CAT],TA_20,D_D[EP],-1, D_D[LOC],$A42),0)","v":3977},{"$f":"IFERROR(SUMIFS(D_D[ADP],D_D[MT],1,D_D[CAT],D$1,D_D[EP],-1, D_D[LOC],$A42),0)","v":40.85},{"$f":"IFERROR(SUMIFS(D_D[INV],D_D[MT],2,D_D[CAT],TA_21,D_D[EP],-1, D_D[LOC],$A42),0)","v":30806},{"$f":"IFERROR(SUMIFS(D_D[BL],D_D[MT],2,D_D[CAT],TA_21,D_D[EP],-1, D_D[LOC],$A42),0)","v":9200},0.29864312146984356,{"$f":"IFERROR(SUMIFS(D_D[INV],D_D[MT],2,D_D[CAT],TA_22,D_D[EP],-1, D_D[LOC],$A42),0)","v":6735},{"$f":"IFERROR(SUMIFS(D_D[BL],D_D[MT],2,D_D[CAT],TA_22,D_D[EP],-1, D_D[LOC],$A42),0)","v":822},0.1220489977728285,{"$f":"IFERROR(SUMIFS(D_D[INV],D_D[MT],2,D_D[CAT],TA_23,D_D[EP],-1, D_D[LOC],$A42),0)","v":368},{"$f":"IFERROR(SUMIFS(D_D[BL],D_D[MT],2,D_D[CAT],TA_23,D_D[EP],-1, D_D[LOC],$A42),0)","v":8},2.1739130434782608E-2,{"$f":"IFERROR(SUMIFS(D_D[INV],D_D[MT],2,D_D[CAT],TA_24,D_D[EP],-1, D_D[LOC],$A42),0)","v":5427},{"$f":"IFERROR(SUMIFS(D_D[BL],D_D[MT],2,D_D[CAT],TA_24,D_D[EP],-1, D_D[LOC],$A42),0)","v":2722},0.50156624285977525,{"$f":"IFERROR(SUMIFS(D_D[INV],D_D[MT],2,D_D[CAT],TA_25,D_D[EP],-1, D_D[LOC],$A42),0)","v":265},{"$f":"IFERROR(SUMIFS(D_D[INV],D_D[MT],2,D_D[CAT],TA_26,D_D[EP],-1, D_D[LOC],$A42),0)","v":48},{"$f":"IFERROR(SUMIFS(D_D[INV],D_D[MT],7,D_D[CAT],2,D_D[EP],TA_20, D_D[LOC],$A42),0)","v":16}]
["318","Winston-Salem",{"$f":"IFERROR(SUMIFS(D_D[INV],D_D[MT],1,D_D[CAT],TA_20,D_D[EP],-1, D_D[LOC],$A43),0)","v":3334},{"$f":"IFERROR(SUMIFS(D_D[ADP],D_D[MT],1,D_D[CAT],D$1,D_D[EP],-1, D_D[LOC],$A43),0)","v":48.04},{"$f":"IFERROR(SUMIFS(D_D[INV],D_D[MT],2,D_D[CAT],TA_21,D_D[EP],-1, D_D[LOC],$A43),0)","v":17611},{"$f":"IFERROR(SUMIFS(D_D[BL],D_D[MT],2,D_D[CAT],TA_21,D_D[EP],-1, D_D[LOC],$A43),0)","v":4658},0.26449378229515641,{"$f":"IFERROR(SUMIFS(D_D[INV],D_D[MT],2,D_D[CAT],TA_22,D_D[EP],-1, D_D[LOC],$A43),0)","v":11306},{"$f":"IFERROR(SUMIFS(D_D[BL],D_D[MT],2,D_D[CAT],TA_22,D_D[EP],-1, D_D[LOC],$A43),0)","v":2458},0.21740668671501859,{"$f":"IFERROR(SUMIFS(D_D[INV],D_D[MT],2,D_D[CAT],TA_23,D_D[EP],-1, D_D[LOC],$A43),0)","v":276},{"$f":"IFERROR(SUMIFS(D_D[BL],D_D[MT],2,D_D[CAT],TA_23,D_D[EP],-1, D_D[LOC],$A43),0)","v":11},3.9855072463768113E-2,{"$f":"IFERROR(SUMIFS(D_D[INV],D_D[MT],2,D_D[CAT],TA_24,D_D[EP],-1, D_D[LOC],$A43),0)","v":1113},{"$f":"IFERROR(SUMIFS(D_D[BL],D_D[MT],2,D_D[CAT],TA_24,D_D[EP],-1, D_D[LOC],$A43),0)","v":534},0.47978436657681939,{"$f":"IFERROR(SUMIFS(D_D[INV],D_D[MT],2,D_D[CAT],TA_25,D_D[EP],-1, D_D[LOC],$A43),0)","v":173},{"$f":"IFERROR(SUMIFS(D_D[INV],D_D[MT],2,D_D[CAT],TA_26,D_D[EP],-1, D_D[LOC],$A43),0)","v":9},{"$f":"IFERROR(SUMIFS(D_D[INV],D_D[MT],7,D_D[CAT],2,D_D[EP],TA_20, D_D[LOC],$A43),0)","v":3}]
[384,"Continental",{"$f":"IFERROR(SUMIFS(D_D[INV],D_D[MT],1,D_D[CAT],TA_20,D_D[EP],-1, D_D[LOC],$A44),0)","v":15692},{"$f":"IFERROR(SUMIFS(D_D[ADP],D_D[MT],1,D_D[CAT],D$1,D_D[EP],-1, D_D[LOC],$A44),0)","v":49.69},{"$f":"IFERROR(SUMIFS(D_D[INV],D_D[MT],2,D_D[CAT],TA_21,D_D[EP],-1, D_D[LOC],$A44),0)","v":78488},{"$f":"IFERROR(SUMIFS(D_D[BL],D_D[MT],2,D_D[CAT],TA_21,D_D[EP],-1, D_D[LOC],$A44),0)","v":21588},0.27504841504433797,{"$f":"IFERROR(SUMIFS(D_D[INV],D_D[MT],2,D_D[CAT],TA_22,D_D[EP],-1, D_D[LOC],$A44),0)","v":43222},{"$f":"IFERROR(SUMIFS(D_D[BL],D_D[MT],2,D_D[CAT],TA_22,D_D[EP],-1, D_D[LOC],$A44),0)","v":10528},0.24357965850724167,{"$f":"IFERROR(SUMIFS(D_D[INV],D_D[MT],2,D_D[CAT],TA_23,D_D[EP],-1, D_D[LOC],$A44),0)","v":1033},{"$f":"IFERROR(SUMIFS(D_D[BL],D_D[MT],2,D_D[CAT],TA_23,D_D[EP],-1, D_D[LOC],$A44),0)","v":29},2.8073572120038724E-2,{"$f":"IFERROR(SUMIFS(D_D[INV],D_D[MT],2,D_D[CAT],TA_24,D_D[EP],-1, D_D[LOC],$A44),0)","v":10108},{"$f":"IFERROR(SUMIFS(D_D[BL],D_D[MT],2,D_D[CAT],TA_24,D_D[EP],-1, D_D[LOC],$A44),0)","v":6343},0.62752275425405624,{"$f":"IFERROR(SUMIFS(D_D[INV],D_D[MT],2,D_D[CAT],TA_25,D_D[EP],-1, D_D[LOC],$A44),0)","v":1584},{"$f":"IFERROR(SUMIFS(D_D[INV],D_D[MT],2,D_D[CAT],TA_26,D_D[EP],-1, D_D[LOC],$A44),0)","v":1989},{"$f":"IFERROR(SUMIFS(D_D[INV],D_D[MT],7,D_D[CAT],2,D_D[EP],TA_20, D_D[LOC],$A44),0)","v":379}]
["442","Cheyenne ",{"$f":"IFERROR(SUMIFS(D_D[INV],D_D[MT],1,D_D[CAT],TA_20,D_D[EP],-1, D_D[LOC],$A45),0)","v":110},{"$f":"IFERROR(SUMIFS(D_D[ADP],D_D[MT],1,D_D[CAT],D$1,D_D[EP],-1, D_D[LOC],$A45),0)","v":49.85},{"$f":"IFERROR(SUMIFS(D_D[INV],D_D[MT],2,D_D[CAT],TA_21,D_D[EP],-1, D_D[LOC],$A45),0)","v":984},{"$f":"IFERROR(SUMIFS(D_D[BL],D_D[MT],2,D_D[CAT],TA_21,D_D[EP],-1, D_D[LOC],$A45),0)","v":304},0.30894308943089432,{"$f":"IFERROR(SUMIFS(D_D[INV],D_D[MT],2,D_D[CAT],TA_22,D_D[EP],-1, D_D[LOC],$A45),0)","v":222},{"$f":"IFERROR(SUMIFS(D_D[BL],D_D[MT],2,D_D[CAT],TA_22,D_D[EP],-1, D_D[LOC],$A45),0)","v":38},0.17117117117117117,{"$f":"IFERROR(SUMIFS(D_D[INV],D_D[MT],2,D_D[CAT],TA_23,D_D[EP],-1, D_D[LOC],$A45),0)","v":20},{"$f":"IFERROR(SUMIFS(D_D[BL],D_D[MT],2,D_D[CAT],TA_23,D_D[EP],-1, D_D[LOC],$A45),0)","v":0},0,{"$f":"IFERROR(SUMIFS(D_D[INV],D_D[MT],2,D_D[CAT],TA_24,D_D[EP],-1, D_D[LOC],$A45),0)","v":67},{"$f":"IFERROR(SUMIFS(D_D[BL],D_D[MT],2,D_D[CAT],TA_24,D_D[EP],-1, D_D[LOC],$A45),0)","v":43},0.64179104477611937,{"$f":"IFERROR(SUMIFS(D_D[INV],D_D[MT],2,D_D[CAT],TA_25,D_D[EP],-1, D_D[LOC],$A45),0)","v":6},{"$f":"IFERROR(SUMIFS(D_D[INV],D_D[MT],2,D_D[CAT],TA_26,D_D[EP],-1, D_D[LOC],$A45),0)","v":3},{"$f":"IFERROR(SUMIFS(D_D[INV],D_D[MT],7,D_D[CAT],2,D_D[EP],TA_20, D_D[LOC],$A45),0)","v":0}]
["339","Denver",{"$f":"IFERROR(SUMIFS(D_D[INV],D_D[MT],1,D_D[CAT],TA_20,D_D[EP],-1, D_D[LOC],$A46),0)","v":999},{"$f":"IFERROR(SUMIFS(D_D[ADP],D_D[MT],1,D_D[CAT],D$1,D_D[EP],-1, D_D[LOC],$A46),0)","v":34.03},{"$f":"IFERROR(SUMIFS(D_D[INV],D_D[MT],2,D_D[CAT],TA_21,D_D[EP],-1, D_D[LOC],$A46),0)","v":7700},{"$f":"IFERROR(SUMIFS(D_D[BL],D_D[MT],2,D_D[CAT],TA_21,D_D[EP],-1, D_D[LOC],$A46),0)","v":2000},0.25974025974025972,{"$f":"IFERROR(SUMIFS(D_D[INV],D_D[MT],2,D_D[CAT],TA_22,D_D[EP],-1, D_D[LOC],$A46),0)","v":2328},{"$f":"IFERROR(SUMIFS(D_D[BL],D_D[MT],2,D_D[CAT],TA_22,D_D[EP],-1, D_D[LOC],$A46),0)","v":261},0.11211340206185567,{"$f":"IFERROR(SUMIFS(D_D[INV],D_D[MT],2,D_D[CAT],TA_23,D_D[EP],-1, D_D[LOC],$A46),0)","v":109},{"$f":"IFERROR(SUMIFS(D_D[BL],D_D[MT],2,D_D[CAT],TA_23,D_D[EP],-1, D_D[LOC],$A46),0)","v":3},2.7522935779816515E-2,{"$f":"IFERROR(SUMIFS(D_D[INV],D_D[MT],2,D_D[CAT],TA_24,D_D[EP],-1, D_D[LOC],$A46),0)","v":420},{"$f":"IFERROR(SUMIFS(D_D[BL],D_D[MT],2,D_D[CAT],TA_24,D_D[EP],-1, D_D[LOC],$A46),0)","v":217},0.51666666666666672,{"$f":"IFERROR(SUMIFS(D_D[INV],D_D[MT],2,D_D[CAT],TA_25,D_D[EP],-1, D_D[LOC],$A46),0)","v":61},{"$f":"IFERROR(SUMIFS(D_D[INV],D_D[MT],2,D_D[CAT],TA_26,D_D[EP],-1, D_D[LOC],$A46),0)","v":2},{"$f":"IFERROR(SUMIFS(D_D[INV],D_D[MT],7,D_D[CAT],2,D_D[EP],TA_20, D_D[LOC],$A46),0)","v":19}]
["333","Des Moines",{"$f":"IFERROR(SUMIFS(D_D[INV],D_D[MT],1,D_D[CAT],TA_20,D_D[EP],-1, D_D[LOC],$A47),0)","v":456},{"$f":"IFERROR(SUMIFS(D_D[ADP],D_D[MT],1,D_D[CAT],D$1,D_D[EP],-1, D_D[LOC],$A47),0)","v":41.94},{"$f":"IFERROR(SUMIFS(D_D[INV],D_D[MT],2,D_D[CAT],TA_21,D_D[EP],-1, D_D[LOC],$A47),0)","v":2723},{"$f":"IFERROR(SUMIFS(D_D[BL],D_D[MT],2,D_D[CAT],TA_21,D_D[EP],-1, D_D[LOC],$A47),0)","v":822},0.30187293426367978,{"$f":"IFERROR(SUMIFS(D_D[INV],D_D[MT],2,D_D[CAT],TA_22,D_D[EP],-1, D_D[LOC],$A47),0)","v":994},{"$f":"IFERROR(SUMIFS(D_D[BL],D_D[MT],2,D_D[CAT],TA_22,D_D[EP],-1, D_D[LOC],$A47),0)","v":138},0.13883299798792756,{"$f":"IFERROR(SUMIFS(D_D[INV],D_D[MT],2,D_D[CAT],TA_23,D_D[EP],-1, D_D[LOC],$A47),0)","v":45},{"$f":"IFERROR(SUMIFS(D_D[BL],D_D[MT],2,D_D[CAT],TA_23,D_D[EP],-1, D_D[LOC],$A47),0)","v":0},0,{"$f":"IFERROR(SUMIFS(D_D[INV],D_D[MT],2,D_D[CAT],TA_24,D_D[EP],-1, D_D[LOC],$A47),0)","v":262},{"$f":"IFERROR(SUMIFS(D_D[BL],D_D[MT],2,D_D[CAT],TA_24,D_D[EP],-1, D_D[LOC],$A47),0)","v":173},0.66030534351145043,{"$f":"IFERROR(SUMIFS(D_D[INV],D_D[MT],2,D_D[CAT],TA_25,D_D[EP],-1, D_D[LOC],$A47),0)","v":36},{"$f":"IFERROR(SUMIFS(D_D[INV],D_D[MT],2,D_D[CAT],TA_26,D_D[EP],-1, D_D[LOC],$A47),0)","v":7},{"$f":"IFERROR(SUMIFS(D_D[INV],D_D[MT],7,D_D[CAT],2,D_D[EP],TA_20, D_D[LOC],$A47),0)","v":2}]
["437","Fargo",{"$f":"IFERROR(SUMIFS(D_D[INV],D_D[MT],1,D_D[CAT],TA_20,D_D[EP],-1, D_D[LOC],$A48),0)","v":171},{"$f":"IFERROR(SUMIFS(D_D[ADP],D_D[MT],1,D_D[CAT],D$1,D_D[EP],-1, D_D[LOC],$A48),0)","v":44.5},{"$f":"IFERROR(SUMIFS(D_D[INV],D_D[MT],2,D_D[CAT],TA_21,D_D[EP],-1, D_D[LOC],$A48),0)","v":1209},{"$f":"IFERROR(SUMIFS(D_D[BL],D_D[MT],2,D_D[CAT],TA_21,D_D[EP],-1, D_D[LOC],$A48),0)","v":339},0.28039702233250619,{"$f":"IFERROR(SUMIFS(D_D[INV],D_D[MT],2,D_D[CAT],TA_22,D_D[EP],-1, D_D[LOC],$A48),0)","v":408},{"$f":"IFERROR(SUMIFS(D_D[BL],D_D[MT],2,D_D[CAT],TA_22,D_D[EP],-1, D_D[LOC],$A48),0)","v":62},0.15196078431372548,{"$f":"IFERROR(SUMIFS(D_D[INV],D_D[MT],2,D_D[CAT],TA_23,D_D[EP],-1, D_D[LOC],$A48),0)","v":33},{"$f":"IFERROR(SUMIFS(D_D[BL],D_D[MT],2,D_D[CAT],TA_23,D_D[EP],-1, D_D[LOC],$A48),0)","v":0},0,{"$f":"IFERROR(SUMIFS(D_D[INV],D_D[MT],2,D_D[CAT],TA_24,D_D[EP],-1, D_D[LOC],$A48),0)","v":132},{"$f":"IFERROR(SUMIFS(D_D[BL],D_D[MT],2,D_D[CAT],TA_24,D_D[EP],-1, D_D[LOC],$A48),0)","v":93},0.70454545454545459,{"$f":"IFERROR(SUMIFS(D_D[INV],D_D[MT],2,D_D[CAT],TA_25,D_D[EP],-1, D_D[LOC],$A48),0)","v":19},{"$f":"IFERROR(SUMIFS(D_D[INV],D_D[MT],2,D_D[CAT],TA_26,D_D[EP],-1, D_D[LOC],$A48),0)","v":5},{"$f":"IFERROR(SUMIFS(D_D[INV],D_D[MT],7,D_D[CAT],2,D_D[EP],TA_20, D_D[LOC],$A48),0)","v":3}]
["436","Fort Harrison ",{"$f":"IFERROR(SUMIFS(D_D[INV],D_D[MT],1,D_D[CAT],TA_20,D_D[EP],-1, D_D[LOC],$A49),0)","v":249},{"$f":"IFERROR(SUMIFS(D_D[ADP],D_D[MT],1,D_D[CAT],D$1,D_D[EP],-1, D_D[LOC],$A49),0)","v":50.48},{"$f":"IFERROR(SUMIFS(D_D[INV],D_D[MT],2,D_D[CAT],TA_21,D_D[EP],-1, D_D[LOC],$A49),0)","v":1697},{"$f":"IFERROR(SUMIFS(D_D[BL],D_D[MT],2,D_D[CAT],TA_21,D_D[EP],-1, D_D[LOC],$A49),0)","v":541},0.31879787860931053,{"$f":"IFERROR(SUMIFS(D_D[INV],D_D[MT],2,D_D[CAT],TA_22,D_D[EP],-1, D_D[LOC],$A49),0)","v":518},{"$f":"IFERROR(SUMIFS(D_D[BL],D_D[MT],2,D_D[CAT],TA_22,D_D[EP],-1, D_D[LOC],$A49),0)","v":68},0.13127413127413126,{"$f":"IFERROR(SUMIFS(D_D[INV],D_D[MT],2,D_D[CAT],TA_23,D_D[EP],-1, D_D[LOC],$A49),0)","v":12},{"$f":"IFERROR(SUMIFS(D_D[BL],D_D[MT],2,D_D[CAT],TA_23,D_D[EP],-1, D_D[LOC],$A49),0)","v":0},0,{"$f":"IFERROR(SUMIFS(D_D[INV],D_D[MT],2,D_D[CAT],TA_24,D_D[EP],-1, D_D[LOC],$A49),0)","v":151},{"$f":"IFERROR(SUMIFS(D_D[BL],D_D[MT],2,D_D[CAT],TA_24,D_D[EP],-1, D_D[LOC],$A49),0)","v":106},0.70198675496688745,{"$f":"IFERROR(SUMIFS(D_D[INV],D_D[MT],2,D_D[CAT],TA_25,D_D[EP],-1, D_D[LOC],$A49),0)","v":15},{"$f":"IFERROR(SUMIFS(D_D[INV],D_D[MT],2,D_D[CAT],TA_26,D_D[EP],-1, D_D[LOC],$A49),0)","v":3},{"$f":"IFERROR(SUMIFS(D_D[INV],D_D[MT],7,D_D[CAT],2,D_D[EP],TA_20, D_D[LOC],$A49),0)","v":1}]
["362","Houston",{"$f":"IFERROR(SUMIFS(D_D[INV],D_D[MT],1,D_D[CAT],TA_20,D_D[EP],-1, D_D[LOC],$A50),0)","v":3044},{"$f":"IFERROR(SUMIFS(D_D[ADP],D_D[MT],1,D_D[CAT],D$1,D_D[EP],-1, D_D[LOC],$A50),0)","v":42.25},{"$f":"IFERROR(SUMIFS(D_D[INV],D_D[MT],2,D_D[CAT],TA_21,D_D[EP],-1, D_D[LOC],$A50),0)","v":21117},{"$f":"IFERROR(SUMIFS(D_D[BL],D_D[MT],2,D_D[CAT],TA_21,D_D[EP],-1, D_D[LOC],$A50),0)","v":5447},0.25794383671923093,{"$f":"IFERROR(SUMIFS(D_D[INV],D_D[MT],2,D_D[CAT],TA_22,D_D[EP],-1, D_D[LOC],$A50),0)","v":5031},{"$f":"IFERROR(SUMIFS(D_D[BL],D_D[MT],2,D_D[CAT],TA_22,D_D[EP],-1, D_D[LOC],$A50),0)","v":570},0.11329755515802027,{"$f":"IFERROR(SUMIFS(D_D[INV],D_D[MT],2,D_D[CAT],TA_23,D_D[EP],-1, D_D[LOC],$A50),0)","v":252},{"$f":"IFERROR(SUMIFS(D_D[BL],D_D[MT],2,D_D[CAT],TA_23,D_D[EP],-1, D_D[LOC],$A50),0)","v":5},1.984126984126984E-2,{"$f":"IFERROR(SUMIFS(D_D[INV],D_D[MT],2,D_D[CAT],TA_24,D_D[EP],-1, D_D[LOC],$A50),0)","v":1909},{"$f":"IFERROR(SUMIFS(D_D[BL],D_D[MT],2,D_D[CAT],TA_24,D_D[EP],-1, D_D[LOC],$A50),0)","v":741},0.38816134101623889,{"$f":"IFERROR(SUMIFS(D_D[INV],D_D[MT],2,D_D[CAT],TA_25,D_D[EP],-1, D_D[LOC],$A50),0)","v":121},{"$f":"IFERROR(SUMIFS(D_D[INV],D_D[MT],2,D_D[CAT],TA_26,D_D[EP],-1, D_D[LOC],$A50),0)","v":4},{"$f":"IFERROR(SUMIFS(D_D[INV],D_D[MT],7,D_D[CAT],2,D_D[EP],TA_20, D_D[LOC],$A50),0)","v":13}]
["334","Lincoln",{"$f":"IFERROR(SUMIFS(D_D[INV],D_D[MT],1,D_D[CAT],TA_20,D_D[EP],-1, D_D[LOC],$A51),0)","v":1433},{"$f":"IFERROR(SUMIFS(D_D[ADP],D_D[MT],1,D_D[CAT],D$1,D_D[EP],-1, D_D[LOC],$A51),0)","v":41.27},{"$f":"IFERROR(SUMIFS(D_D[INV],D_D[MT],2,D_D[CAT],TA_21,D_D[EP],-1, D_D[LOC],$A51),0)","v":2543},{"$f":"IFERROR(SUMIFS(D_D[BL],D_D[MT],2,D_D[CAT],TA_21,D_D[EP],-1, D_D[LOC],$A51),0)","v":720},0.28313016122689738,{"$f":"IFERROR(SUMIFS(D_D[INV],D_D[MT],2,D_D[CAT],TA_22,D_D[EP],-1, D_D[LOC],$A51),0)","v":1970},{"$f":"IFERROR(SUMIFS(D_D[BL],D_D[MT],2,D_D[CAT],TA_22,D_D[EP],-1, D_D[LOC],$A51),0)","v":215},0.10913705583756345,{"$f":"IFERROR(SUMIFS(D_D[INV],D_D[MT],2,D_D[CAT],TA_23,D_D[EP],-1, D_D[LOC],$A51),0)","v":32},{"$f":"IFERROR(SUMIFS(D_D[BL],D_D[MT],2,D_D[CAT],TA_23,D_D[EP],-1, D_D[LOC],$A51),0)","v":1},3.125E-2,{"$f":"IFERROR(SUMIFS(D_D[INV],D_D[MT],2,D_D[CAT],TA_24,D_D[EP],-1, D_D[LOC],$A51),0)","v":1096},{"$f":"IFERROR(SUMIFS(D_D[BL],D_D[MT],2,D_D[CAT],TA_24,D_D[EP],-1, D_D[LOC],$A51),0)","v":849},0.77463503649635035,{"$f":"IFERROR(SUMIFS(D_D[INV],D_D[MT],2,D_D[CAT],TA_25,D_D[EP],-1, D_D[LOC],$A51),0)","v":25},{"$f":"IFERROR(SUMIFS(D_D[INV],D_D[MT],2,D_D[CAT],TA_26,D_D[EP],-1, D_D[LOC],$A51),0)","v":5},{"$f":"IFERROR(SUMIFS(D_D[INV],D_D[MT],7,D_D[CAT],2,D_D[EP],TA_20, D_D[LOC],$A51),0)","v":3}]
["351","Muskogee",{"$f":"IFERROR(SUMIFS(D_D[INV],D_D[MT],1,D_D[CAT],TA_20,D_D[EP],-1, D_D[LOC],$A52),0)","v":1464},{"$f":"IFERROR(SUMIFS(D_D[ADP],D_D[MT],1,D_D[CAT],D$1,D_D[EP],-1, D_D[LOC],$A52),0)","v":58.43},{"$f":"IFERROR(SUMIFS(D_D[INV],D_D[MT],2,D_D[CAT],TA_21,D_D[EP],-1, D_D[LOC],$A52),0)","v":6863},{"$f":"IFERROR(SUMIFS(D_D[BL],D_D[MT],2,D_D[CAT],TA_21,D_D[EP],-1, D_D[LOC],$A52),0)","v":1737},0.25309631356549611,{"$f":"IFERROR(SUMIFS(D_D[INV],D_D[MT],2,D_D[CAT],TA_22,D_D[EP],-1, D_D[LOC],$A52),0)","v":7714},{"$f":"IFERROR(SUMIFS(D_D[BL],D_D[MT],2,D_D[CAT],TA_22,D_D[EP],-1, D_D[LOC],$A52),0)","v":1967},0.25499092558983666,{"$f":"IFERROR(SUMIFS(D_D[INV],D_D[MT],2,D_D[CAT],TA_23,D_D[EP],-1, D_D[LOC],$A52),0)","v":88},{"$f":"IFERROR(SUMIFS(D_D[BL],D_D[MT],2,D_D[CAT],TA_23,D_D[EP],-1, D_D[LOC],$A52),0)","v":1},1.1363636363636364E-2,{"$f":"IFERROR(SUMIFS(D_D[INV],D_D[MT],2,D_D[CAT],TA_24,D_D[EP],-1, D_D[LOC],$A52),0)","v":711},{"$f":"IFERROR(SUMIFS(D_D[BL],D_D[MT],2,D_D[CAT],TA_24,D_D[EP],-1, D_D[LOC],$A52),0)","v":347},0.48804500703234882,{"$f":"IFERROR(SUMIFS(D_D[INV],D_D[MT],2,D_D[CAT],TA_25,D_D[EP],-1, D_D[LOC],$A52),0)","v":91},{"$f":"IFERROR(SUMIFS(D_D[INV],D_D[MT],2,D_D[CAT],TA_26,D_D[EP],-1, D_D[LOC],$A52),0)","v":34},{"$f":"IFERROR(SUMIFS(D_D[INV],D_D[MT],7,D_D[CAT],2,D_D[EP],TA_20, D_D[LOC],$A52),0)","v":32}]
["438","Sioux Falls",{"$f":"IFERROR(SUMIFS(D_D[INV],D_D[MT],1,D_D[CAT],TA_20,D_D[EP],-1, D_D[LOC],$A53),0)","v":162},{"$f":"IFERROR(SUMIFS(D_D[ADP],D_D[MT],1,D_D[CAT],D$1,D_D[EP],-1, D_D[LOC],$A53),0)","v":54.36},{"$f":"IFERROR(SUMIFS(D_D[INV],D_D[MT],2,D_D[CAT],TA_21,D_D[EP],-1, D_D[LOC],$A53),0)","v":1514},{"$f":"IFERROR(SUMIFS(D_D[BL],D_D[MT],2,D_D[CAT],TA_21,D_D[EP],-1, D_D[LOC],$A53),0)","v":469},0.30977542932628799,{"$f":"IFERROR(SUMIFS(D_D[INV],D_D[MT],2,D_D[CAT],TA_22,D_D[EP],-1, D_D[LOC],$A53),0)","v":601},{"$f":"IFERROR(SUMIFS(D_D[BL],D_D[MT],2,D_D[CAT],TA_22,D_D[EP],-1, D_D[LOC],$A53),0)","v":141},0.23460898502495842,{"$f":"IFERROR(SUMIFS(D_D[INV],D_D[MT],2,D_D[CAT],TA_23,D_D[EP],-1, D_D[LOC],$A53),0)","v":19},{"$f":"IFERROR(SUMIFS(D_D[BL],D_D[MT],2,D_D[CAT],TA_23,D_D[EP],-1, D_D[LOC],$A53),0)","v":0},0,{"$f":"IFERROR(SUMIFS(D_D[INV],D_D[MT],2,D_D[CAT],TA_24,D_D[EP],-1, D_D[LOC],$A53),0)","v":120},{"$f":"IFERROR(SUMIFS(D_D[BL],D_D[MT],2,D_D[CAT],TA_24,D_D[EP],-1, D_D[LOC],$A53),0)","v":88},0.73333333333333328,{"$f":"IFERROR(SUMIFS(D_D[INV],D_D[MT],2,D_D[CAT],TA_25,D_D[EP],-1, D_D[LOC],$A53),0)","v":15},{"$f":"IFERROR(SUMIFS(D_D[INV],D_D[MT],2,D_D[CAT],TA_26,D_D[EP],-1, D_D[LOC],$A53),0)","v":8},{"$f":"IFERROR(SUMIFS(D_D[INV],D_D[MT],7,D_D[CAT],2,D_D[EP],TA_20, D_D[LOC],$A53),0)","v":0}]
["335","St. Paul",{"$f":"IFERROR(SUMIFS(D_D[INV],D_D[MT],1,D_D[CAT],TA_20,D_D[EP],-1, D_D[LOC],$A54),0)","v":3473},{"$f":"IFERROR(SUMIFS(D_D[ADP],D_D[MT],1,D_D[CAT],D$1,D_D[EP],-1, D_D[LOC],$A54),0)","v":51.59},{"$f":"IFERROR(SUMIFS(D_D[INV],D_D[MT],2,D_D[CAT],TA_21,D_D[EP],-1, D_D[LOC],$A54),0)","v":7180},{"$f":"IFERROR(SUMIFS(D_D[BL],D_D[MT],2,D_D[CAT],TA_21,D_D[EP],-1, D_D[LOC],$A54),0)","v":2194},0.30557103064066854,{"$f":"IFERROR(SUMIFS(D_D[INV],D_D[MT],2,D_D[CAT],TA_22,D_D[EP],-1, D_D[LOC],$A54),0)","v":16593},{"$f":"IFERROR(SUMIFS(D_D[BL],D_D[MT],2,D_D[CAT],TA_22,D_D[EP],-1, D_D[LOC],$A54),0)","v":6043},0.36418971855601762,{"$f":"IFERROR(SUMIFS(D_D[INV],D_D[MT],2,D_D[CAT],TA_23,D_D[EP],-1, D_D[LOC],$A54),0)","v":170},{"$f":"IFERROR(SUMIFS(D_D[BL],D_D[MT],2,D_D[CAT],TA_23,D_D[EP],-1, D_D[LOC],$A54),0)","v":10},5.8823529411764705E-2,{"$f":"IFERROR(SUMIFS(D_D[INV],D_D[MT],2,D_D[CAT],TA_24,D_D[EP],-1, D_D[LOC],$A54),0)","v":2293},{"$f":"IFERROR(SUMIFS(D_D[BL],D_D[MT],2,D_D[CAT],TA_24,D_D[EP],-1, D_D[LOC],$A54),0)","v":1655},0.72176188399476671,{"$f":"IFERROR(SUMIFS(D_D[INV],D_D[MT],2,D_D[CAT],TA_25,D_D[EP],-1, D_D[LOC],$A54),0)","v":724},{"$f":"IFERROR(SUMIFS(D_D[INV],D_D[MT],2,D_D[CAT],TA_26,D_D[EP],-1, D_D[LOC],$A54),0)","v":0},{"$f":"IFERROR(SUMIFS(D_D[INV],D_D[MT],7,D_D[CAT],2,D_D[EP],TA_20, D_D[LOC],$A54),0)","v":302}]
["349","Waco",{"$f":"IFERROR(SUMIFS(D_D[INV],D_D[MT],1,D_D[CAT],TA_20,D_D[EP],-1, D_D[LOC],$A55),0)","v":3767},{"$f":"IFERROR(SUMIFS(D_D[ADP],D_D[MT],1,D_D[CAT],D$1,D_D[EP],-1, D_D[LOC],$A55),0)","v":60.39},{"$f":"IFERROR(SUMIFS(D_D[INV],D_D[MT],2,D_D[CAT],TA_21,D_D[EP],-1, D_D[LOC],$A55),0)","v":22022},{"$f":"IFERROR(SUMIFS(D_D[BL],D_D[MT],2,D_D[CAT],TA_21,D_D[EP],-1, D_D[LOC],$A55),0)","v":6090},0.27654164017800381,{"$f":"IFERROR(SUMIFS(D_D[INV],D_D[MT],2,D_D[CAT],TA_22,D_D[EP],-1, D_D[LOC],$A55),0)","v":5956},{"$f":"IFERROR(SUMIFS(D_D[BL],D_D[MT],2,D_D[CAT],TA_22,D_D[EP],-1, D_D[LOC],$A55),0)","v":909},0.15261920752182673,{"$f":"IFERROR(SUMIFS(D_D[INV],D_D[MT],2,D_D[CAT],TA_23,D_D[EP],-1, D_D[LOC],$A55),0)","v":217},{"$f":"IFERROR(SUMIFS(D_D[BL],D_D[MT],2,D_D[CAT],TA_23,D_D[EP],-1, D_D[LOC],$A55),0)","v":7},3.2258064516129031E-2,{"$f":"IFERROR(SUMIFS(D_D[INV],D_D[MT],2,D_D[CAT],TA_24,D_D[EP],-1, D_D[LOC],$A55),0)","v":2739},{"$f":"IFERROR(SUMIFS(D_D[BL],D_D[MT],2,D_D[CAT],TA_24,D_D[EP],-1, D_D[LOC],$A55),0)","v":1903},0.69477911646586343,{"$f":"IFERROR(SUMIFS(D_D[INV],D_D[MT],2,D_D[CAT],TA_25,D_D[EP],-1, D_D[LOC],$A55),0)","v":435},{"$f":"IFERROR(SUMIFS(D_D[INV],D_D[MT],2,D_D[CAT],TA_26,D_D[EP],-1, D_D[LOC],$A55),0)","v":1912},{"$f":"IFERROR(SUMIFS(D_D[INV],D_D[MT],7,D_D[CAT],2,D_D[EP],TA_20, D_D[LOC],$A55),0)","v":2}]
["452","Wichita",{"$f":"IFERROR(SUMIFS(D_D[INV],D_D[MT],1,D_D[CAT],TA_20,D_D[EP],-1, D_D[LOC],$A56),0)","v":364},{"$f":"IFERROR(SUMIFS(D_D[ADP],D_D[MT],1,D_D[CAT],D$1,D_D[EP],-1, D_D[LOC],$A56),0)","v":33.43},{"$f":"IFERROR(SUMIFS(D_D[INV],D_D[MT],2,D_D[CAT],TA_21,D_D[EP],-1, D_D[LOC],$A56),0)","v":2936},{"$f":"IFERROR(SUMIFS(D_D[BL],D_D[MT],2,D_D[CAT],TA_21,D_D[EP],-1, D_D[LOC],$A56),0)","v":925},0.31505449591280654,{"$f":"IFERROR(SUMIFS(D_D[INV],D_D[MT],2,D_D[CAT],TA_22,D_D[EP],-1, D_D[LOC],$A56),0)","v":887},{"$f":"IFERROR(SUMIFS(D_D[BL],D_D[MT],2,D_D[CAT],TA_22,D_D[EP],-1, D_D[LOC],$A56),0)","v":116},0.13077790304396844,{"$f":"IFERROR(SUMIFS(D_D[INV],D_D[MT],2,D_D[CAT],TA_23,D_D[EP],-1, D_D[LOC],$A56),0)","v":36},{"$f":"IFERROR(SUMIFS(D_D[BL],D_D[MT],2,D_D[CAT],TA_23,D_D[EP],-1, D_D[LOC],$A56),0)","v":2},5.5555555555555552E-2,{"$f":"IFERROR(SUMIFS(D_D[INV],D_D[MT],2,D_D[CAT],TA_24,D_D[EP],-1, D_D[LOC],$A56),0)","v":208},{"$f":"IFERROR(SUMIFS(D_D[BL],D_D[MT],2,D_D[CAT],TA_24,D_D[EP],-1, D_D[LOC],$A56),0)","v":128},0.61538461538461542,{"$f":"IFERROR(SUMIFS(D_D[INV],D_D[MT],2,D_D[CAT],TA_25,D_D[EP],-1, D_D[LOC],$A56),0)","v":36},{"$f":"IFERROR(SUMIFS(D_D[INV],D_D[MT],2,D_D[CAT],TA_26,D_D[EP],-1, D_D[LOC],$A56),0)","v":6},{"$f":"IFERROR(SUMIFS(D_D[INV],D_D[MT],7,D_D[CAT],2,D_D[EP],TA_20, D_D[LOC],$A56),0)","v":2}]
[395,"Pacific",{"$f":"IFERROR(SUMIFS(D_D[INV],D_D[MT],1,D_D[CAT],TA_20,D_D[EP],-1, D_D[LOC],$A57),0)","v":13498},{"$f":"IFERROR(SUMIFS(D_D[ADP],D_D[MT],1,D_D[CAT],D$1,D_D[EP],-1, D_D[LOC],$A57),0)","v":48.65},{"$f":"IFERROR(SUMIFS(D_D[INV],D_D[MT],2,D_D[CAT],TA_21,D_D[EP],-1, D_D[LOC],$A57),0)","v":74208},{"$f":"IFERROR(SUMIFS(D_D[BL],D_D[MT],2,D_D[CAT],TA_21,D_D[EP],-1, D_D[LOC],$A57),0)","v":22137},0.2983101552393273,{"$f":"IFERROR(SUMIFS(D_D[INV],D_D[MT],2,D_D[CAT],TA_22,D_D[EP],-1, D_D[LOC],$A57),0)","v":31773},{"$f":"IFERROR(SUMIFS(D_D[BL],D_D[MT],2,D_D[CAT],TA_22,D_D[EP],-1, D_D[LOC],$A57),0)","v":5637},0.17741478613917477,{"$f":"IFERROR(SUMIFS(D_D[INV],D_D[MT],2,D_D[CAT],TA_23,D_D[EP],-1, D_D[LOC],$A57),0)","v":912},{"$f":"IFERROR(SUMIFS(D_D[BL],D_D[MT],2,D_D[CAT],TA_23,D_D[EP],-1, D_D[LOC],$A57),0)","v":42},4.6052631578947366E-2,{"$f":"IFERROR(SUMIFS(D_D[INV],D_D[MT],2,D_D[CAT],TA_24,D_D[EP],-1, D_D[LOC],$A57),0)","v":12059},{"$f":"IFERROR(SUMIFS(D_D[BL],D_D[MT],2,D_D[CAT],TA_24,D_D[EP],-1, D_D[LOC],$A57),0)","v":7549},0.6260054730906377,{"$f":"IFERROR(SUMIFS(D_D[INV],D_D[MT],2,D_D[CAT],TA_25,D_D[EP],-1, D_D[LOC],$A57),0)","v":837},{"$f":"IFERROR(SUMIFS(D_D[INV],D_D[MT],2,D_D[CAT],TA_26,D_D[EP],-1, D_D[LOC],$A57),0)","v":6924},{"$f":"IFERROR(SUMIFS(D_D[INV],D_D[MT],7,D_D[CAT],2,D_D[EP],TA_20, D_D[LOC],$A57),0)","v":116}]
["340","Albuquerque",{"$f":"IFERROR(SUMIFS(D_D[INV],D_D[MT],1,D_D[CAT],TA_20,D_D[EP],-1, D_D[LOC],$A58),0)","v":332},{"$f":"IFERROR(SUMIFS(D_D[ADP],D_D[MT],1,D_D[CAT],D$1,D_D[EP],-1, D_D[LOC],$A58),0)","v":39.81},{"$f":"IFERROR(SUMIFS(D_D[INV],D_D[MT],2,D_D[CAT],TA_21,D_D[EP],-1, D_D[LOC],$A58),0)","v":2523},{"$f":"IFERROR(SUMIFS(D_D[BL],D_D[MT],2,D_D[CAT],TA_21,D_D[EP],-1, D_D[LOC],$A58),0)","v":794},0.31470471660721361,{"$f":"IFERROR(SUMIFS(D_D[INV],D_D[MT],2,D_D[CAT],TA_22,D_D[EP],-1, D_D[LOC],$A58),0)","v":654},{"$f":"IFERROR(SUMIFS(D_D[BL],D_D[MT],2,D_D[CAT],TA_22,D_D[EP],-1, D_D[LOC],$A58),0)","v":69},0.10550458715596331,{"$f":"IFERROR(SUMIFS(D_D[INV],D_D[MT],2,D_D[CAT],TA_23,D_D[EP],-1, D_D[LOC],$A58),0)","v":28},{"$f":"IFERROR(SUMIFS(D_D[BL],D_D[MT],2,D_D[CAT],TA_23,D_D[EP],-1, D_D[LOC],$A58),0)","v":2},7.1428571428571425E-2,{"$f":"IFERROR(SUMIFS(D_D[INV],D_D[MT],2,D_D[CAT],TA_24,D_D[EP],-1, D_D[LOC],$A58),0)","v":162},{"$f":"IFERROR(SUMIFS(D_D[BL],D_D[MT],2,D_D[CAT],TA_24,D_D[EP],-1, D_D[LOC],$A58),0)","v":108},0.66666666666666663,{"$f":"IFERROR(SUMIFS(D_D[INV],D_D[MT],2,D_D[CAT],TA_25,D_D[EP],-1, D_D[LOC],$A58),0)","v":27},{"$f":"IFERROR(SUMIFS(D_D[INV],D_D[MT],2,D_D[CAT],TA_26,D_D[EP],-1, D_D[LOC],$A58),0)","v":3},{"$f":"IFERROR(SUMIFS(D_D[INV],D_D[MT],7,D_D[CAT],2,D_D[EP],TA_20, D_D[LOC],$A58),0)","v":3}]
["463","Anchorage",{"$f":"IFERROR(SUMIFS(D_D[INV],D_D[MT],1,D_D[CAT],TA_20,D_D[EP],-1, D_D[LOC],$A59),0)","v":180},{"$f":"IFERROR(SUMIFS(D_D[ADP],D_D[MT],1,D_D[CAT],D$1,D_D[EP],-1, D_D[LOC],$A59),0)","v":37.909999999999997},{"$f":"IFERROR(SUMIFS(D_D[INV],D_D[MT],2,D_D[CAT],TA_21,D_D[EP],-1, D_D[LOC],$A59),0)","v":1382},{"$f":"IFERROR(SUMIFS(D_D[BL],D_D[MT],2,D_D[CAT],TA_21,D_D[EP],-1, D_D[LOC],$A59),0)","v":436},0.31548480463096962,{"$f":"IFERROR(SUMIFS(D_D[INV],D_D[MT],2,D_D[CAT],TA_22,D_D[EP],-1, D_D[LOC],$A59),0)","v":373},{"$f":"IFERROR(SUMIFS(D_D[BL],D_D[MT],2,D_D[CAT],TA_22,D_D[EP],-1, D_D[LOC],$A59),0)","v":36},9.6514745308310987E-2,{"$f":"IFERROR(SUMIFS(D_D[INV],D_D[MT],2,D_D[CAT],TA_23,D_D[EP],-1, D_D[LOC],$A59),0)","v":21},{"$f":"IFERROR(SUMIFS(D_D[BL],D_D[MT],2,D_D[CAT],TA_23,D_D[EP],-1, D_D[LOC],$A59),0)","v":0},0,{"$f":"IFERROR(SUMIFS(D_D[INV],D_D[MT],2,D_D[CAT],TA_24,D_D[EP],-1, D_D[LOC],$A59),0)","v":110},{"$f":"IFERROR(SUMIFS(D_D[BL],D_D[MT],2,D_D[CAT],TA_24,D_D[EP],-1, D_D[LOC],$A59),0)","v":58},0.52727272727272723,{"$f":"IFERROR(SUMIFS(D_D[INV],D_D[MT],2,D_D[CAT],TA_25,D_D[EP],-1, D_D[LOC],$A59),0)","v":8},{"$f":"IFERROR(SUMIFS(D_D[INV],D_D[MT],2,D_D[CAT],TA_26,D_D[EP],-1, D_D[LOC],$A59),0)","v":1},{"$f":"IFERROR(SUMIFS(D_D[INV],D_D[MT],7,D_D[CAT],2,D_D[EP],TA_20, D_D[LOC],$A59),0)","v":0}]
["347","Boise",{"$f":"IFERROR(SUMIFS(D_D[INV],D_D[MT],1,D_D[CAT],TA_20,D_D[EP],-1, D_D[LOC],$A60),0)","v":424},{"$f":"IFERROR(SUMIFS(D_D[ADP],D_D[MT],1,D_D[CAT],D$1,D_D[EP],-1, D_D[LOC],$A60),0)","v":52.67},{"$f":"IFERROR(SUMIFS(D_D[INV],D_D[MT],2,D_D[CAT],TA_21,D_D[EP],-1, D_D[LOC],$A60),0)","v":2221},{"$f":"IFERROR(SUMIFS(D_D[BL],D_D[MT],2,D_D[CAT],TA_21,D_D[EP],-1, D_D[LOC],$A60),0)","v":751},0.33813597478613239,{"$f":"IFERROR(SUMIFS(D_D[INV],D_D[MT],2,D_D[CAT],TA_22,D_D[EP],-1, D_D[LOC],$A60),0)","v":861},{"$f":"IFERROR(SUMIFS(D_D[BL],D_D[MT],2,D_D[CAT],TA_22,D_D[EP],-1, D_D[LOC],$A60),0)","v":127},0.14750290360046459,{"$f":"IFERROR(SUMIFS(D_D[INV],D_D[MT],2,D_D[CAT],TA_23,D_D[EP],-1, D_D[LOC],$A60),0)","v":35},{"$f":"IFERROR(SUMIFS(D_D[BL],D_D[MT],2,D_D[CAT],TA_23,D_D[EP],-1, D_D[LOC],$A60),0)","v":2},5.7142857142857141E-2,{"$f":"IFERROR(SUMIFS(D_D[INV],D_D[MT],2,D_D[CAT],TA_24,D_D[EP],-1, D_D[LOC],$A60),0)","v":200},{"$f":"IFERROR(SUMIFS(D_D[BL],D_D[MT],2,D_D[CAT],TA_24,D_D[EP],-1, D_D[LOC],$A60),0)","v":153},0.76500000000000001,{"$f":"IFERROR(SUMIFS(D_D[INV],D_D[MT],2,D_D[CAT],TA_25,D_D[EP],-1, D_D[LOC],$A60),0)","v":11},{"$f":"IFERROR(SUMIFS(D_D[INV],D_D[MT],2,D_D[CAT],TA_26,D_D[EP],-1, D_D[LOC],$A60),0)","v":3},{"$f":"IFERROR(SUMIFS(D_D[INV],D_D[MT],7,D_D[CAT],2,D_D[EP],TA_20, D_D[LOC],$A60),0)","v":1}]
["459","Honolulu",{"$f":"IFERROR(SUMIFS(D_D[INV],D_D[MT],1,D_D[CAT],TA_20,D_D[EP],-1, D_D[LOC],$A61),0)","v":354},{"$f":"IFERROR(SUMIFS(D_D[ADP],D_D[MT],1,D_D[CAT],D$1,D_D[EP],-1, D_D[LOC],$A61),0)","v":39.950000000000003},{"$f":"IFERROR(SUMIFS(D_D[INV],D_D[MT],2,D_D[CAT],TA_21,D_D[EP],-1, D_D[LOC],$A61),0)","v":3306},{"$f":"IFERROR(SUMIFS(D_D[BL],D_D[MT],2,D_D[CAT],TA_21,D_D[EP],-1, D_D[LOC],$A61),0)","v":992},0.30006049606775559,{"$f":"IFERROR(SUMIFS(D_D[INV],D_D[MT],2,D_D[CAT],TA_22,D_D[EP],-1, D_D[LOC],$A61),0)","v":874},{"$f":"IFERROR(SUMIFS(D_D[BL],D_D[MT],2,D_D[CAT],TA_22,D_D[EP],-1, D_D[LOC],$A61),0)","v":105},0.12013729977116705,{"$f":"IFERROR(SUMIFS(D_D[INV],D_D[MT],2,D_D[CAT],TA_23,D_D[EP],-1, D_D[LOC],$A61),0)","v":13},{"$f":"IFERROR(SUMIFS(D_D[BL],D_D[MT],2,D_D[CAT],TA_23,D_D[EP],-1, D_D[LOC],$A61),0)","v":0},0,{"$f":"IFERROR(SUMIFS(D_D[INV],D_D[MT],2,D_D[CAT],TA_24,D_D[EP],-1, D_D[LOC],$A61),0)","v":227},{"$f":"IFERROR(SUMIFS(D_D[BL],D_D[MT],2,D_D[CAT],TA_24,D_D[EP],-1, D_D[LOC],$A61),0)","v":105},0.46255506607929514,{"$f":"IFERROR(SUMIFS(D_D[INV],D_D[MT],2,D_D[CAT],TA_25,D_D[EP],-1, D_D[LOC],$A61),0)","v":18},{"$f":"IFERROR(SUMIFS(D_D[INV],D_D[MT],2,D_D[CAT],TA_26,D_D[EP],-1, D_D[LOC],$A61),0)","v":0},{"$f":"IFERROR(SUMIFS(D_D[INV],D_D[MT],7,D_D[CAT],2,D_D[EP],TA_20, D_D[LOC],$A61),0)","v":2}]
["344","Los Angeles",{"$f":"IFERROR(SUMIFS(D_D[INV],D_D[MT],1,D_D[CAT],TA_20,D_D[EP],-1, D_D[LOC],$A62),0)","v":1317},{"$f":"IFERROR(SUMIFS(D_D[ADP],D_D[MT],1,D_D[CAT],D$1,D_D[EP],-1, D_D[LOC],$A62),0)","v":43.66},{"$f":"IFERROR(SUMIFS(D_D[INV],D_D[MT],2,D_D[CAT],TA_21,D_D[EP],-1, D_D[LOC],$A62),0)","v":10300},{"$f":"IFERROR(SUMIFS(D_D[BL],D_D[MT],2,D_D[CAT],TA_21,D_D[EP],-1, D_D[LOC],$A62),0)","v":2954},0.28679611650485437,{"$f":"IFERROR(SUMIFS(D_D[INV],D_D[MT],2,D_D[CAT],TA_22,D_D[EP],-1, D_D[LOC],$A62),0)","v":2428},{"$f":"IFERROR(SUMIFS(D_D[BL],D_D[MT],2,D_D[CAT],TA_22,D_D[EP],-1, D_D[LOC],$A62),0)","v":274},0.1128500823723229,{"$f":"IFERROR(SUMIFS(D_D[INV],D_D[MT],2,D_D[CAT],TA_23,D_D[EP],-1, D_D[LOC],$A62),0)","v":125},{"$f":"IFERROR(SUMIFS(D_D[BL],D_D[MT],2,D_D[CAT],TA_23,D_D[EP],-1, D_D[LOC],$A62),0)","v":4},3.2000000000000001E-2,{"$f":"IFERROR(SUMIFS(D_D[INV],D_D[MT],2,D_D[CAT],TA_24,D_D[EP],-1, D_D[LOC],$A62),0)","v":779},{"$f":"IFERROR(SUMIFS(D_D[BL],D_D[MT],2,D_D[CAT],TA_24,D_D[EP],-1, D_D[LOC],$A62),0)","v":441},0.56611039794608475,{"$f":"IFERROR(SUMIFS(D_D[INV],D_D[MT],2,D_D[CAT],TA_25,D_D[EP],-1, D_D[LOC],$A62),0)","v":77},{"$f":"IFERROR(SUMIFS(D_D[INV],D_D[MT],2,D_D[CAT],TA_26,D_D[EP],-1, D_D[LOC],$A62),0)","v":5},{"$f":"IFERROR(SUMIFS(D_D[INV],D_D[MT],7,D_D[CAT],2,D_D[EP],TA_20, D_D[LOC],$A62),0)","v":10}]
["358","Manila",{"$f":"IFERROR(SUMIFS(D_D[INV],D_D[MT],1,D_D[CAT],TA_20,D_D[EP],-1, D_D[LOC],$A63),0)","v":122},{"$f":"IFERROR(SUMIFS(D_D[ADP],D_D[MT],1,D_D[CAT],D$1,D_D[EP],-1, D_D[LOC],$A63),0)","v":112.47},{"$f":"IFERROR(SUMIFS(D_D[INV],D_D[MT],2,D_D[CAT],TA_21,D_D[EP],-1, D_D[LOC],$A63),0)","v":421},{"$f":"IFERROR(SUMIFS(D_D[BL],D_D[MT],2,D_D[CAT],TA_21,D_D[EP],-1, D_D[LOC],$A63),0)","v":157},0.37292161520190026,{"$f":"IFERROR(SUMIFS(D_D[INV],D_D[MT],2,D_D[CAT],TA_22,D_D[EP],-1, D_D[LOC],$A63),0)","v":426},{"$f":"IFERROR(SUMIFS(D_D[BL],D_D[MT],2,D_D[CAT],TA_22,D_D[EP],-1, D_D[LOC],$A63),0)","v":113},0.26525821596244131,{"$f":"IFERROR(SUMIFS(D_D[INV],D_D[MT],2,D_D[CAT],TA_23,D_D[EP],-1, D_D[LOC],$A63),0)","v":6},{"$f":"IFERROR(SUMIFS(D_D[BL],D_D[MT],2,D_D[CAT],TA_23,D_D[EP],-1, D_D[LOC],$A63),0)","v":1},0.16666666666666666,{"$f":"IFERROR(SUMIFS(D_D[INV],D_D[MT],2,D_D[CAT],TA_24,D_D[EP],-1, D_D[LOC],$A63),0)","v":86},{"$f":"IFERROR(SUMIFS(D_D[BL],D_D[MT],2,D_D[CAT],TA_24,D_D[EP],-1, D_D[LOC],$A63),0)","v":43},0.5,{"$f":"IFERROR(SUMIFS(D_D[INV],D_D[MT],2,D_D[CAT],TA_25,D_D[EP],-1, D_D[LOC],$A63),0)","v":24},{"$f":"IFERROR(SUMIFS(D_D[INV],D_D[MT],2,D_D[CAT],TA_26,D_D[EP],-1, D_D[LOC],$A63),0)","v":2},{"$f":"IFERROR(SUMIFS(D_D[INV],D_D[MT],7,D_D[CAT],2,D_D[EP],TA_20, D_D[LOC],$A63),0)","v":75}]
["343","Oakland",{"$f":"IFERROR(SUMIFS(D_D[INV],D_D[MT],1,D_D[CAT],TA_20,D_D[EP],-1, D_D[LOC],$A64),0)","v":1256},{"$f":"IFERROR(SUMIFS(D_D[ADP],D_D[MT],1,D_D[CAT],D$1,D_D[EP],-1, D_D[LOC],$A64),0)","v":35.380000000000003},{"$f":"IFERROR(SUMIFS(D_D[INV],D_D[MT],2,D_D[CAT],TA_21,D_D[EP],-1, D_D[LOC],$A64),0)","v":10637},{"$f":"IFERROR(SUMIFS(D_D[BL],D_D[MT],2,D_D[CAT],TA_21,D_D[EP],-1, D_D[LOC],$A64),0)","v":3153},0.29641816301588791,{"$f":"IFERROR(SUMIFS(D_D[INV],D_D[MT],2,D_D[CAT],TA_22,D_D[EP],-1, D_D[LOC],$A64),0)","v":2567},{"$f":"IFERROR(SUMIFS(D_D[BL],D_D[MT],2,D_D[CAT],TA_22,D_D[EP],-1, D_D[LOC],$A64),0)","v":247},9.6221269964939612E-2,{"$f":"IFERROR(SUMIFS(D_D[INV],D_D[MT],2,D_D[CAT],TA_23,D_D[EP],-1, D_D[LOC],$A64),0)","v":152},{"$f":"IFERROR(SUMIFS(D_D[BL],D_D[MT],2,D_D[CAT],TA_23,D_D[EP],-1, D_D[LOC],$A64),0)","v":2},1.3157894736842105E-2,{"$f":"IFERROR(SUMIFS(D_D[INV],D_D[MT],2,D_D[CAT],TA_24,D_D[EP],-1, D_D[LOC],$A64),0)","v":1143},{"$f":"IFERROR(SUMIFS(D_D[BL],D_D[MT],2,D_D[CAT],TA_24,D_D[EP],-1, D_D[LOC],$A64),0)","v":801},0.70078740157480313,{"$f":"IFERROR(SUMIFS(D_D[INV],D_D[MT],2,D_D[CAT],TA_25,D_D[EP],-1, D_D[LOC],$A64),0)","v":110},{"$f":"IFERROR(SUMIFS(D_D[INV],D_D[MT],2,D_D[CAT],TA_26,D_D[EP],-1, D_D[LOC],$A64),0)","v":2},{"$f":"IFERROR(SUMIFS(D_D[INV],D_D[MT],7,D_D[CAT],2,D_D[EP],TA_20, D_D[LOC],$A64),0)","v":3}]
["345","Phoenix",{"$f":"IFERROR(SUMIFS(D_D[INV],D_D[MT],1,D_D[CAT],TA_20,D_D[EP],-1, D_D[LOC],$A65),0)","v":1181},{"$f":"IFERROR(SUMIFS(D_D[ADP],D_D[MT],1,D_D[CAT],D$1,D_D[EP],-1, D_D[LOC],$A65),0)","v":44.33},{"$f":"IFERROR(SUMIFS(D_D[INV],D_D[MT],2,D_D[CAT],TA_21,D_D[EP],-1, D_D[LOC],$A65),0)","v":7400},{"$f":"IFERROR(SUMIFS(D_D[BL],D_D[MT],2,D_D[CAT],TA_21,D_D[EP],-1, D_D[LOC],$A65),0)","v":2081},0.28121621621621623,{"$f":"IFERROR(SUMIFS(D_D[INV],D_D[MT],2,D_D[CAT],TA_22,D_D[EP],-1, D_D[LOC],$A65),0)","v":2199},{"$f":"IFERROR(SUMIFS(D_D[BL],D_D[MT],2,D_D[CAT],TA_22,D_D[EP],-1, D_D[LOC],$A65),0)","v":268},0.12187357889949978,{"$f":"IFERROR(SUMIFS(D_D[INV],D_D[MT],2,D_D[CAT],TA_23,D_D[EP],-1, D_D[LOC],$A65),0)","v":92},{"$f":"IFERROR(SUMIFS(D_D[BL],D_D[MT],2,D_D[CAT],TA_23,D_D[EP],-1, D_D[LOC],$A65),0)","v":3},3.2608695652173912E-2,{"$f":"IFERROR(SUMIFS(D_D[INV],D_D[MT],2,D_D[CAT],TA_24,D_D[EP],-1, D_D[LOC],$A65),0)","v":1097},{"$f":"IFERROR(SUMIFS(D_D[BL],D_D[MT],2,D_D[CAT],TA_24,D_D[EP],-1, D_D[LOC],$A65),0)","v":878},0.8003646308113036,{"$f":"IFERROR(SUMIFS(D_D[INV],D_D[MT],2,D_D[CAT],TA_25,D_D[EP],-1, D_D[LOC],$A65),0)","v":146},{"$f":"IFERROR(SUMIFS(D_D[INV],D_D[MT],2,D_D[CAT],TA_26,D_D[EP],-1, D_D[LOC],$A65),0)","v":1568},{"$f":"IFERROR(SUMIFS(D_D[INV],D_D[MT],7,D_D[CAT],2,D_D[EP],TA_20, D_D[LOC],$A65),0)","v":2}]
["348","Portland",{"$f":"IFERROR(SUMIFS(D_D[INV],D_D[MT],1,D_D[CAT],TA_20,D_D[EP],-1, D_D[LOC],$A66),0)","v":740},{"$f":"IFERROR(SUMIFS(D_D[ADP],D_D[MT],1,D_D[CAT],D$1,D_D[EP],-1, D_D[LOC],$A66),0)","v":31.03},{"$f":"IFERROR(SUMIFS(D_D[INV],D_D[MT],2,D_D[CAT],TA_21,D_D[EP],-1, D_D[LOC],$A66),0)","v":4176},{"$f":"IFERROR(SUMIFS(D_D[BL],D_D[MT],2,D_D[CAT],TA_21,D_D[EP],-1, D_D[LOC],$A66),0)","v":1371},0.32830459770114945,{"$f":"IFERROR(SUMIFS(D_D[INV],D_D[MT],2,D_D[CAT],TA_22,D_D[EP],-1, D_D[LOC],$A66),0)","v":1462},{"$f":"IFERROR(SUMIFS(D_D[BL],D_D[MT],2,D_D[CAT],TA_22,D_D[EP],-1, D_D[LOC],$A66),0)","v":161},0.11012311901504789,{"$f":"IFERROR(SUMIFS(D_D[INV],D_D[MT],2,D_D[CAT],TA_23,D_D[EP],-1, D_D[LOC],$A66),0)","v":54},{"$f":"IFERROR(SUMIFS(D_D[BL],D_D[MT],2,D_D[CAT],TA_23,D_D[EP],-1, D_D[LOC],$A66),0)","v":1},1.8518518518518517E-2,{"$f":"IFERROR(SUMIFS(D_D[INV],D_D[MT],2,D_D[CAT],TA_24,D_D[EP],-1, D_D[LOC],$A66),0)","v":461},{"$f":"IFERROR(SUMIFS(D_D[BL],D_D[MT],2,D_D[CAT],TA_24,D_D[EP],-1, D_D[LOC],$A66),0)","v":337},0.73101952277657267,{"$f":"IFERROR(SUMIFS(D_D[INV],D_D[MT],2,D_D[CAT],TA_25,D_D[EP],-1, D_D[LOC],$A66),0)","v":70},{"$f":"IFERROR(SUMIFS(D_D[INV],D_D[MT],2,D_D[CAT],TA_26,D_D[EP],-1, D_D[LOC],$A66),0)","v":4},{"$f":"IFERROR(SUMIFS(D_D[INV],D_D[MT],7,D_D[CAT],2,D_D[EP],TA_20, D_D[LOC],$A66),0)","v":4}]
["354","Reno",{"$f":"IFERROR(SUMIFS(D_D[INV],D_D[MT],1,D_D[CAT],TA_20,D_D[EP],-1, D_D[LOC],$A67),0)","v":537},{"$f":"IFERROR(SUMIFS(D_D[ADP],D_D[MT],1,D_D[CAT],D$1,D_D[EP],-1, D_D[LOC],$A67),0)","v":38.74},{"$f":"IFERROR(SUMIFS(D_D[INV],D_D[MT],2,D_D[CAT],TA_21,D_D[EP],-1, D_D[LOC],$A67),0)","v":5055},{"$f":"IFERROR(SUMIFS(D_D[BL],D_D[MT],2,D_D[CAT],TA_21,D_D[EP],-1, D_D[LOC],$A67),0)","v":1441},0.2850642927794263,{"$f":"IFERROR(SUMIFS(D_D[INV],D_D[MT],2,D_D[CAT],TA_22,D_D[EP],-1, D_D[LOC],$A67),0)","v":1028},{"$f":"IFERROR(SUMIFS(D_D[BL],D_D[MT],2,D_D[CAT],TA_22,D_D[EP],-1, D_D[LOC],$A67),0)","v":104},0.10116731517509728,{"$f":"IFERROR(SUMIFS(D_D[INV],D_D[MT],2,D_D[CAT],TA_23,D_D[EP],-1, D_D[LOC],$A67),0)","v":48},{"$f":"IFERROR(SUMIFS(D_D[BL],D_D[MT],2,D_D[CAT],TA_23,D_D[EP],-1, D_D[LOC],$A67),0)","v":0},0,{"$f":"IFERROR(SUMIFS(D_D[INV],D_D[MT],2,D_D[CAT],TA_24,D_D[EP],-1, D_D[LOC],$A67),0)","v":528},{"$f":"IFERROR(SUMIFS(D_D[BL],D_D[MT],2,D_D[CAT],TA_24,D_D[EP],-1, D_D[LOC],$A67),0)","v":398},0.75378787878787878,{"$f":"IFERROR(SUMIFS(D_D[INV],D_D[MT],2,D_D[CAT],TA_25,D_D[EP],-1, D_D[LOC],$A67),0)","v":38},{"$f":"IFERROR(SUMIFS(D_D[INV],D_D[MT],2,D_D[CAT],TA_26,D_D[EP],-1, D_D[LOC],$A67),0)","v":1},{"$f":"IFERROR(SUMIFS(D_D[INV],D_D[MT],7,D_D[CAT],2,D_D[EP],TA_20, D_D[LOC],$A67),0)","v":7}]
["341","Salt Lake City",{"$f":"IFERROR(SUMIFS(D_D[INV],D_D[MT],1,D_D[CAT],TA_20,D_D[EP],-1, D_D[LOC],$A68),0)","v":2502},{"$f":"IFERROR(SUMIFS(D_D[ADP],D_D[MT],1,D_D[CAT],D$1,D_D[EP],-1, D_D[LOC],$A68),0)","v":49.66},{"$f":"IFERROR(SUMIFS(D_D[INV],D_D[MT],2,D_D[CAT],TA_21,D_D[EP],-1, D_D[LOC],$A68),0)","v":2897},{"$f":"IFERROR(SUMIFS(D_D[BL],D_D[MT],2,D_D[CAT],TA_21,D_D[EP],-1, D_D[LOC],$A68),0)","v":811},0.2799447704521919,{"$f":"IFERROR(SUMIFS(D_D[INV],D_D[MT],2,D_D[CAT],TA_22,D_D[EP],-1, D_D[LOC],$A68),0)","v":3142},{"$f":"IFERROR(SUMIFS(D_D[BL],D_D[MT],2,D_D[CAT],TA_22,D_D[EP],-1, D_D[LOC],$A68),0)","v":225},7.1610439210693821E-2,{"$f":"IFERROR(SUMIFS(D_D[INV],D_D[MT],2,D_D[CAT],TA_23,D_D[EP],-1, D_D[LOC],$A68),0)","v":26},{"$f":"IFERROR(SUMIFS(D_D[BL],D_D[MT],2,D_D[CAT],TA_23,D_D[EP],-1, D_D[LOC],$A68),0)","v":1},3.8461538461538464E-2,{"$f":"IFERROR(SUMIFS(D_D[INV],D_D[MT],2,D_D[CAT],TA_24,D_D[EP],-1, D_D[LOC],$A68),0)","v":2113},{"$f":"IFERROR(SUMIFS(D_D[BL],D_D[MT],2,D_D[CAT],TA_24,D_D[EP],-1, D_D[LOC],$A68),0)","v":1943},0.91954566966398488,{"$f":"IFERROR(SUMIFS(D_D[INV],D_D[MT],2,D_D[CAT],TA_25,D_D[EP],-1, D_D[LOC],$A68),0)","v":153},{"$f":"IFERROR(SUMIFS(D_D[INV],D_D[MT],2,D_D[CAT],TA_26,D_D[EP],-1, D_D[LOC],$A68),0)","v":5290},{"$f":"IFERROR(SUMIFS(D_D[INV],D_D[MT],7,D_D[CAT],2,D_D[EP],TA_20, D_D[LOC],$A68),0)","v":5}]
["377","San Diego",{"$f":"IFERROR(SUMIFS(D_D[INV],D_D[MT],1,D_D[CAT],TA_20,D_D[EP],-1, D_D[LOC],$A69),0)","v":2420},{"$f":"IFERROR(SUMIFS(D_D[ADP],D_D[MT],1,D_D[CAT],D$1,D_D[EP],-1, D_D[LOC],$A69),0)","v":57.4},{"$f":"IFERROR(SUMIFS(D_D[INV],D_D[MT],2,D_D[CAT],TA_21,D_D[EP],-1, D_D[LOC],$A69),0)","v":12122},{"$f":"IFERROR(SUMIFS(D_D[BL],D_D[MT],2,D_D[CAT],TA_21,D_D[EP],-1, D_D[LOC],$A69),0)","v":3369},{"$f":"IFERROR(F69/E69,\"0%\")","v":0.27792443491173074},{"$f":"IFERROR(SUMIFS(D_D[INV],D_D[MT],2,D_D[CAT],TA_22,D_D[EP],-1, D_D[LOC],$A69),0)","v":11478},{"$f":"IFERROR(SUMIFS(D_D[BL],D_D[MT],2,D_D[CAT],TA_22,D_D[EP],-1, D_D[LOC],$A69),0)","v":3092},{"$f":"IFERROR(I69/H69,\"0%\")","v":0.26938491026311207},{"$f":"IFERROR(SUMIFS(D_D[INV],D_D[MT],2,D_D[CAT],TA_23,D_D[EP],-1, D_D[LOC],$A69),0)","v":189},{"$f":"IFERROR(SUMIFS(D_D[BL],D_D[MT],2,D_D[CAT],TA_23,D_D[EP],-1, D_D[LOC],$A69),0)","v":21},{"$f":"IFERROR(L69/K69,\"0%\")","v":0.1111111111111111},{"$f":"IFERROR(SUMIFS(D_D[INV],D_D[MT],2,D_D[CAT],TA_24,D_D[EP],-1, D_D[LOC],$A69),0)","v":955},{"$f":"IFERROR(SUMIFS(D_D[BL],D_D[MT],2,D_D[CAT],TA_24,D_D[EP],-1, D_D[LOC],$A69),0)","v":517},{"$f":"IFERROR(O69/N69,\"0%\")","v":0.54136125654450262},{"$f":"IFERROR(SUMIFS(D_D[INV],D_D[MT],2,D_D[CAT],TA_25,D_D[EP],-1, D_D[LOC],$A69),0)","v":64},{"$f":"IFERROR(SUMIFS(D_D[INV],D_D[MT],2,D_D[CAT],TA_26,D_D[EP],-1, D_D[LOC],$A69),0)","v":5},{"$f":"IFERROR(SUMIFS(D_D[INV],D_D[MT],7,D_D[CAT],2,D_D[EP],TA_20, D_D[LOC],$A69),0)","v":3}]
["346","Seattle",{"$f":"IFERROR(SUMIFS(D_D[INV],D_D[MT],1,D_D[CAT],TA_20,D_D[EP],-1, D_D[LOC],$A70),0)","v":2133},{"$f":"IFERROR(SUMIFS(D_D[ADP],D_D[MT],1,D_D[CAT],D$1,D_D[EP],-1, D_D[LOC],$A70),0)","v":58.74},{"$f":"IFERROR(SUMIFS(D_D[INV],D_D[MT],2,D_D[CAT],TA_21,D_D[EP],-1, D_D[LOC],$A70),0)","v":11768},{"$f":"IFERROR(SUMIFS(D_D[BL],D_D[MT],2,D_D[CAT],TA_21,D_D[EP],-1, D_D[LOC],$A70),0)","v":3827},0.32520394289598914,{"$f":"IFERROR(SUMIFS(D_D[INV],D_D[MT],2,D_D[CAT],TA_22,D_D[EP],-1, D_D[LOC],$A70),0)","v":4281},{"$f":"IFERROR(SUMIFS(D_D[BL],D_D[MT],2,D_D[CAT],TA_22,D_D[EP],-1, D_D[LOC],$A70),0)","v":816},0.19060967063770148,{"$f":"IFERROR(SUMIFS(D_D[INV],D_D[MT],2,D_D[CAT],TA_23,D_D[EP],-1, D_D[LOC],$A70),0)","v":123},{"$f":"IFERROR(SUMIFS(D_D[BL],D_D[MT],2,D_D[CAT],TA_23,D_D[EP],-1, D_D[LOC],$A70),0)","v":5},4.065040650406504E-2,{"$f":"IFERROR(SUMIFS(D_D[INV],D_D[MT],2,D_D[CAT],TA_24,D_D[EP],-1, D_D[LOC],$A70),0)","v":4198},{"$f":"IFERROR(SUMIFS(D_D[BL],D_D[MT],2,D_D[CAT],TA_24,D_D[EP],-1, D_D[LOC],$A70),0)","v":1767},0.42091472129585517,{"$f":"IFERROR(SUMIFS(D_D[INV],D_D[MT],2,D_D[CAT],TA_25,D_D[EP],-1, D_D[LOC],$A70),0)","v":91},{"$f":"IFERROR(SUMIFS(D_D[INV],D_D[MT],2,D_D[CAT],TA_26,D_D[EP],-1, D_D[LOC],$A70),0)","v":40},{"$f":"IFERROR(SUMIFS(D_D[INV],D_D[MT],7,D_D[CAT],2,D_D[EP],TA_20, D_D[LOC],$A70),0)","v":1}]
[35,"Other",{"$f":"IFERROR(SUMIFS(D_D[INV],D_D[MT],1,D_D[CAT],TA_20,D_D[EP],-1, D_D[LOC],$A71),0)","v":22861},{"$f":"IFERROR(SUMIFS(D_D[ADP],D_D[MT],1,D_D[CAT],D$1,D_D[EP],-1, D_D[LOC],$A71),0)","v":93.3},{"$f":"IFERROR(SUMIFS(D_D[INV],D_D[MT],2,D_D[CAT],TA_21,D_D[EP],-1, D_D[LOC],$A71),0)","v":149890},{"$f":"IFERROR(SUMIFS(D_D[BL],D_D[MT],2,D_D[CAT],TA_21,D_D[EP],-1, D_D[LOC],$A71),0)","v":42185},0.28143972246313964,{"$f":"IFERROR(SUMIFS(D_D[INV],D_D[MT],2,D_D[CAT],TA_22,D_D[EP],-1, D_D[LOC],$A71),0)","v":23607},{"$f":"IFERROR(SUMIFS(D_D[BL],D_D[MT],2,D_D[CAT],TA_22,D_D[EP],-1, D_D[LOC],$A71),0)","v":5406},0.22899987291904944,{"$f":"IFERROR(SUMIFS(D_D[INV],D_D[MT],2,D_D[CAT],TA_23,D_D[EP],-1, D_D[LOC],$A71),0)","v":118},{"$f":"IFERROR(SUMIFS(D_D[BL],D_D[MT],2,D_D[CAT],TA_23,D_D[EP],-1, D_D[LOC],$A71),0)","v":15},0.1271186440677966,{"$f":"IFERROR(SUMIFS(D_D[INV],D_D[MT],2,D_D[CAT],TA_24,D_D[EP],-1, D_D[LOC],$A71),0)","v":48155},{"$f":"IFERROR(SUMIFS(D_D[BL],D_D[MT],2,D_D[CAT],TA_24,D_D[EP],-1, D_D[LOC],$A71),0)","v":28639},0.59472536600560688,{"$f":"IFERROR(SUMIFS(D_D[INV],D_D[MT],2,D_D[CAT],TA_25,D_D[EP],-1, D_D[LOC],$A71),0)","v":2665},{"$f":"IFERROR(SUMIFS(D_D[INV],D_D[MT],2,D_D[CAT],TA_26,D_D[EP],-1, D_D[LOC],$A71),0)","v":654},{"$f":"IFERROR(SUMIFS(D_D[INV],D_D[MT],7,D_D[CAT],2,D_D[EP],TA_20, D_D[LOC],$A71),0)","v":28633}]
[]
[null,null,"Pension"]
[null,null,"Non-Rating",null,"Entitlement   ",null,null,"Award Adjustment ",null,null,"Program Review ",null,null,"Other",null,null,"Burial  ","Accrued  ","Appeals"]
[null,null,"Claims Pending","Avg. Days Pending","Claims Pending","Pending over 125 days","Percent Pending over 125 days","Claims Pending","Pending over 125 days","Percent Pending over 125 days","Claims Pending","Pending over 125 days","Percent Pending over 125 days","Claims Pending","Pending over 125 days","Percent Pending over 125 days","Claims Pending","Claims Pending","Appeals Pending"]
[100,"USA Pension",{"$f":"IFERROR(SUMIFS(D_D[INV],D_D[MT],1,D_D[CAT],TA_30,D_D[EP],-1, D_D[LOC],$A76),0)","v":5716},{"$f":"IFERROR(SUMIFS(D_D[ADP],D_D[MT],1,D_D[CAT],TA_30,D_D[EP],-1, D_D[LOC],$A76),0)","v":67.56},{"$f":"IFERROR(SUMIFS(D_D[INV],D_D[MT],2,D_D[CAT],TA_31,D_D[EP],-1, D_D[LOC],$A76),0)","v":15647},{"$f":"IFERROR(SUMIFS(D_D[BL],D_D[MT],2,D_D[CAT],TA_31,D_D[EP],-1, D_D[LOC],$A76),0)","v":1190},{"$f":"IFERROR(F76/E76,\"0%\")","v":7.6052917492171024E-2},{"$f":"IFERROR(SUMIFS(D_D[INV],D_D[MT],2,D_D[CAT],TA_32,D_D[EP],-1, D_D[LOC],$A76),0)","v":5863},{"$f":"IFERROR(SUMIFS(D_D[BL],D_D[MT],2,D_D[CAT],TA_32,D_D[EP],-1, D_D[LOC],$A76),0)","v":1008},{"$f":"IFERROR(I76/H76,\"0%\")","v":0.1719256353402695},{"$f":"IFERROR(SUMIFS(D_D[INV],D_D[MT],2,D_D[CAT],TA_33,D_D[EP],-1, D_D[LOC],$A76),0)","v":4830},{"$f":"IFERROR(SUMIFS(D_D[BL],D_D[MT],2,D_D[CAT],TA_33,D_D[EP],-1, D_D[LOC],$A76),0)","v":596},{"$f":"IFERROR(L76/K76,\"0%\")","v":0.12339544513457557},{"$f":"IFERROR(SUMIFS(D_D[INV],D_D[MT],2,D_D[CAT],TA_34,D_D[EP],-1, D_D[LOC],$A76),0)","v":118},{"$f":"IFERROR(SUMIFS(D_D[BL],D_D[MT],2,D_D[CAT],TA_34,D_D[EP],-1, D_D[LOC],$A76),0)","v":18},{"$f":"IFERROR(O76/N76,\"0%\")","v":0.15254237288135594},{"$f":"IFERROR(SUMIFS(D_D[INV],D_D[MT],2,D_D[CAT],TA_35,D_D[EP],-1, D_D[LOC],$A76),0)","v":0},{"$f":"IFERROR(SUMIFS(D_D[INV],D_D[MT],2,D_D[CAT],TA_36,D_D[EP],-1, D_D[LOC],$A76),0)","v":3420},{"$f":"IFERROR(SUMIFS(D_D[INV],D_D[MT],7,D_D[CAT],2,D_D[EP],TA_30, D_D[LOC],$A76),0)","v":338}]
["310","Philadelphia PMC",{"$f":"IFERROR(SUMIFS(D_D[INV],D_D[MT],1,D_D[CAT],TA_30,D_D[EP],-1, D_D[LOC],$A77),0)","v":318},{"$f":"IFERROR(SUMIFS(D_D[ADP],D_D[MT],1,D_D[CAT],TA_30,D_D[EP],-1, D_D[LOC],$A77),0)","v":59.75},{"$f":"IFERROR(SUMIFS(D_D[INV],D_D[MT],2,D_D[CAT],TA_31,D_D[EP],-1, D_D[LOC],$A77),0)","v":1025},{"$f":"IFERROR(SUMIFS(D_D[BL],D_D[MT],2,D_D[CAT],TA_31,D_D[EP],-1, D_D[LOC],$A77),0)","v":79},{"$f":"IFERROR(F77/E77,\"0%\")","v":7.7073170731707316E-2},{"$f":"IFERROR(SUMIFS(D_D[INV],D_D[MT],2,D_D[CAT],TA_32,D_D[EP],-1, D_D[LOC],$A77),0)","v":337},{"$f":"IFERROR(SUMIFS(D_D[BL],D_D[MT],2,D_D[CAT],TA_32,D_D[EP],-1, D_D[LOC],$A77),0)","v":25},{"$f":"IFERROR(I77/H77,\"0%\")","v":7.418397626112759E-2},{"$f":"IFERROR(SUMIFS(D_D[INV],D_D[MT],2,D_D[CAT],TA_33,D_D[EP],-1, D_D[LOC],$A77),0)","v":154},{"$f":"IFERROR(SUMIFS(D_D[BL],D_D[MT],2,D_D[CAT],TA_33,D_D[EP],-1, D_D[LOC],$A77),0)","v":154},{"$f":"IFERROR(L77/K77,\"0%\")","v":1},{"$f":"IFERROR(SUMIFS(D_D[INV],D_D[MT],2,D_D[CAT],TA_34,D_D[EP],-1, D_D[LOC],$A77),0)","v":0},{"$f":"IFERROR(SUMIFS(D_D[BL],D_D[MT],2,D_D[CAT],TA_34,D_D[EP],-1, D_D[LOC],$A77),0)","v":0},{"$f":"IFERROR(O77/N77,\"0%\")","v":"0%"},{"$f":"IFERROR(SUMIFS(D_D[INV],D_D[MT],2,D_D[CAT],TA_35,D_D[EP],-1, D_D[LOC],$A77),0)","v":0},{"$f":"IFERROR(SUMIFS(D_D[INV],D_D[MT],2,D_D[CAT],TA_36,D_D[EP],-1, D_D[LOC],$A77),0)","v":1928},{"$f":"IFERROR(SUMIFS(D_D[INV],D_D[MT],7,D_D[CAT],2,D_D[EP],TA_30, D_D[LOC],$A77),0)","v":1}]
["330","Milwaukee PMC",{"$f":"IFERROR(SUMIFS(D_D[INV],D_D[MT],1,D_D[CAT],TA_30,D_D[EP],-1, D_D[LOC],$A78),0)","v":1424},{"$f":"IFERROR(SUMIFS(D_D[ADP],D_D[MT],1,D_D[CAT],TA_30,D_D[EP],-1, D_D[LOC],$A78),0)","v":62.82},{"$f":"IFERROR(SUMIFS(D_D[INV],D_D[MT],2,D_D[CAT],TA_31,D_D[EP],-1, D_D[LOC],$A78),0)","v":995},{"$f":"IFERROR(SUMIFS(D_D[BL],D_D[MT],2,D_D[CAT],TA_31,D_D[EP],-1, D_D[LOC],$A78),0)","v":124},0.12462311557788945,{"$f":"IFERROR(SUMIFS(D_D[INV],D_D[MT],2,D_D[CAT],TA_32,D_D[EP],-1, D_D[LOC],$A78),0)","v":1511},{"$f":"IFERROR(SUMIFS(D_D[BL],D_D[MT],2,D_D[CAT],TA_32,D_D[EP],-1, D_D[LOC],$A78),0)","v":222},0.14692256783587029,{"$f":"IFERROR(SUMIFS(D_D[INV],D_D[MT],2,D_D[CAT],TA_33,D_D[EP],-1, D_D[LOC],$A78),0)","v":233},{"$f":"IFERROR(SUMIFS(D_D[BL],D_D[MT],2,D_D[CAT],TA_33,D_D[EP],-1, D_D[LOC],$A78),0)","v":187},0.80257510729613735,{"$f":"IFERROR(SUMIFS(D_D[INV],D_D[MT],2,D_D[CAT],TA_34,D_D[EP],-1, D_D[LOC],$A78),0)","v":0},{"$f":"IFERROR(SUMIFS(D_D[BL],D_D[MT],2,D_D[CAT],TA_34,D_D[EP],-1, D_D[LOC],$A78),0)","v":0},"0%",{"$f":"IFERROR(SUMIFS(D_D[INV],D_D[MT],2,D_D[CAT],TA_35,D_D[EP],-1, D_D[LOC],$A78),0)","v":0},{"$f":"IFERROR(SUMIFS(D_D[INV],D_D[MT],2,D_D[CAT],TA_36,D_D[EP],-1, D_D[LOC],$A78),0)","v":545},{"$f":"IFERROR(SUMIFS(D_D[INV],D_D[MT],7,D_D[CAT],2,D_D[EP],TA_30, D_D[LOC],$A78),0)","v":1}]
["335","St. Paul PMC",{"$f":"IFERROR(SUMIFS(D_D[INV],D_D[MT],1,D_D[CAT],TA_30,D_D[EP],-1, D_D[LOC],$A79),0)","v":1354},{"$f":"IFERROR(SUMIFS(D_D[ADP],D_D[MT],1,D_D[CAT],TA_30,D_D[EP],-1, D_D[LOC],$A79),0)","v":62.93},{"$f":"IFERROR(SUMIFS(D_D[INV],D_D[MT],2,D_D[CAT],TA_31,D_D[EP],-1, D_D[LOC],$A79),0)","v":1161},{"$f":"IFERROR(SUMIFS(D_D[BL],D_D[MT],2,D_D[CAT],TA_31,D_D[EP],-1, D_D[LOC],$A79),0)","v":94},8.0964685615848409E-2,{"$f":"IFERROR(SUMIFS(D_D[INV],D_D[MT],2,D_D[CAT],TA_32,D_D[EP],-1, D_D[LOC],$A79),0)","v":1387},{"$f":"IFERROR(SUMIFS(D_D[BL],D_D[MT],2,D_D[CAT],TA_32,D_D[EP],-1, D_D[LOC],$A79),0)","v":232},0.16726748377793799,{"$f":"IFERROR(SUMIFS(D_D[INV],D_D[MT],2,D_D[CAT],TA_33,D_D[EP],-1, D_D[LOC],$A79),0)","v":287},{"$f":"IFERROR(SUMIFS(D_D[BL],D_D[MT],2,D_D[CAT],TA_33,D_D[EP],-1, D_D[LOC],$A79),0)","v":252},0.87804878048780488,{"$f":"IFERROR(SUMIFS(D_D[INV],D_D[MT],2,D_D[CAT],TA_34,D_D[EP],-1, D_D[LOC],$A79),0)","v":0},{"$f":"IFERROR(SUMIFS(D_D[BL],D_D[MT],2,D_D[CAT],TA_34,D_D[EP],-1, D_D[LOC],$A79),0)","v":0},"0%",{"$f":"IFERROR(SUMIFS(D_D[INV],D_D[MT],2,D_D[CAT],TA_35,D_D[EP],-1, D_D[LOC],$A79),0)","v":0},{"$f":"IFERROR(SUMIFS(D_D[INV],D_D[MT],2,D_D[CAT],TA_36,D_D[EP],-1, D_D[LOC],$A79),0)","v":947},{"$f":"IFERROR(SUMIFS(D_D[INV],D_D[MT],7,D_D[CAT],2,D_D[EP],TA_30, D_D[LOC],$A79),0)","v":0}]
[-1,"Pension Other",{"$f":"IFERROR(SUMIFS(D_D[INV],D_D[MT],1,D_D[CAT],TA_30,D_D[EP],-1, D_D[LOC],$A80),0)","v":2620},{"$f":"IFERROR(SUMIFS(D_D[ADP],D_D[MT],1,D_D[CAT],TA_30,D_D[EP],-1, D_D[LOC],$A80),0)","v":73.48},{"$f":"IFERROR(SUMIFS(D_D[INV],D_D[MT],2,D_D[CAT],TA_31,D_D[EP],-1, D_D[LOC],$A80),0)","v":12466},{"$f":"IFERROR(SUMIFS(D_D[BL],D_D[MT],2,D_D[CAT],TA_31,D_D[EP],-1, D_D[LOC],$A80),0)","v":893},7.1634846783250439E-2,{"$f":"IFERROR(SUMIFS(D_D[INV],D_D[MT],2,D_D[CAT],TA_32,D_D[EP],-1, D_D[LOC],$A80),0)","v":2628},{"$f":"IFERROR(SUMIFS(D_D[BL],D_D[MT],2,D_D[CAT],TA_32,D_D[EP],-1, D_D[LOC],$A80),0)","v":529},0.2012937595129376,{"$f":"IFERROR(SUMIFS(D_D[INV],D_D[MT],2,D_D[CAT],TA_33,D_D[EP],-1, D_D[LOC],$A80),0)","v":4156},{"$f":"IFERROR(SUMIFS(D_D[BL],D_D[MT],2,D_D[CAT],TA_33,D_D[EP],-1, D_D[LOC],$A80),0)","v":3},7.2184793070259861E-4,{"$f":"IFERROR(SUMIFS(D_D[INV],D_D[MT],2,D_D[CAT],TA_34,D_D[EP],-1, D_D[LOC],$A80),0)","v":118},{"$f":"IFERROR(SUMIFS(D_D[BL],D_D[MT],2,D_D[CAT],TA_34,D_D[EP],-1, D_D[LOC],$A80),0)","v":18},0.15254237288135594,{"$f":"IFERROR(SUMIFS(D_D[INV],D_D[MT],2,D_D[CAT],TA_35,D_D[EP],-1, D_D[LOC],$A80),0)","v":0},{"$f":"IFERROR(SUMIFS(D_D[INV],D_D[MT],2,D_D[CAT],TA_36,D_D[EP],-1, D_D[LOC],$A80),0)","v":0},{"$f":"IFERROR(SUMIFS(D_D[INV],D_D[MT],7,D_D[CAT],2,D_D[EP],TA_30, D_D[LOC],$A80),0)","v":336}]